{"text_format":"1","workbook":"xlsx","n_sheets":4,"sheets":["Turma","Relatório","Score Z","Auxiliar"],"not_rendered":{"charts":0,"images":3,"macros":1,"external_links":0,"defined_names":0,"comments":1,"pivot_tables":0},"unopened":[],"bounds":{"document_bytes":16777216,"sheet_cells":100000,"rows_first":2000,"rows_last":500,"rows_between":2000,"halvings":0,"cell_chars":16384,"cell_head_chars":4096},"cells_cut":0,"cells_raw":0,"read":"whole","date_system":"1900"}

{"sheet":"Turma","index":0,"n_rows":53,"n_cols":13,"rows_kept":53,"cut":false,"hidden":false,"merged":[]}
[null,"Ano:",null,null,"Média:",{"$f":"IF(COUNTA(F4:F53)>0,AVERAGE(F4:F53),\"\")","v":""},{"$f":"IF(COUNTA(G4:G53)>0,AVERAGE(G4:G53),\"\")","v":""},"","","","","",""]
[{"$f":"COUNTIF(B4:B53,\"x\")","v":0},"Turma:",null,null,"Desvio-padrão:",{"$f":"IF(COUNTA(F4:F53)>0,_xlfn.STDEV.P(F4:F53),\"\")","v":""},{"$f":"IF(COUNTA(G4:G53)>0,_xlfn.STDEV.P(G4:G53),\"\")","v":""},"","","","","",""]
["ID Aluno",{"$f":"_xlfn.CONCAT(\"Ver: \",COUNTIF(B4:B53,\"x\"))","v":"Ver: 0"},"Nome","Idade","Data","Corrida/marcha da milha","Corrida vaivém/PACER","Força de preensão","Salto horizontal","Corrida 50 jardas/45.7m","Corrida vaivém/agilidade ","Sentar e alcançar","Equlíbrio"]
[1]
[{"$f":"A4+1","v":2}]
[{"$f":"A5+1","v":3}]
[4]
[5]
[6]
[7]
[8]
[9]
[10]
[11]
[12]
{"$rows_left_out":39}
{"sheet":"Relatório","index":1,"n_rows":57,"n_cols":8,"rows_kept":57,"cut":false,"hidden":false,"merged":[]}
["RELATÓRIO INDIVIDUAL DA APTIDÃO FÍSICA"]
[{"$f":"IF(Turma!A2=1,VLOOKUP(\"x\",Turma!B$4:M$53,2,0),\"\")","v":""}]
[{"$f":"IF(Turma!A2=1,_xlfn.CONCAT(TEXT(VLOOKUP(\"x\",Turma!B$4:M$53,4,0),\"dd-mm-aaaa\"),\" | \",Turma!C1,\"º ano\",\" | \",Turma!C2),\"\")","v":""}]
[]
[null,"Resultado",null,"Média ",null,"Mínimo",null,"Máximo"]
[null,"da criança",null,"da turma",null,"da turma",null,"da turma"]
["APTIDÃO CARDIORRESPIRATÓRIA"]
[{"$f":"IF(Turma!A2=1,IFERROR(VLOOKUP(1,Auxiliar!L3:Q4,2,0),\"\"),\"\")","v":""},{"$f":"IF(Turma!A2=1,IFERROR(VLOOKUP(1,Auxiliar!L3:Q4,3,0),0),0)","v":0},null,{"$f":"IF(Turma!A2=1,IFERROR(VLOOKUP(1,Auxiliar!L3:Q4,4,0),0),0)","v":0},null,{"$f":"IF(Turma!A2=1,IFERROR(VLOOKUP(1,Auxiliar!L3:Q4,5,0),0),0)","v":0},null,{"$f":"IF(Turma!A2=1,IFERROR(VLOOKUP(1,Auxiliar!L3:Q4,6,0),0),0)","v":0}]
[]
[{"$f":"IF(Turma!A2=1,IFERROR(VLOOKUP(2,Auxiliar!L3:Q4,2,0),\"\"),\"\")","v":""},{"$f":"IF(Turma!A2=1,IFERROR(VLOOKUP(2,Auxiliar!L3:Q4,3,0),0),0)","v":0},null,{"$f":"IF(Turma!A2=1,IFERROR(VLOOKUP(2,Auxiliar!L3:Q4,4,0),0),0)","v":0},null,{"$f":"IF(Turma!A2=1,IFERROR(VLOOKUP(2,Auxiliar!L3:Q4,5,0),0),0)","v":0},null,{"$f":"IF(Turma!A2=1,IFERROR(VLOOKUP(2,Auxiliar!L3:Q4,6,0),0),0)","v":0}]
[]
["APTIDÃO MUSCULOESQUELÉTICA"]
[{"$f":"IF(Turma!A2=1,IFERROR(VLOOKUP(1,Auxiliar!L5:Q6,2,0),\"\"),\"\")","v":""},{"$f":"IF(Turma!A2=1,IFERROR(VLOOKUP(1,Auxiliar!L5:Q6,3,0),0),0)","v":0},null,{"$f":"IF(Turma!A2=1,IFERROR(VLOOKUP(1,Auxiliar!L5:Q6,4,0),0),0)","v":0},null,{"$f":"IF(Turma!A2=1,IFERROR(VLOOKUP(1,Auxiliar!L5:Q6,5,0),0),0)","v":0},null,{"$f":"IF(Turma!A2=1,IFERROR(VLOOKUP(1,Auxiliar!L5:Q6,6,0),0),0)","v":0}]
[]
[{"$f":"IF(Turma!A2=1,IFERROR(VLOOKUP(2,Auxiliar!L5:Q6,2,0),\"\"),\"\")","v":""},{"$f":"IF(Turma!A2=1,IFERROR(VLOOKUP(2,Auxiliar!L5:Q6,3,0),0),0)","v":0},null,{"$f":"IF(Turma!A2=1,IFERROR(VLOOKUP(2,Auxiliar!L5:Q6,4,0),0),0)","v":0},null,{"$f":"IF(Turma!A2=1,IFERROR(VLOOKUP(2,Auxiliar!L5:Q6,5,0),0),0)","v":0},null,{"$f":"IF(Turma!A2=1,IFERROR(VLOOKUP(2,Auxiliar!L5:Q6,6,0),0),0)","v":0}]
{"$rows_left_out":43}
{"sheet":"Score Z","index":2,"n_rows":53,"n_cols":12,"rows_kept":53,"cut":false,"hidden":false,"merged":[]}
[]
[]
[{"$f":"Turma!B3","v":"Ver: 0"},{"$f":"Turma!A3","v":"ID Aluno"},{"$f":"Turma!C3","v":"Nome"},{"$f":"Turma!D3","v":"Idade"},{"$f":"Turma!F3","v":"Corrida/marcha da milha"},{"$f":"Turma!G3","v":"Corrida vaivém/PACER"},{"$f":"Turma!H3","v":"Força de preensão"},{"$f":"Turma!I3","v":"Salto horizontal"},{"$f":"Turma!J3","v":"Corrida 50 jardas/45.7m"},{"$f":"Turma!K3","v":"Corrida vaivém/agilidade "},{"$f":"Turma!L3","v":"Sentar e alcançar"},{"$f":"Turma!M3","v":"Equlíbrio"}]
[{"$f":"IF(Turma!B4<>\"\",Turma!B4,\"\")","v":""},{"$f":"Turma!A4","v":1},{"$f":"IF(Turma!C4<>\"\",Turma!C4,\"\")","v":""},{"$f":"IF(Turma!D4<>\"\",Turma!D4,\"\")","v":""},{"$f":"IF(AND(Turma!F$2<>\"\",Turma!F4<>\"\"),(Turma!F4-Turma!F$1)/Turma!F$2,\"\")","v":""},{"$f":"IF(AND(Turma!G$2<>\"\",Turma!G4<>\"\"),(Turma!G4-Turma!G$1)/Turma!G$2,\"\")","v":""},{"$f":"IF(AND(Turma!H$2<>\"\",Turma!H4<>\"\"),(Turma!H4-Turma!H$1)/Turma!H$2,\"\")","v":""},{"$f":"IF(AND(Turma!I$2<>\"\",Turma!I4<>\"\"),(Turma!I4-Turma!I$1)/Turma!I$2,\"\")","v":""},{"$f":"IF(AND(Turma!J$2<>\"\",Turma!J4<>\"\"),(Turma!J4-Turma!J$1)/Turma!J$2,\"\")","v":""},{"$f":"IF(AND(Turma!K$2<>\"\",Turma!K4<>\"\"),(Turma!K4-Turma!K$1)/Turma!K$2,\"\")","v":""},{"$f":"IF(AND(Turma!L$2<>\"\",Turma!L4<>\"\"),(Turma!L4-Turma!L$1)/Turma!L$2,\"\")","v":""},{"$f":"IF(AND(Turma!M$2<>\"\",Turma!M4<>\"\"),(Turma!M4-Turma!M$1)/Turma!M$2,\"\")","v":""}]
[{"$f":"IF(Turma!B5<>\"\",Turma!B5,\"\")","v":""},{"$f":"Turma!A5","v":2},{"$f":"IF(Turma!C5<>\"\",Turma!C5,\"\")","v":""},{"$f":"IF(Turma!D5<>\"\",Turma!D5,\"\")","v":""},{"$f":"IF(AND(Turma!F$2<>\"\",Turma!F5<>\"\"),(Turma!F5-Turma!F$1)/Turma!F$2,\"\")","v":""},{"$f":"IF(AND(Turma!G$2<>\"\",Turma!G5<>\"\"),(Turma!G5-Turma!G$1)/Turma!G$2,\"\")","v":""},{"$f":"IF(AND(Turma!H$2<>\"\",Turma!H5<>\"\"),(Turma!H5-Turma!H$1)/Turma!H$2,\"\")","v":""},{"$f":"IF(AND(Turma!I$2<>\"\",Turma!I5<>\"\"),(Turma!I5-Turma!I$1)/Turma!I$2,\"\")","v":""},{"$f":"IF(AND(Turma!J$2<>\"\",Turma!J5<>\"\"),(Turma!J5-Turma!J$1)/Turma!J$2,\"\")","v":""},{"$f":"IF(AND(Turma!K$2<>\"\",Turma!K5<>\"\"),(Turma!K5-Turma!K$1)/Turma!K$2,\"\")","v":""},{"$f":"IF(AND(Turma!L$2<>\"\",Turma!L5<>\"\"),(Turma!L5-Turma!L$1)/Turma!L$2,\"\")","v":""},{"$f":"IF(AND(Turma!M$2<>\"\",Turma!M5<>\"\"),(Turma!M5-Turma!M$1)/Turma!M$2,\"\")","v":""}]
[{"$f":"IF(Turma!B6<>\"\",Turma!B6,\"\")","v":""},{"$f":"Turma!A6","v":3},{"$f":"IF(Turma!C6<>\"\",Turma!C6,\"\")","v":""},{"$f":"IF(Turma!D6<>\"\",Turma!D6,\"\")","v":""},{"$f":"IF(AND(Turma!F$2<>\"\",Turma!F6<>\"\"),(Turma!F6-Turma!F$1)/Turma!F$2,\"\")","v":""},{"$f":"IF(AND(Turma!G$2<>\"\",Turma!G6<>\"\"),(Turma!G6-Turma!G$1)/Turma!G$2,\"\")","v":""},{"$f":"IF(AND(Turma!H$2<>\"\",Turma!H6<>\"\"),(Turma!H6-Turma!H$1)/Turma!H$2,\"\")","v":""},{"$f":"IF(AND(Turma!I$2<>\"\",Turma!I6<>\"\"),(Turma!I6-Turma!I$1)/Turma!I$2,\"\")","v":""},{"$f":"IF(AND(Turma!J$2<>\"\",Turma!J6<>\"\"),(Turma!J6-Turma!J$1)/Turma!J$2,\"\")","v":""},{"$f":"IF(AND(Turma!K$2<>\"\",Turma!K6<>\"\"),(Turma!K6-Turma!K$1)/Turma!K$2,\"\")","v":""},{"$f":"IF(AND(Turma!L$2<>\"\",Turma!L6<>\"\"),(Turma!L6-Turma!L$1)/Turma!L$2,\"\")","v":""},{"$f":"IF(AND(Turma!M$2<>\"\",Turma!M6<>\"\"),(Turma!M6-Turma!M$1)/Turma!M$2,\"\")","v":""}]
[{"$f":"IF(Turma!B7<>\"\",Turma!B7,\"\")","v":""},{"$f":"Turma!A7","v":4},{"$f":"IF(Turma!C7<>\"\",Turma!C7,\"\")","v":""},{"$f":"IF(Turma!D7<>\"\",Turma!D7,\"\")","v":""},{"$f":"IF(AND(Turma!F$2<>\"\",Turma!F7<>\"\"),(Turma!F7-Turma!F$1)/Turma!F$2,\"\")","v":""},{"$f":"IF(AND(Turma!G$2<>\"\",Turma!G7<>\"\"),(Turma!G7-Turma!G$1)/Turma!G$2,\"\")","v":""},{"$f":"IF(AND(Turma!H$2<>\"\",Turma!H7<>\"\"),(Turma!H7-Turma!H$1)/Turma!H$2,\"\")","v":""},{"$f":"IF(AND(Turma!I$2<>\"\",Turma!I7<>\"\"),(Turma!I7-Turma!I$1)/Turma!I$2,\"\")","v":""},{"$f":"IF(AND(Turma!J$2<>\"\",Turma!J7<>\"\"),(Turma!J7-Turma!J$1)/Turma!J$2,\"\")","v":""},{"$f":"IF(AND(Turma!K$2<>\"\",Turma!K7<>\"\"),(Turma!K7-Turma!K$1)/Turma!K$2,\"\")","v":""},{"$f":"IF(AND(Turma!L$2<>\"\",Turma!L7<>\"\"),(Turma!L7-Turma!L$1)/Turma!L$2,\"\")","v":""},{"$f":"IF(AND(Turma!M$2<>\"\",Turma!M7<>\"\"),(Turma!M7-Turma!M$1)/Turma!M$2,\"\")","v":""}]
[{"$f":"IF(Turma!B8<>\"\",Turma!B8,\"\")","v":""},{"$f":"Turma!A8","v":5},{"$f":"IF(Turma!C8<>\"\",Turma!C8,\"\")","v":""},{"$f":"IF(Turma!D8<>\"\",Turma!D8,\"\")","v":""},{"$f":"IF(AND(Turma!F$2<>\"\",Turma!F8<>\"\"),(Turma!F8-Turma!F$1)/Turma!F$2,\"\")","v":""},{"$f":"IF(AND(Turma!G$2<>\"\",Turma!G8<>\"\"),(Turma!G8-Turma!G$1)/Turma!G$2,\"\")","v":""},{"$f":"IF(AND(Turma!H$2<>\"\",Turma!H8<>\"\"),(Turma!H8-Turma!H$1)/Turma!H$2,\"\")","v":""},{"$f":"IF(AND(Turma!I$2<>\"\",Turma!I8<>\"\"),(Turma!I8-Turma!I$1)/Turma!I$2,\"\")","v":""},{"$f":"IF(AND(Turma!J$2<>\"\",Turma!J8<>\"\"),(Turma!J8-Turma!J$1)/Turma!J$2,\"\")","v":""},{"$f":"IF(AND(Turma!K$2<>\"\",Turma!K8<>\"\"),(Turma!K8-Turma!K$1)/Turma!K$2,\"\")","v":""},{"$f":"IF(AND(Turma!L$2<>\"\",Turma!L8<>\"\"),(Turma!L8-Turma!L$1)/Turma!L$2,\"\")","v":""},{"$f":"IF(AND(Turma!M$2<>\"\",Turma!M8<>\"\"),(Turma!M8-Turma!M$1)/Turma!M$2,\"\")","v":""}]
[{"$f":"IF(Turma!B9<>\"\",Turma!B9,\"\")","v":""},{"$f":"Turma!A9","v":6},{"$f":"IF(Turma!C9<>\"\",Turma!C9,\"\")","v":""},{"$f":"IF(Turma!D9<>\"\",Turma!D9,\"\")","v":""},{"$f":"IF(AND(Turma!F$2<>\"\",Turma!F9<>\"\"),(Turma!F9-Turma!F$1)/Turma!F$2,\"\")","v":""},{"$f":"IF(AND(Turma!G$2<>\"\",Turma!G9<>\"\"),(Turma!G9-Turma!G$1)/Turma!G$2,\"\")","v":""},{"$f":"IF(AND(Turma!H$2<>\"\",Turma!H9<>\"\"),(Turma!H9-Turma!H$1)/Turma!H$2,\"\")","v":""},{"$f":"IF(AND(Turma!I$2<>\"\",Turma!I9<>\"\"),(Turma!I9-Turma!I$1)/Turma!I$2,\"\")","v":""},{"$f":"IF(AND(Turma!J$2<>\"\",Turma!J9<>\"\"),(Turma!J9-Turma!J$1)/Turma!J$2,\"\")","v":""},{"$f":"IF(AND(Turma!K$2<>\"\",Turma!K9<>\"\"),(Turma!K9-Turma!K$1)/Turma!K$2,\"\")","v":""},{"$f":"IF(AND(Turma!L$2<>\"\",Turma!L9<>\"\"),(Turma!L9-Turma!L$1)/Turma!L$2,\"\")","v":""},{"$f":"IF(AND(Turma!M$2<>\"\",Turma!M9<>\"\"),(Turma!M9-Turma!M$1)/Turma!M$2,\"\")","v":""}]
[{"$f":"IF(Turma!B10<>\"\",Turma!B10,\"\")","v":""},{"$f":"Turma!A10","v":7},{"$f":"IF(Turma!C10<>\"\",Turma!C10,\"\")","v":""},{"$f":"IF(Turma!D10<>\"\",Turma!D10,\"\")","v":""},{"$f":"IF(AND(Turma!F$2<>\"\",Turma!F10<>\"\"),(Turma!F10-Turma!F$1)/Turma!F$2,\"\")","v":""},{"$f":"IF(AND(Turma!G$2<>\"\",Turma!G10<>\"\"),(Turma!G10-Turma!G$1)/Turma!G$2,\"\")","v":""},{"$f":"IF(AND(Turma!H$2<>\"\",Turma!H10<>\"\"),(Turma!H10-Turma!H$1)/Turma!H$2,\"\")","v":""},{"$f":"IF(AND(Turma!I$2<>\"\",Turma!I10<>\"\"),(Turma!I10-Turma!I$1)/Turma!I$2,\"\")","v":""},{"$f":"IF(AND(Turma!J$2<>\"\",Turma!J10<>\"\"),(Turma!J10-Turma!J$1)/Turma!J$2,\"\")","v":""},{"$f":"IF(AND(Turma!K$2<>\"\",Turma!K10<>\"\"),(Turma!K10-Turma!K$1)/Turma!K$2,\"\")","v":""},{"$f":"IF(AND(Turma!L$2<>\"\",Turma!L10<>\"\"),(Turma!L10-Turma!L$1)/Turma!L$2,\"\")","v":""},{"$f":"IF(AND(Turma!M$2<>\"\",Turma!M10<>\"\"),(Turma!M10-Turma!M$1)/Turma!M$2,\"\")","v":""}]
[{"$f":"IF(Turma!B11<>\"\",Turma!B11,\"\")","v":""},{"$f":"Turma!A11","v":8},{"$f":"IF(Turma!C11<>\"\",Turma!C11,\"\")","v":""},{"$f":"IF(Turma!D11<>\"\",Turma!D11,\"\")","v":""},{"$f":"IF(AND(Turma!F$2<>\"\",Turma!F11<>\"\"),(Turma!F11-Turma!F$1)/Turma!F$2,\"\")","v":""},{"$f":"IF(AND(Turma!G$2<>\"\",Turma!G11<>\"\"),(Turma!G11-Turma!G$1)/Turma!G$2,\"\")","v":""},{"$f":"IF(AND(Turma!H$2<>\"\",Turma!H11<>\"\"),(Turma!H11-Turma!H$1)/Turma!H$2,\"\")","v":""},{"$f":"IF(AND(Turma!I$2<>\"\",Turma!I11<>\"\"),(Turma!I11-Turma!I$1)/Turma!I$2,\"\")","v":""},{"$f":"IF(AND(Turma!J$2<>\"\",Turma!J11<>\"\"),(Turma!J11-Turma!J$1)/Turma!J$2,\"\")","v":""},{"$f":"IF(AND(Turma!K$2<>\"\",Turma!K11<>\"\"),(Turma!K11-Turma!K$1)/Turma!K$2,\"\")","v":""},{"$f":"IF(AND(Turma!L$2<>\"\",Turma!L11<>\"\"),(Turma!L11-Turma!L$1)/Turma!L$2,\"\")","v":""},{"$f":"IF(AND(Turma!M$2<>\"\",Turma!M11<>\"\"),(Turma!M11-Turma!M$1)/Turma!M$2,\"\")","v":""}]
[{"$f":"IF(Turma!B12<>\"\",Turma!B12,\"\")","v":""},{"$f":"Turma!A12","v":9},{"$f":"IF(Turma!C12<>\"\",Turma!C12,\"\")","v":""},{"$f":"IF(Turma!D12<>\"\",Turma!D12,\"\")","v":""},{"$f":"IF(AND(Turma!F$2<>\"\",Turma!F12<>\"\"),(Turma!F12-Turma!F$1)/Turma!F$2,\"\")","v":""},{"$f":"IF(AND(Turma!G$2<>\"\",Turma!G12<>\"\"),(Turma!G12-Turma!G$1)/Turma!G$2,\"\")","v":""},{"$f":"IF(AND(Turma!H$2<>\"\",Turma!H12<>\"\"),(Turma!H12-Turma!H$1)/Turma!H$2,\"\")","v":""},{"$f":"IF(AND(Turma!I$2<>\"\",Turma!I12<>\"\"),(Turma!I12-Turma!I$1)/Turma!I$2,\"\")","v":""},{"$f":"IF(AND(Turma!J$2<>\"\",Turma!J12<>\"\"),(Turma!J12-Turma!J$1)/Turma!J$2,\"\")","v":""},{"$f":"IF(AND(Turma!K$2<>\"\",Turma!K12<>\"\"),(Turma!K12-Turma!K$1)/Turma!K$2,\"\")","v":""},{"$f":"IF(AND(Turma!L$2<>\"\",Turma!L12<>\"\"),(Turma!L12-Turma!L$1)/Turma!L$2,\"\")","v":""},{"$f":"IF(AND(Turma!M$2<>\"\",Turma!M12<>\"\"),(Turma!M12-Turma!M$1)/Turma!M$2,\"\")","v":""}]
[{"$f":"IF(Turma!B13<>\"\",Turma!B13,\"\")","v":""},{"$f":"Turma!A13","v":10},{"$f":"IF(Turma!C13<>\"\",Turma!C13,\"\")","v":""},{"$f":"IF(Turma!D13<>\"\",Turma!D13,\"\")","v":""},{"$f":"IF(AND(Turma!F$2<>\"\",Turma!F13<>\"\"),(Turma!F13-Turma!F$1)/Turma!F$2,\"\")","v":""},{"$f":"IF(AND(Turma!G$2<>\"\",Turma!G13<>\"\"),(Turma!G13-Turma!G$1)/Turma!G$2,\"\")","v":""},{"$f":"IF(AND(Turma!H$2<>\"\",Turma!H13<>\"\"),(Turma!H13-Turma!H$1)/Turma!H$2,\"\")","v":""},{"$f":"IF(AND(Turma!I$2<>\"\",Turma!I13<>\"\"),(Turma!I13-Turma!I$1)/Turma!I$2,\"\")","v":""},{"$f":"IF(AND(Turma!J$2<>\"\",Turma!J13<>\"\"),(Turma!J13-Turma!J$1)/Turma!J$2,\"\")","v":""},{"$f":"IF(AND(Turma!K$2<>\"\",Turma!K13<>\"\"),(Turma!K13-Turma!K$1)/Turma!K$2,\"\")","v":""},{"$f":"IF(AND(Turma!L$2<>\"\",Turma!L13<>\"\"),(Turma!L13-Turma!L$1)/Turma!L$2,\"\")","v":""},{"$f":"IF(AND(Turma!M$2<>\"\",Turma!M13<>\"\"),(Turma!M13-Turma!M$1)/Turma!M$2,\"\")","v":""}]
[{"$f":"IF(Turma!B14<>\"\",Turma!B14,\"\")","v":""},{"$f":"Turma!A14","v":11},{"$f":"IF(Turma!C14<>\"\",Turma!C14,\"\")","v":""},{"$f":"IF(Turma!D14<>\"\",Turma!D14,\"\")","v":""},{"$f":"IF(AND(Turma!F$2<>\"\",Turma!F14<>\"\"),(Turma!F14-Turma!F$1)/Turma!F$2,\"\")","v":""},{"$f":"IF(AND(Turma!G$2<>\"\",Turma!G14<>\"\"),(Turma!G14-Turma!G$1)/Turma!G$2,\"\")","v":""},{"$f":"IF(AND(Turma!H$2<>\"\",Turma!H14<>\"\"),(Turma!H14-Turma!H$1)/Turma!H$2,\"\")","v":""},{"$f":"IF(AND(Turma!I$2<>\"\",Turma!I14<>\"\"),(Turma!I14-Turma!I$1)/Turma!I$2,\"\")","v":""},{"$f":"IF(AND(Turma!J$2<>\"\",Turma!J14<>\"\"),(Turma!J14-Turma!J$1)/Turma!J$2,\"\")","v":""},{"$f":"IF(AND(Turma!K$2<>\"\",Turma!K14<>\"\"),(Turma!K14-Turma!K$1)/Turma!K$2,\"\")","v":""},{"$f":"IF(AND(Turma!L$2<>\"\",Turma!L14<>\"\"),(Turma!L14-Turma!L$1)/Turma!L$2,\"\")","v":""},{"$f":"IF(AND(Turma!M$2<>\"\",Turma!M14<>\"\"),(Turma!M14-Turma!M$1)/Turma!M$2,\"\")","v":""}]
[{"$f":"IF(Turma!B15<>\"\",Turma!B15,\"\")","v":""},{"$f":"Turma!A15","v":12},{"$f":"IF(Turma!C15<>\"\",Turma!C15,\"\")","v":""},{"$f":"IF(Turma!D15<>\"\",Turma!D15,\"\")","v":""},{"$f":"IF(AND(Turma!F$2<>\"\",Turma!F15<>\"\"),(Turma!F15-Turma!F$1)/Turma!F$2,\"\")","v":""},{"$f":"IF(AND(Turma!G$2<>\"\",Turma!G15<>\"\"),(Turma!G15-Turma!G$1)/Turma!G$2,\"\")","v":""},{"$f":"IF(AND(Turma!H$2<>\"\",Turma!H15<>\"\"),(Turma!H15-Turma!H$1)/Turma!H$2,\"\")","v":""},{"$f":"IF(AND(Turma!I$2<>\"\",Turma!I15<>\"\"),(Turma!I15-Turma!I$1)/Turma!I$2,\"\")","v":""},{"$f":"IF(AND(Turma!J$2<>\"\",Turma!J15<>\"\"),(Turma!J15-Turma!J$1)/Turma!J$2,\"\")","v":""},{"$f":"IF(AND(Turma!K$2<>\"\",Turma!K15<>\"\"),(Turma!K15-Turma!K$1)/Turma!K$2,\"\")","v":""},{"$f":"IF(AND(Turma!L$2<>\"\",Turma!L15<>\"\"),(Turma!L15-Turma!L$1)/Turma!L$2,\"\")","v":""},{"$f":"IF(AND(Turma!M$2<>\"\",Turma!M15<>\"\"),(Turma!M15-Turma!M$1)/Turma!M$2,\"\")","v":""}]
{"$rows_left_out":39}
{"sheet":"Auxiliar","index":3,"n_rows":21,"n_cols":17,"rows_kept":21,"cut":false,"hidden":true,"merged":[]}
["Número","Ordem","Teste","Criança","Média","Mínimo","Máximo","Score Z","Nome Gráfico","Dpadrão","Grupo","Ordem Resumo","Nome","Criança","Média","Mínimo","Máximo"]
[null,0]
[{"$f":"COUNT(Turma!F4:F53)","v":0},{"$f":"IF(A3>0,B2+1,B2)","v":0},"Corrida/marcha da milha (minutos)",{"$f":"IF(AND(Turma!$A$2=1,B3=B2+1),VLOOKUP(\"x\",Turma!$B$4:$M$53,5,0),\"\")","v":""},{"$f":"IF(B3=B2+1,Turma!$F$1,\"\")","v":""},{"$f":"IF(AND(Turma!$A$2=1,B3=B2+1),SMALL(Turma!$F$4:$F$53,1),\"\")","v":""},{"$f":"IF(AND(Turma!$A$2=1,B3=B2+1),LARGE(Turma!$F$4:$F$53,1),\"\")","v":""},{"$f":"IF(AND(Turma!$A$2=1,B3=B2+1),VLOOKUP(\"x\",'Score Z'!$A$4:$L$53,5,0),\"\")","v":""},"Corrida/marcha da milha",{"$f":"IF(B3=B2+1,Turma!$F$2,\"\")","v":""},"APTIDÃO CARDIORRESPIRATÓRIA",{"$f":"IF(K3<>K2,IF(A3>0,1,0),IF(A3>0,L2+1,L2))","v":0},{"$f":"C3","v":"Corrida/marcha da milha (minutos)"},{"$f":"D3","v":""},{"$f":"E3","v":""},"",""]
[{"$f":"COUNT(Turma!G4:G53)","v":0},{"$f":"IF(A4>0,B3+1,B3)","v":0},"Corrida vaivém/PACER (percursos)",{"$f":"IF(AND(Turma!$A$2=1,B4=B3+1),VLOOKUP(\"x\",Turma!$B$4:$M$53,6,0),\"\")","v":""},{"$f":"IF(B4=B3+1,Turma!$G$1,\"\")","v":""},{"$f":"IF(AND(Turma!$A$2=1,B4=B3+1),SMALL(Turma!$G$4:$G$53,1),\"\")","v":""},{"$f":"IF(AND(Turma!$A$2=1,B4=B3+1),LARGE(Turma!$G$4:$G$53,1),\"\")","v":""},{"$f":"IF(AND(Turma!$A$2=1,B4=B3+1),VLOOKUP(\"x\",'Score Z'!$A$4:$L$53,6,0),\"\")","v":""},"Corrida vaivém/PACER",{"$f":"IF(B4=B3+1,Turma!$G$2,\"\")","v":""},"APTIDÃO CARDIORRESPIRATÓRIA",{"$f":"IF(K4<>K3,IF(A4>0,1,0),IF(A4>0,L3+1,L3))","v":0},{"$f":"C4","v":"Corrida vaivém/PACER (percursos)"},{"$f":"D4","v":""},{"$f":"E4","v":""},{"$f":"F4","v":""},{"$f":"G4","v":""}]
[{"$f":"COUNT(Turma!H4:H53)","v":0},0,"Força preensão (kgf)",{"$f":"IF(AND(Turma!$A$2=1,B5=B4+1),VLOOKUP(\"x\",Turma!$B$4:$M$53,7,0),\"\")","v":""},{"$f":"IF(B5=B4+1,Turma!$H$1,\"\")","v":""},{"$f":"IF(AND(Turma!$A$2=1,B5=B4+1),SMALL(Turma!$H$4:$H$53,1),\"\")","v":""},{"$f":"IF(AND(Turma!$A$2=1,B5=B4+1),LARGE(Turma!$H$4:$H$53,1),\"\")","v":""},{"$f":"IF(AND(Turma!$A$2=1,B5=B4+1),VLOOKUP(\"x\",'Score Z'!$A$4:$L$53,7,0),\"\")","v":""},"Força preensão",{"$f":"IF(B5=B4+1,Turma!$H$2,\"\")","v":""},"APTIDÃO MUSCULOESQUELÉTICA",0,"Força preensão (kgf)","","","",""]
[{"$f":"COUNT(Turma!I4:I53)","v":0},0,"Salto horizontal (centímetros)",{"$f":"IF(AND(Turma!$A$2=1,B6=B5+1),VLOOKUP(\"x\",Turma!$B$4:$M$53,8,0),\"\")","v":""},{"$f":"IF(B6=B5+1,Turma!$I$1,\"\")","v":""},{"$f":"IF(AND(Turma!$A$2=1,B6=B5+1),SMALL(Turma!$I$4:$I$53,1),\"\")","v":""},{"$f":"IF(AND(Turma!$A$2=1,B6=B5+1),LARGE(Turma!$I$4:$I$53,1),\"\")","v":""},{"$f":"IF(AND(Turma!$A$2=1,B6=B5+1),VLOOKUP(\"x\",'Score Z'!$A$4:$L$53,8,0),\"\")","v":""},"Salto horizontal",{"$f":"IF(B6=B5+1,Turma!$I$2,\"\")","v":""},"APTIDÃO MUSCULOESQUELÉTICA",0,"Salto horizontal (centímetros)","","","",""]
[{"$f":"COUNT(Turma!J4:J53)","v":0},0,"Corrida 50 jardas (segundos)",{"$f":"IF(AND(Turma!$A$2=1,B7=B6+1),VLOOKUP(\"x\",Turma!$B$4:$M$53,9,0),\"\")","v":""},{"$f":"IF(B7=B6+1,Turma!$J$1,\"\")","v":""},{"$f":"IF(AND(Turma!$A$2=1,B7=B6+1),SMALL(Turma!$J$4:$J$53,1),\"\")","v":""},{"$f":"IF(AND(Turma!$A$2=1,B7=B6+1),LARGE(Turma!$J$4:$J$53,1),\"\")","v":""},{"$f":"IF(AND(Turma!$A$2=1,B7=B6+1),VLOOKUP(\"x\",'Score Z'!$A$4:$L$53,9,0),\"\")","v":""},"Corrida 50 jardas",{"$f":"IF(B7=B6+1,Turma!$J$2,\"\")","v":""},"APTIDÃO MOTORA",0,"Corrida 50 jardas (segundos)","","","",""]
[{"$f":"COUNT(Turma!K4:K53)","v":0},0,"Corrida vaivém/agilidade (segundos)",{"$f":"IF(AND(Turma!$A$2=1,B8=B7+1),VLOOKUP(\"x\",Turma!$B$4:$M$53,10,0),\"\")","v":""},{"$f":"IF(B8=B7+1,Turma!$K$1,\"\")","v":""},{"$f":"IF(AND(Turma!$A$2=1,B8=B7+1),SMALL(Turma!$K$4:$K$53,1),\"\")","v":""},{"$f":"IF(AND(Turma!$A$2=1,B8=B7+1),LARGE(Turma!$K$4:$K$53,1),\"\")","v":""},{"$f":"IF(AND(Turma!$A$2=1,B8=B7+1),VLOOKUP(\"x\",'Score Z'!$A$4:$L$53,10,0),\"\")","v":""},"Corrida vaivém/agilidade",{"$f":"IF(B8=B7+1,Turma!$K$2,\"\")","v":""},"APTIDÃO MOTORA",0,"Corrida vaivém/agilidade (segundos)","","","",""]
[{"$f":"COUNT(Turma!L4:L53)","v":0},0,"Sentar e alcançar (centímetros)",{"$f":"IF(AND(Turma!$A$2=1,B9=B8+1),VLOOKUP(\"x\",Turma!$B$4:$M$53,11,0),\"\")","v":""},{"$f":"IF(B9=B8+1,Turma!$L$1,\"\")","v":""},{"$f":"IF(AND(Turma!$A$2=1,B9=B8+1),SMALL(Turma!$L$4:$L$53,1),\"\")","v":""},{"$f":"IF(AND(Turma!$A$2=1,B9=B8+1),LARGE(Turma!$L$4:$L$53,1),\"\")","v":""},{"$f":"IF(AND(Turma!$A$2=1,B9=B8+1),VLOOKUP(\"x\",'Score Z'!$A$4:$L$53,11,0),\"\")","v":""},"Sentar e alcançar",{"$f":"IF(B9=B8+1,Turma!$L$2,\"\")","v":""},"APTIDÃO MOTORA",0,"Sentar e alcançar (centímetros)","","","",""]
[{"$f":"COUNT(Turma!M4:M53)","v":0},0,"Equilíbrio (número de desequilíbrios)",{"$f":"IF(AND(Turma!$A$2=1,B10=B9+1),VLOOKUP(\"x\",Turma!$B$4:$M$53,12,0),\"\")","v":""},{"$f":"IF(B10=B9+1,Turma!$M$1,\"\")","v":""},{"$f":"IF(AND(Turma!$A$2=1,B10=B9+1),SMALL(Turma!$M$4:$M$53,1),\"\")","v":""},{"$f":"IF(AND(Turma!$A$2=1,B10=B9+1),LARGE(Turma!$M$4:$M$53,1),\"\")","v":""},{"$f":"IF(AND(Turma!$A$2=1,B10=B9+1),VLOOKUP(\"x\",'Score Z'!$A$4:$L$53,12,0),\"\")","v":""},"Equilíbrio",{"$f":"IF(B10=B9+1,Turma!$M$2,\"\")","v":""},"APTIDÃO MOTORA",0,"Equilíbrio (número de desequilíbrios)","","","",""]
[]
[]
[null,null,"Dados para o gráfico","Score Z"]
[null,null,{"$f":"IF(Turma!A2=1,IFERROR(VLOOKUP(1,Auxiliar!B3:G10,2,0),\"\"),\"\")","v":""},{"$f":"IF(Turma!A2=1,IFERROR(VLOOKUP(1,Auxiliar!B3:H10,7,0),\"\"),\"\")","v":""}]
[null,null,{"$f":"IF(Turma!A2=1,IFERROR(VLOOKUP(2,Auxiliar!B3:G10,2,0),\"\"),\"\")","v":""},{"$f":"IF(Turma!A2=1,IFERROR(VLOOKUP(2,Auxiliar!B3:H10,7,0),\"\"),\"\")","v":""}]
{"$rows_left_out":6}