{"text_format":"1","workbook":"xlsx","n_sheets":10,"sheets":["iniTurma","iniRelatório","iniScore Z","fimTurma","fimRelatório","fimScore Z","profRelatório","profPorTeste","iniAuxiliar","fimAuxiliar"],"not_rendered":{"charts":0,"images":5,"macros":1,"external_links":0,"defined_names":0,"comments":2,"pivot_tables":0},"unopened":[],"bounds":{"document_bytes":16777216,"sheet_cells":100000,"rows_first":2000,"rows_last":500,"rows_between":2000,"halvings":0,"cell_chars":16384,"cell_head_chars":4096},"cells_cut":0,"cells_raw":0,"read":"whole","date_system":"1900"}

{"sheet":"iniTurma","index":0,"n_rows":53,"n_cols":9,"rows_kept":53,"cut":false,"hidden":false,"merged":[]}
[null,"Ano:",2,null,"Média:",{"$f":"IF(COUNTA(F4:F53)>0,AVERAGE(F4:F53),\"\")","v":12.5},{"$f":"IF(COUNTA(G4:G53)>0,AVERAGE(G4:G53),\"\")","v":10.166666666666666},8.9454545454545453,29.866666666666664]
[{"$f":"COUNTIF(B4:B53,\"x\")","v":1},"Turma:","A",null,"Desvio-padrão:",{"$f":"IF(COUNTA(F4:F53)>0,_xlfn.STDEV.P(F4:F53),\"\")","v":1.707825127659933},{"$f":"IF(COUNTA(G4:G53)>0,_xlfn.STDEV.P(G4:G53),\"\")","v":1.818118685772619},2.424632544367626,4.0778534658431482]
["ID Aluno",{"$f":"_xlfn.CONCAT(\"Ver: \",COUNTIF(B4:B53,\"x\"))","v":"Ver: 1"},"Nome","Idade","Data","Agilidade","Shuttle run 20m","Força de preensão","Salto horizontal"]
[1,null,"Micas",13,"2024-12-12",10,10,6,32]
[{"$f":"A4+1","v":2},null,"Tecas",12,"2024-12-12",11,9,7,38]
[{"$f":"A5+1","v":3},"x","Lecas",15,"2024-12-12",12,8,8.3000000000000007,25]
[4,null,"Becas",8,"2024-12-13",13,7,null,31]
[5,null,"Nocas",11,"2024-12-13",14,11,7,24]
[6,null,"Françoise Hardy",12,"2024-12-14",15,11,8,27]
[7,null,"Asterix",16,"2024-12-14",10,13,11.5,36]
[8,null,"Obelix",14,"2024-12-14",11,9,14.7,27]
[9,null,"Ideiafix",13,"2024-12-14",12,12,11,28]
[10,null,"Sylvie Vartan",13,"2024-12-15",13,13,7.3,31]
[11,null,"Carlos Lopes",14,"2024-12-15",14,9,8.3000000000000007,32]
[12,null,"Rosa Mota",14,"2024-12-15",15,10,9.3000000000000007,27.4]
[13]
[14]
[15]
[16]
[17]
[18]
[19]
[20]
[21]
[22]
[23]
[24]
[25]
[26]
[27]
[28]
[29]
[30]
[31]
[32]
[33]
[34]
[35]
[36]
[37]
[38]
[39]
[40]
[41]
[42]
[43]
[44]
[45]
[46]
[47]
[48]
[49]
[50]

{"sheet":"iniRelatório","index":1,"n_rows":25,"n_cols":8,"rows_kept":25,"cut":false,"hidden":false,"merged":[]}
["RELATÓRIO INDIVIDUAL PREFIT BATTERY"]
[{"$f":"IF(iniTurma!A2=1,VLOOKUP(\"x\",iniTurma!B$4:M$53,2,0),\"\")","v":"Lecas"}]
[{"$f":"IF(iniTurma!A2=1,_xlfn.CONCAT(TEXT(VLOOKUP(\"x\",iniTurma!B$4:M$53,4,0),\"dd-mm-aaaa\"),\" | \",iniTurma!C1,\"º ano\",\" | \",iniTurma!C2),\"\")","v":"12-12-2024 | 2º ano | A"}]
[]
[null,"Resultado",null,"Média ",null,"Mínimo",null,"Máximo"]
[null,"da criança",null,"da turma",null,"da turma",null,"da turma"]
["APTIDÃO MOTORA"]
[{"$f":"IF(iniTurma!A2=1,IFERROR(VLOOKUP(1,iniAuxiliar!L3:Q3,2,0),\"\"),\"\")","v":"Agilidade"},{"$f":"IF(iniTurma!A2=1,IFERROR(VLOOKUP(1,iniAuxiliar!L3:Q3,3,0),0),0)","v":12},null,{"$f":"IF(iniTurma!A2=1,IFERROR(VLOOKUP(1,iniAuxiliar!L3:Q3,4,0),0),0)","v":12.5},null,{"$f":"IF(iniTurma!A2=1,IFERROR(VLOOKUP(1,iniAuxiliar!L3:Q3,5,0),0),0)","v":10},null,{"$f":"IF(iniTurma!A2=1,IFERROR(VLOOKUP(1,iniAuxiliar!L3:Q3,6,0),0),0)","v":15}]
[]
[]
[]
["APTIDÃO CARDIORRESPIRATÓRIA"]
[{"$f":"IF(iniTurma!A2=1,IFERROR(VLOOKUP(1,iniAuxiliar!L4:Q4,2,0),\"\"),\"\")","v":"Shuttle run 20m"},{"$f":"IF(iniTurma!A2=1,IFERROR(VLOOKUP(1,iniAuxiliar!L4:Q4,3,0),0),0)","v":8},null,{"$f":"IF(iniTurma!A2=1,IFERROR(VLOOKUP(1,iniAuxiliar!L4:Q4,4,0),0),0)","v":10.166666666666666},null,{"$f":"IF(iniTurma!A2=1,IFERROR(VLOOKUP(1,iniAuxiliar!L4:Q4,5,0),0),0)","v":7},null,{"$f":"IF(iniTurma!A2=1,IFERROR(VLOOKUP(1,iniAuxiliar!L4:Q4,6,0),0),0)","v":13}]
[]
[]
[]
["APTIDÃO MOTORA"]
[{"$f":"IF(iniTurma!A2=1,IFERROR(VLOOKUP(1,iniAuxiliar!L5:Q6,2,0),\"\"),\"\")","v":"Força de preensão"},{"$f":"IF(iniTurma!A2=1,IFERROR(VLOOKUP(1,iniAuxiliar!L5:Q6,3,0),0),0)","v":8.3000000000000007},null,{"$f":"IF(iniTurma!A2=1,IFERROR(VLOOKUP(1,iniAuxiliar!L5:Q6,4,0),0),0)","v":8.9454545454545453},null,{"$f":"IF(iniTurma!A2=1,IFERROR(VLOOKUP(1,iniAuxiliar!L5:Q6,5,0),0),0)","v":6},null,{"$f":"IF(iniTurma!A2=1,IFERROR(VLOOKUP(1,iniAuxiliar!L5:Q6,6,0),0),0)","v":14.7}]
[]
[{"$f":"IF(iniTurma!A2=1,IFERROR(VLOOKUP(2,iniAuxiliar!L5:Q6,2,0),\"\"),\"\")","v":"Salto horizontal"},{"$f":"IF(iniTurma!A2=1,IFERROR(VLOOKUP(2,iniAuxiliar!L5:Q6,3,0),0),0)","v":25},null,{"$f":"IF(iniTurma!A2=1,IFERROR(VLOOKUP(2,iniAuxiliar!L5:Q6,4,0),0),0)","v":29.866666666666664},null,{"$f":"IF(iniTurma!A2=1,IFERROR(VLOOKUP(2,iniAuxiliar!L5:Q6,5,0),0),0)","v":24},null,{"$f":"IF(iniTurma!A2=1,IFERROR(VLOOKUP(2,iniAuxiliar!L5:Q6,6,0),0),0)","v":38}]
[]
[]
[]
[]
["Perfil multivariado"]

{"sheet":"iniScore Z","index":2,"n_rows":53,"n_cols":8,"rows_kept":53,"cut":false,"hidden":false,"merged":[]}
[]
[]
[{"$f":"iniTurma!B3","v":"Ver: 1"},{"$f":"iniTurma!A3","v":"ID Aluno"},{"$f":"iniTurma!C3","v":"Nome"},{"$f":"iniTurma!D3","v":"Idade"},{"$f":"iniTurma!F3","v":"Agilidade"},{"$f":"iniTurma!G3","v":"Shuttle run 20m"},{"$f":"iniTurma!H3","v":"Força de preensão"},{"$f":"iniTurma!I3","v":"Salto horizontal"}]
[{"$f":"IF(iniTurma!B4<>\"\",iniTurma!B4,\"\")","v":""},{"$f":"iniTurma!A4","v":1},{"$f":"IF(iniTurma!C4<>\"\",iniTurma!C4,\"\")","v":"Micas"},{"$f":"IF(iniTurma!D4<>\"\",iniTurma!D4,\"\")","v":13},{"$f":"IF(AND(iniTurma!F$2<>\"\",iniTurma!F4<>\"\"),(iniTurma!F4-iniTurma!F$1)/iniTurma!F$2,\"\")","v":-1.4638501094227998},{"$f":"IF(AND(iniTurma!G$2<>\"\",iniTurma!G4<>\"\"),(iniTurma!G4-iniTurma!G$1)/iniTurma!G$2,\"\")","v":-9.1669849702820799E-2},{"$f":"IF(AND(iniTurma!H$2<>\"\",iniTurma!H4<>\"\"),(iniTurma!H4-iniTurma!H$1)/iniTurma!H$2,\"\")","v":-1.2148045081291921},{"$f":"IF(AND(iniTurma!I$2<>\"\",iniTurma!I4<>\"\"),(iniTurma!I4-iniTurma!I$1)/iniTurma!I$2,\"\")","v":0.52315105268066386}]
[{"$f":"IF(iniTurma!B5<>\"\",iniTurma!B5,\"\")","v":""},{"$f":"iniTurma!A5","v":2},{"$f":"IF(iniTurma!C5<>\"\",iniTurma!C5,\"\")","v":"Tecas"},{"$f":"IF(iniTurma!D5<>\"\",iniTurma!D5,\"\")","v":12},{"$f":"IF(AND(iniTurma!F$2<>\"\",iniTurma!F5<>\"\"),(iniTurma!F5-iniTurma!F$1)/iniTurma!F$2,\"\")","v":-0.87831006565367986},{"$f":"IF(AND(iniTurma!G$2<>\"\",iniTurma!G5<>\"\"),(iniTurma!G5-iniTurma!G$1)/iniTurma!G$2,\"\")","v":-0.64168894791974762},{"$f":"IF(AND(iniTurma!H$2<>\"\",iniTurma!H5<>\"\"),(iniTurma!H5-iniTurma!H$1)/iniTurma!H$2,\"\")","v":-0.80237087882607128},{"$f":"IF(AND(iniTurma!I$2<>\"\",iniTurma!I5<>\"\"),(iniTurma!I5-iniTurma!I$1)/iniTurma!I$2,\"\")","v":1.9945133883450288}]
[{"$f":"IF(iniTurma!B6<>\"\",iniTurma!B6,\"\")","v":"x"},{"$f":"iniTurma!A6","v":3},{"$f":"IF(iniTurma!C6<>\"\",iniTurma!C6,\"\")","v":"Lecas"},{"$f":"IF(iniTurma!D6<>\"\",iniTurma!D6,\"\")","v":15},{"$f":"IF(AND(iniTurma!F$2<>\"\",iniTurma!F6<>\"\"),(iniTurma!F6-iniTurma!F$1)/iniTurma!F$2,\"\")","v":-0.29277002188455997},{"$f":"IF(AND(iniTurma!G$2<>\"\",iniTurma!G6<>\"\"),(iniTurma!G6-iniTurma!G$1)/iniTurma!G$2,\"\")","v":-1.1917080461366745},{"$f":"IF(AND(iniTurma!H$2<>\"\",iniTurma!H6<>\"\"),(iniTurma!H6-iniTurma!H$1)/iniTurma!H$2,\"\")","v":-0.26620716073201395},{"$f":"IF(AND(iniTurma!I$2<>\"\",iniTurma!I6<>\"\"),(iniTurma!I6-iniTurma!I$1)/iniTurma!I$2,\"\")","v":-1.1934383389277619}]
[{"$f":"IF(iniTurma!B7<>\"\",iniTurma!B7,\"\")","v":""},{"$f":"iniTurma!A7","v":4},{"$f":"IF(iniTurma!C7<>\"\",iniTurma!C7,\"\")","v":"Becas"},{"$f":"IF(iniTurma!D7<>\"\",iniTurma!D7,\"\")","v":8},{"$f":"IF(AND(iniTurma!F$2<>\"\",iniTurma!F7<>\"\"),(iniTurma!F7-iniTurma!F$1)/iniTurma!F$2,\"\")","v":0.29277002188455997},{"$f":"IF(AND(iniTurma!G$2<>\"\",iniTurma!G7<>\"\"),(iniTurma!G7-iniTurma!G$1)/iniTurma!G$2,\"\")","v":-1.7417271443536011},{"$f":"IF(AND(iniTurma!H$2<>\"\",iniTurma!H7<>\"\"),(iniTurma!H7-iniTurma!H$1)/iniTurma!H$2,\"\")","v":""},{"$f":"IF(AND(iniTurma!I$2<>\"\",iniTurma!I7<>\"\"),(iniTurma!I7-iniTurma!I$1)/iniTurma!I$2,\"\")","v":0.27792399673660301}]
[{"$f":"IF(iniTurma!B8<>\"\",iniTurma!B8,\"\")","v":""},{"$f":"iniTurma!A8","v":5},{"$f":"IF(iniTurma!C8<>\"\",iniTurma!C8,\"\")","v":"Nocas"},{"$f":"IF(iniTurma!D8<>\"\",iniTurma!D8,\"\")","v":11},{"$f":"IF(AND(iniTurma!F$2<>\"\",iniTurma!F8<>\"\"),(iniTurma!F8-iniTurma!F$1)/iniTurma!F$2,\"\")","v":0.87831006565367986},{"$f":"IF(AND(iniTurma!G$2<>\"\",iniTurma!G8<>\"\"),(iniTurma!G8-iniTurma!G$1)/iniTurma!G$2,\"\")","v":0.45834924851410597},{"$f":"IF(AND(iniTurma!H$2<>\"\",iniTurma!H8<>\"\"),(iniTurma!H8-iniTurma!H$1)/iniTurma!H$2,\"\")","v":-0.80237087882607128},{"$f":"IF(AND(iniTurma!I$2<>\"\",iniTurma!I8<>\"\"),(iniTurma!I8-iniTurma!I$1)/iniTurma!I$2,\"\")","v":-1.4386653948718227}]
[{"$f":"IF(iniTurma!B9<>\"\",iniTurma!B9,\"\")","v":""},{"$f":"iniTurma!A9","v":6},{"$f":"IF(iniTurma!C9<>\"\",iniTurma!C9,\"\")","v":"Françoise Hardy"},{"$f":"IF(iniTurma!D9<>\"\",iniTurma!D9,\"\")","v":12},{"$f":"IF(AND(iniTurma!F$2<>\"\",iniTurma!F9<>\"\"),(iniTurma!F9-iniTurma!F$1)/iniTurma!F$2,\"\")","v":1.4638501094227998},{"$f":"IF(AND(iniTurma!G$2<>\"\",iniTurma!G9<>\"\"),(iniTurma!G9-iniTurma!G$1)/iniTurma!G$2,\"\")","v":0.45834924851410597},{"$f":"IF(AND(iniTurma!H$2<>\"\",iniTurma!H9<>\"\"),(iniTurma!H9-iniTurma!H$1)/iniTurma!H$2,\"\")","v":-0.3899372495229505},{"$f":"IF(AND(iniTurma!I$2<>\"\",iniTurma!I9<>\"\"),(iniTurma!I9-iniTurma!I$1)/iniTurma!I$2,\"\")","v":-0.70298422703964025}]
[{"$f":"IF(iniTurma!B10<>\"\",iniTurma!B10,\"\")","v":""},{"$f":"iniTurma!A10","v":7},{"$f":"IF(iniTurma!C10<>\"\",iniTurma!C10,\"\")","v":"Asterix"},{"$f":"IF(iniTurma!D10<>\"\",iniTurma!D10,\"\")","v":16},{"$f":"IF(AND(iniTurma!F$2<>\"\",iniTurma!F10<>\"\"),(iniTurma!F10-iniTurma!F$1)/iniTurma!F$2,\"\")","v":-1.4638501094227998},{"$f":"IF(AND(iniTurma!G$2<>\"\",iniTurma!G10<>\"\"),(iniTurma!G10-iniTurma!G$1)/iniTurma!G$2,\"\")","v":1.5583874449479596},{"$f":"IF(AND(iniTurma!H$2<>\"\",iniTurma!H10<>\"\"),(iniTurma!H10-iniTurma!H$1)/iniTurma!H$2,\"\")","v":1.0535804530379722},{"$f":"IF(AND(iniTurma!I$2<>\"\",iniTurma!I10<>\"\"),(iniTurma!I10-iniTurma!I$1)/iniTurma!I$2,\"\")","v":1.5040592764569072}]
[{"$f":"IF(iniTurma!B11<>\"\",iniTurma!B11,\"\")","v":""},{"$f":"iniTurma!A11","v":8},{"$f":"IF(iniTurma!C11<>\"\",iniTurma!C11,\"\")","v":"Obelix"},{"$f":"IF(iniTurma!D11<>\"\",iniTurma!D11,\"\")","v":14},{"$f":"IF(AND(iniTurma!F$2<>\"\",iniTurma!F11<>\"\"),(iniTurma!F11-iniTurma!F$1)/iniTurma!F$2,\"\")","v":-0.87831006565367986},{"$f":"IF(AND(iniTurma!G$2<>\"\",iniTurma!G11<>\"\"),(iniTurma!G11-iniTurma!G$1)/iniTurma!G$2,\"\")","v":-0.64168894791974762},{"$f":"IF(AND(iniTurma!H$2<>\"\",iniTurma!H11<>\"\"),(iniTurma!H11-iniTurma!H$1)/iniTurma!H$2,\"\")","v":2.3733680668079584},{"$f":"IF(AND(iniTurma!I$2<>\"\",iniTurma!I11<>\"\"),(iniTurma!I11-iniTurma!I$1)/iniTurma!I$2,\"\")","v":-0.70298422703964025}]
[{"$f":"IF(iniTurma!B12<>\"\",iniTurma!B12,\"\")","v":""},{"$f":"iniTurma!A12","v":9},{"$f":"IF(iniTurma!C12<>\"\",iniTurma!C12,\"\")","v":"Ideiafix"},{"$f":"IF(iniTurma!D12<>\"\",iniTurma!D12,\"\")","v":13},{"$f":"IF(AND(iniTurma!F$2<>\"\",iniTurma!F12<>\"\"),(iniTurma!F12-iniTurma!F$1)/iniTurma!F$2,\"\")","v":-0.29277002188455997},{"$f":"IF(AND(iniTurma!G$2<>\"\",iniTurma!G12<>\"\"),(iniTurma!G12-iniTurma!G$1)/iniTurma!G$2,\"\")","v":1.0083683467310327},{"$f":"IF(AND(iniTurma!H$2<>\"\",iniTurma!H12<>\"\"),(iniTurma!H12-iniTurma!H$1)/iniTurma!H$2,\"\")","v":0.84736363838641182},{"$f":"IF(AND(iniTurma!I$2<>\"\",iniTurma!I12<>\"\"),(iniTurma!I12-iniTurma!I$1)/iniTurma!I$2,\"\")","v":-0.45775717109557945}]
[{"$f":"IF(iniTurma!B13<>\"\",iniTurma!B13,\"\")","v":""},{"$f":"iniTurma!A13","v":10},{"$f":"IF(iniTurma!C13<>\"\",iniTurma!C13,\"\")","v":"Sylvie Vartan"},{"$f":"IF(iniTurma!D13<>\"\",iniTurma!D13,\"\")","v":13},{"$f":"IF(AND(iniTurma!F$2<>\"\",iniTurma!F13<>\"\"),(iniTurma!F13-iniTurma!F$1)/iniTurma!F$2,\"\")","v":0.29277002188455997},{"$f":"IF(AND(iniTurma!G$2<>\"\",iniTurma!G13<>\"\"),(iniTurma!G13-iniTurma!G$1)/iniTurma!G$2,\"\")","v":1.5583874449479596},{"$f":"IF(AND(iniTurma!H$2<>\"\",iniTurma!H13<>\"\"),(iniTurma!H13-iniTurma!H$1)/iniTurma!H$2,\"\")","v":-0.67864079003513511},{"$f":"IF(AND(iniTurma!I$2<>\"\",iniTurma!I13<>\"\"),(iniTurma!I13-iniTurma!I$1)/iniTurma!I$2,\"\")","v":0.27792399673660301}]
[{"$f":"IF(iniTurma!B14<>\"\",iniTurma!B14,\"\")","v":""},{"$f":"iniTurma!A14","v":11},{"$f":"IF(iniTurma!C14<>\"\",iniTurma!C14,\"\")","v":"Carlos Lopes"},{"$f":"IF(iniTurma!D14<>\"\",iniTurma!D14,\"\")","v":14},{"$f":"IF(AND(iniTurma!F$2<>\"\",iniTurma!F14<>\"\"),(iniTurma!F14-iniTurma!F$1)/iniTurma!F$2,\"\")","v":0.87831006565367986},{"$f":"IF(AND(iniTurma!G$2<>\"\",iniTurma!G14<>\"\"),(iniTurma!G14-iniTurma!G$1)/iniTurma!G$2,\"\")","v":-0.64168894791974762},{"$f":"IF(AND(iniTurma!H$2<>\"\",iniTurma!H14<>\"\"),(iniTurma!H14-iniTurma!H$1)/iniTurma!H$2,\"\")","v":-0.26620716073201395},{"$f":"IF(AND(iniTurma!I$2<>\"\",iniTurma!I14<>\"\"),(iniTurma!I14-iniTurma!I$1)/iniTurma!I$2,\"\")","v":0.52315105268066386}]
[{"$f":"IF(iniTurma!B15<>\"\",iniTurma!B15,\"\")","v":""},{"$f":"iniTurma!A15","v":12},{"$f":"IF(iniTurma!C15<>\"\",iniTurma!C15,\"\")","v":"Rosa Mota"},{"$f":"IF(iniTurma!D15<>\"\",iniTurma!D15,\"\")","v":14},{"$f":"IF(AND(iniTurma!F$2<>\"\",iniTurma!F15<>\"\"),(iniTurma!F15-iniTurma!F$1)/iniTurma!F$2,\"\")","v":1.4638501094227998},{"$f":"IF(AND(iniTurma!G$2<>\"\",iniTurma!G15<>\"\"),(iniTurma!G15-iniTurma!G$1)/iniTurma!G$2,\"\")","v":-9.1669849702820799E-2},{"$f":"IF(AND(iniTurma!H$2<>\"\",iniTurma!H15<>\"\"),(iniTurma!H15-iniTurma!H$1)/iniTurma!H$2,\"\")","v":0.1462264685711068},{"$f":"IF(AND(iniTurma!I$2<>\"\",iniTurma!I15<>\"\"),(iniTurma!I15-iniTurma!I$1)/iniTurma!I$2,\"\")","v":-0.60489340466201624}]
[{"$f":"IF(iniTurma!B16<>\"\",iniTurma!B16,\"\")","v":""},{"$f":"iniTurma!A16","v":13},{"$f":"IF(iniTurma!C16<>\"\",iniTurma!C16,\"\")","v":""},{"$f":"IF(iniTurma!D16<>\"\",iniTurma!D16,\"\")","v":""},{"$f":"IF(AND(iniTurma!F$2<>\"\",iniTurma!F16<>\"\"),(iniTurma!F16-iniTurma!F$1)/iniTurma!F$2,\"\")","v":""},{"$f":"IF(AND(iniTurma!G$2<>\"\",iniTurma!G16<>\"\"),(iniTurma!G16-iniTurma!G$1)/iniTurma!G$2,\"\")","v":""},{"$f":"IF(AND(iniTurma!H$2<>\"\",iniTurma!H16<>\"\"),(iniTurma!H16-iniTurma!H$1)/iniTurma!H$2,\"\")","v":""},{"$f":"IF(AND(iniTurma!I$2<>\"\",iniTurma!I16<>\"\"),(iniTurma!I16-iniTurma!I$1)/iniTurma!I$2,\"\")","v":""}]
[{"$f":"IF(iniTurma!B17<>\"\",iniTurma!B17,\"\")","v":""},{"$f":"iniTurma!A17","v":14},{"$f":"IF(iniTurma!C17<>\"\",iniTurma!C17,\"\")","v":""},{"$f":"IF(iniTurma!D17<>\"\",iniTurma!D17,\"\")","v":""},{"$f":"IF(AND(iniTurma!F$2<>\"\",iniTurma!F17<>\"\"),(iniTurma!F17-iniTurma!F$1)/iniTurma!F$2,\"\")","v":""},{"$f":"IF(AND(iniTurma!G$2<>\"\",iniTurma!G17<>\"\"),(iniTurma!G17-iniTurma!G$1)/iniTurma!G$2,\"\")","v":""},{"$f":"IF(AND(iniTurma!H$2<>\"\",iniTurma!H17<>\"\"),(iniTurma!H17-iniTurma!H$1)/iniTurma!H$2,\"\")","v":""},{"$f":"IF(AND(iniTurma!I$2<>\"\",iniTurma!I17<>\"\"),(iniTurma!I17-iniTurma!I$1)/iniTurma!I$2,\"\")","v":""}]
[{"$f":"IF(iniTurma!B18<>\"\",iniTurma!B18,\"\")","v":""},{"$f":"iniTurma!A18","v":15},{"$f":"IF(iniTurma!C18<>\"\",iniTurma!C18,\"\")","v":""},{"$f":"IF(iniTurma!D18<>\"\",iniTurma!D18,\"\")","v":""},{"$f":"IF(AND(iniTurma!F$2<>\"\",iniTurma!F18<>\"\"),(iniTurma!F18-iniTurma!F$1)/iniTurma!F$2,\"\")","v":""},{"$f":"IF(AND(iniTurma!G$2<>\"\",iniTurma!G18<>\"\"),(iniTurma!G18-iniTurma!G$1)/iniTurma!G$2,\"\")","v":""},{"$f":"IF(AND(iniTurma!H$2<>\"\",iniTurma!H18<>\"\"),(iniTurma!H18-iniTurma!H$1)/iniTurma!H$2,\"\")","v":""},{"$f":"IF(AND(iniTurma!I$2<>\"\",iniTurma!I18<>\"\"),(iniTurma!I18-iniTurma!I$1)/iniTurma!I$2,\"\")","v":""}]
[{"$f":"IF(iniTurma!B19<>\"\",iniTurma!B19,\"\")","v":""},{"$f":"iniTurma!A19","v":16},{"$f":"IF(iniTurma!C19<>\"\",iniTurma!C19,\"\")","v":""},{"$f":"IF(iniTurma!D19<>\"\",iniTurma!D19,\"\")","v":""},{"$f":"IF(AND(iniTurma!F$2<>\"\",iniTurma!F19<>\"\"),(iniTurma!F19-iniTurma!F$1)/iniTurma!F$2,\"\")","v":""},{"$f":"IF(AND(iniTurma!G$2<>\"\",iniTurma!G19<>\"\"),(iniTurma!G19-iniTurma!G$1)/iniTurma!G$2,\"\")","v":""},{"$f":"IF(AND(iniTurma!H$2<>\"\",iniTurma!H19<>\"\"),(iniTurma!H19-iniTurma!H$1)/iniTurma!H$2,\"\")","v":""},{"$f":"IF(AND(iniTurma!I$2<>\"\",iniTurma!I19<>\"\"),(iniTurma!I19-iniTurma!I$1)/iniTurma!I$2,\"\")","v":""}]
[{"$f":"IF(iniTurma!B20<>\"\",iniTurma!B20,\"\")","v":""},{"$f":"iniTurma!A20","v":17},{"$f":"IF(iniTurma!C20<>\"\",iniTurma!C20,\"\")","v":""},{"$f":"IF(iniTurma!D20<>\"\",iniTurma!D20,\"\")","v":""},{"$f":"IF(AND(iniTurma!F$2<>\"\",iniTurma!F20<>\"\"),(iniTurma!F20-iniTurma!F$1)/iniTurma!F$2,\"\")","v":""},{"$f":"IF(AND(iniTurma!G$2<>\"\",iniTurma!G20<>\"\"),(iniTurma!G20-iniTurma!G$1)/iniTurma!G$2,\"\")","v":""},{"$f":"IF(AND(iniTurma!H$2<>\"\",iniTurma!H20<>\"\"),(iniTurma!H20-iniTurma!H$1)/iniTurma!H$2,\"\")","v":""},{"$f":"IF(AND(iniTurma!I$2<>\"\",iniTurma!I20<>\"\"),(iniTurma!I20-iniTurma!I$1)/iniTurma!I$2,\"\")","v":""}]
[{"$f":"IF(iniTurma!B21<>\"\",iniTurma!B21,\"\")","v":""},{"$f":"iniTurma!A21","v":18},{"$f":"IF(iniTurma!C21<>\"\",iniTurma!C21,\"\")","v":""},{"$f":"IF(iniTurma!D21<>\"\",iniTurma!D21,\"\")","v":""},{"$f":"IF(AND(iniTurma!F$2<>\"\",iniTurma!F21<>\"\"),(iniTurma!F21-iniTurma!F$1)/iniTurma!F$2,\"\")","v":""},{"$f":"IF(AND(iniTurma!G$2<>\"\",iniTurma!G21<>\"\"),(iniTurma!G21-iniTurma!G$1)/iniTurma!G$2,\"\")","v":""},{"$f":"IF(AND(iniTurma!H$2<>\"\",iniTurma!H21<>\"\"),(iniTurma!H21-iniTurma!H$1)/iniTurma!H$2,\"\")","v":""},{"$f":"IF(AND(iniTurma!I$2<>\"\",iniTurma!I21<>\"\"),(iniTurma!I21-iniTurma!I$1)/iniTurma!I$2,\"\")","v":""}]
[{"$f":"IF(iniTurma!B22<>\"\",iniTurma!B22,\"\")","v":""},{"$f":"iniTurma!A22","v":19},{"$f":"IF(iniTurma!C22<>\"\",iniTurma!C22,\"\")","v":""},{"$f":"IF(iniTurma!D22<>\"\",iniTurma!D22,\"\")","v":""},{"$f":"IF(AND(iniTurma!F$2<>\"\",iniTurma!F22<>\"\"),(iniTurma!F22-iniTurma!F$1)/iniTurma!F$2,\"\")","v":""},{"$f":"IF(AND(iniTurma!G$2<>\"\",iniTurma!G22<>\"\"),(iniTurma!G22-iniTurma!G$1)/iniTurma!G$2,\"\")","v":""},{"$f":"IF(AND(iniTurma!H$2<>\"\",iniTurma!H22<>\"\"),(iniTurma!H22-iniTurma!H$1)/iniTurma!H$2,\"\")","v":""},{"$f":"IF(AND(iniTurma!I$2<>\"\",iniTurma!I22<>\"\"),(iniTurma!I22-iniTurma!I$1)/iniTurma!I$2,\"\")","v":""}]
[{"$f":"IF(iniTurma!B23<>\"\",iniTurma!B23,\"\")","v":""},{"$f":"iniTurma!A23","v":20},{"$f":"IF(iniTurma!C23<>\"\",iniTurma!C23,\"\")","v":""},{"$f":"IF(iniTurma!D23<>\"\",iniTurma!D23,\"\")","v":""},{"$f":"IF(AND(iniTurma!F$2<>\"\",iniTurma!F23<>\"\"),(iniTurma!F23-iniTurma!F$1)/iniTurma!F$2,\"\")","v":""},{"$f":"IF(AND(iniTurma!G$2<>\"\",iniTurma!G23<>\"\"),(iniTurma!G23-iniTurma!G$1)/iniTurma!G$2,\"\")","v":""},{"$f":"IF(AND(iniTurma!H$2<>\"\",iniTurma!H23<>\"\"),(iniTurma!H23-iniTurma!H$1)/iniTurma!H$2,\"\")","v":""},{"$f":"IF(AND(iniTurma!I$2<>\"\",iniTurma!I23<>\"\"),(iniTurma!I23-iniTurma!I$1)/iniTurma!I$2,\"\")","v":""}]
[{"$f":"IF(iniTurma!B24<>\"\",iniTurma!B24,\"\")","v":""},{"$f":"iniTurma!A24","v":21},{"$f":"IF(iniTurma!C24<>\"\",iniTurma!C24,\"\")","v":""},{"$f":"IF(iniTurma!D24<>\"\",iniTurma!D24,\"\")","v":""},{"$f":"IF(AND(iniTurma!F$2<>\"\",iniTurma!F24<>\"\"),(iniTurma!F24-iniTurma!F$1)/iniTurma!F$2,\"\")","v":""},{"$f":"IF(AND(iniTurma!G$2<>\"\",iniTurma!G24<>\"\"),(iniTurma!G24-iniTurma!G$1)/iniTurma!G$2,\"\")","v":""},{"$f":"IF(AND(iniTurma!H$2<>\"\",iniTurma!H24<>\"\"),(iniTurma!H24-iniTurma!H$1)/iniTurma!H$2,\"\")","v":""},{"$f":"IF(AND(iniTurma!I$2<>\"\",iniTurma!I24<>\"\"),(iniTurma!I24-iniTurma!I$1)/iniTurma!I$2,\"\")","v":""}]
[{"$f":"IF(iniTurma!B25<>\"\",iniTurma!B25,\"\")","v":""},{"$f":"iniTurma!A25","v":22},{"$f":"IF(iniTurma!C25<>\"\",iniTurma!C25,\"\")","v":""},{"$f":"IF(iniTurma!D25<>\"\",iniTurma!D25,\"\")","v":""},{"$f":"IF(AND(iniTurma!F$2<>\"\",iniTurma!F25<>\"\"),(iniTurma!F25-iniTurma!F$1)/iniTurma!F$2,\"\")","v":""},{"$f":"IF(AND(iniTurma!G$2<>\"\",iniTurma!G25<>\"\"),(iniTurma!G25-iniTurma!G$1)/iniTurma!G$2,\"\")","v":""},{"$f":"IF(AND(iniTurma!H$2<>\"\",iniTurma!H25<>\"\"),(iniTurma!H25-iniTurma!H$1)/iniTurma!H$2,\"\")","v":""},{"$f":"IF(AND(iniTurma!I$2<>\"\",iniTurma!I25<>\"\"),(iniTurma!I25-iniTurma!I$1)/iniTurma!I$2,\"\")","v":""}]
[{"$f":"IF(iniTurma!B26<>\"\",iniTurma!B26,\"\")","v":""},{"$f":"iniTurma!A26","v":23},{"$f":"IF(iniTurma!C26<>\"\",iniTurma!C26,\"\")","v":""},{"$f":"IF(iniTurma!D26<>\"\",iniTurma!D26,\"\")","v":""},{"$f":"IF(AND(iniTurma!F$2<>\"\",iniTurma!F26<>\"\"),(iniTurma!F26-iniTurma!F$1)/iniTurma!F$2,\"\")","v":""},{"$f":"IF(AND(iniTurma!G$2<>\"\",iniTurma!G26<>\"\"),(iniTurma!G26-iniTurma!G$1)/iniTurma!G$2,\"\")","v":""},{"$f":"IF(AND(iniTurma!H$2<>\"\",iniTurma!H26<>\"\"),(iniTurma!H26-iniTurma!H$1)/iniTurma!H$2,\"\")","v":""},{"$f":"IF(AND(iniTurma!I$2<>\"\",iniTurma!I26<>\"\"),(iniTurma!I26-iniTurma!I$1)/iniTurma!I$2,\"\")","v":""}]
[{"$f":"IF(iniTurma!B27<>\"\",iniTurma!B27,\"\")","v":""},{"$f":"iniTurma!A27","v":24},{"$f":"IF(iniTurma!C27<>\"\",iniTurma!C27,\"\")","v":""},{"$f":"IF(iniTurma!D27<>\"\",iniTurma!D27,\"\")","v":""},{"$f":"IF(AND(iniTurma!F$2<>\"\",iniTurma!F27<>\"\"),(iniTurma!F27-iniTurma!F$1)/iniTurma!F$2,\"\")","v":""},{"$f":"IF(AND(iniTurma!G$2<>\"\",iniTurma!G27<>\"\"),(iniTurma!G27-iniTurma!G$1)/iniTurma!G$2,\"\")","v":""},{"$f":"IF(AND(iniTurma!H$2<>\"\",iniTurma!H27<>\"\"),(iniTurma!H27-iniTurma!H$1)/iniTurma!H$2,\"\")","v":""},{"$f":"IF(AND(iniTurma!I$2<>\"\",iniTurma!I27<>\"\"),(iniTurma!I27-iniTurma!I$1)/iniTurma!I$2,\"\")","v":""}]
[{"$f":"IF(iniTurma!B28<>\"\",iniTurma!B28,\"\")","v":""},{"$f":"iniTurma!A28","v":25},{"$f":"IF(iniTurma!C28<>\"\",iniTurma!C28,\"\")","v":""},{"$f":"IF(iniTurma!D28<>\"\",iniTurma!D28,\"\")","v":""},{"$f":"IF(AND(iniTurma!F$2<>\"\",iniTurma!F28<>\"\"),(iniTurma!F28-iniTurma!F$1)/iniTurma!F$2,\"\")","v":""},{"$f":"IF(AND(iniTurma!G$2<>\"\",iniTurma!G28<>\"\"),(iniTurma!G28-iniTurma!G$1)/iniTurma!G$2,\"\")","v":""},{"$f":"IF(AND(iniTurma!H$2<>\"\",iniTurma!H28<>\"\"),(iniTurma!H28-iniTurma!H$1)/iniTurma!H$2,\"\")","v":""},{"$f":"IF(AND(iniTurma!I$2<>\"\",iniTurma!I28<>\"\"),(iniTurma!I28-iniTurma!I$1)/iniTurma!I$2,\"\")","v":""}]
[{"$f":"IF(iniTurma!B29<>\"\",iniTurma!B29,\"\")","v":""},{"$f":"iniTurma!A29","v":26},{"$f":"IF(iniTurma!C29<>\"\",iniTurma!C29,\"\")","v":""},{"$f":"IF(iniTurma!D29<>\"\",iniTurma!D29,\"\")","v":""},{"$f":"IF(AND(iniTurma!F$2<>\"\",iniTurma!F29<>\"\"),(iniTurma!F29-iniTurma!F$1)/iniTurma!F$2,\"\")","v":""},{"$f":"IF(AND(iniTurma!G$2<>\"\",iniTurma!G29<>\"\"),(iniTurma!G29-iniTurma!G$1)/iniTurma!G$2,\"\")","v":""},{"$f":"IF(AND(iniTurma!H$2<>\"\",iniTurma!H29<>\"\"),(iniTurma!H29-iniTurma!H$1)/iniTurma!H$2,\"\")","v":""},{"$f":"IF(AND(iniTurma!I$2<>\"\",iniTurma!I29<>\"\"),(iniTurma!I29-iniTurma!I$1)/iniTurma!I$2,\"\")","v":""}]
[{"$f":"IF(iniTurma!B30<>\"\",iniTurma!B30,\"\")","v":""},{"$f":"iniTurma!A30","v":27},{"$f":"IF(iniTurma!C30<>\"\",iniTurma!C30,\"\")","v":""},{"$f":"IF(iniTurma!D30<>\"\",iniTurma!D30,\"\")","v":""},{"$f":"IF(AND(iniTurma!F$2<>\"\",iniTurma!F30<>\"\"),(iniTurma!F30-iniTurma!F$1)/iniTurma!F$2,\"\")","v":""},{"$f":"IF(AND(iniTurma!G$2<>\"\",iniTurma!G30<>\"\"),(iniTurma!G30-iniTurma!G$1)/iniTurma!G$2,\"\")","v":""},{"$f":"IF(AND(iniTurma!H$2<>\"\",iniTurma!H30<>\"\"),(iniTurma!H30-iniTurma!H$1)/iniTurma!H$2,\"\")","v":""},{"$f":"IF(AND(iniTurma!I$2<>\"\",iniTurma!I30<>\"\"),(iniTurma!I30-iniTurma!I$1)/iniTurma!I$2,\"\")","v":""}]
[{"$f":"IF(iniTurma!B31<>\"\",iniTurma!B31,\"\")","v":""},{"$f":"iniTurma!A31","v":28},{"$f":"IF(iniTurma!C31<>\"\",iniTurma!C31,\"\")","v":""},{"$f":"IF(iniTurma!D31<>\"\",iniTurma!D31,\"\")","v":""},{"$f":"IF(AND(iniTurma!F$2<>\"\",iniTurma!F31<>\"\"),(iniTurma!F31-iniTurma!F$1)/iniTurma!F$2,\"\")","v":""},{"$f":"IF(AND(iniTurma!G$2<>\"\",iniTurma!G31<>\"\"),(iniTurma!G31-iniTurma!G$1)/iniTurma!G$2,\"\")","v":""},{"$f":"IF(AND(iniTurma!H$2<>\"\",iniTurma!H31<>\"\"),(iniTurma!H31-iniTurma!H$1)/iniTurma!H$2,\"\")","v":""},{"$f":"IF(AND(iniTurma!I$2<>\"\",iniTurma!I31<>\"\"),(iniTurma!I31-iniTurma!I$1)/iniTurma!I$2,\"\")","v":""}]
[{"$f":"IF(iniTurma!B32<>\"\",iniTurma!B32,\"\")","v":""},{"$f":"iniTurma!A32","v":29},{"$f":"IF(iniTurma!C32<>\"\",iniTurma!C32,\"\")","v":""},{"$f":"IF(iniTurma!D32<>\"\",iniTurma!D32,\"\")","v":""},{"$f":"IF(AND(iniTurma!F$2<>\"\",iniTurma!F32<>\"\"),(iniTurma!F32-iniTurma!F$1)/iniTurma!F$2,\"\")","v":""},{"$f":"IF(AND(iniTurma!G$2<>\"\",iniTurma!G32<>\"\"),(iniTurma!G32-iniTurma!G$1)/iniTurma!G$2,\"\")","v":""},{"$f":"IF(AND(iniTurma!H$2<>\"\",iniTurma!H32<>\"\"),(iniTurma!H32-iniTurma!H$1)/iniTurma!H$2,\"\")","v":""},{"$f":"IF(AND(iniTurma!I$2<>\"\",iniTurma!I32<>\"\"),(iniTurma!I32-iniTurma!I$1)/iniTurma!I$2,\"\")","v":""}]
[{"$f":"IF(iniTurma!B33<>\"\",iniTurma!B33,\"\")","v":""},{"$f":"iniTurma!A33","v":30},{"$f":"IF(iniTurma!C33<>\"\",iniTurma!C33,\"\")","v":""},{"$f":"IF(iniTurma!D33<>\"\",iniTurma!D33,\"\")","v":""},{"$f":"IF(AND(iniTurma!F$2<>\"\",iniTurma!F33<>\"\"),(iniTurma!F33-iniTurma!F$1)/iniTurma!F$2,\"\")","v":""},{"$f":"IF(AND(iniTurma!G$2<>\"\",iniTurma!G33<>\"\"),(iniTurma!G33-iniTurma!G$1)/iniTurma!G$2,\"\")","v":""},{"$f":"IF(AND(iniTurma!H$2<>\"\",iniTurma!H33<>\"\"),(iniTurma!H33-iniTurma!H$1)/iniTurma!H$2,\"\")","v":""},{"$f":"IF(AND(iniTurma!I$2<>\"\",iniTurma!I33<>\"\"),(iniTurma!I33-iniTurma!I$1)/iniTurma!I$2,\"\")","v":""}]
[{"$f":"IF(iniTurma!B34<>\"\",iniTurma!B34,\"\")","v":""},{"$f":"iniTurma!A34","v":31},{"$f":"IF(iniTurma!C34<>\"\",iniTurma!C34,\"\")","v":""},{"$f":"IF(iniTurma!D34<>\"\",iniTurma!D34,\"\")","v":""},{"$f":"IF(AND(iniTurma!F$2<>\"\",iniTurma!F34<>\"\"),(iniTurma!F34-iniTurma!F$1)/iniTurma!F$2,\"\")","v":""},{"$f":"IF(AND(iniTurma!G$2<>\"\",iniTurma!G34<>\"\"),(iniTurma!G34-iniTurma!G$1)/iniTurma!G$2,\"\")","v":""},{"$f":"IF(AND(iniTurma!H$2<>\"\",iniTurma!H34<>\"\"),(iniTurma!H34-iniTurma!H$1)/iniTurma!H$2,\"\")","v":""},{"$f":"IF(AND(iniTurma!I$2<>\"\",iniTurma!I34<>\"\"),(iniTurma!I34-iniTurma!I$1)/iniTurma!I$2,\"\")","v":""}]
[{"$f":"IF(iniTurma!B35<>\"\",iniTurma!B35,\"\")","v":""},{"$f":"iniTurma!A35","v":32},{"$f":"IF(iniTurma!C35<>\"\",iniTurma!C35,\"\")","v":""},{"$f":"IF(iniTurma!D35<>\"\",iniTurma!D35,\"\")","v":""},{"$f":"IF(AND(iniTurma!F$2<>\"\",iniTurma!F35<>\"\"),(iniTurma!F35-iniTurma!F$1)/iniTurma!F$2,\"\")","v":""},{"$f":"IF(AND(iniTurma!G$2<>\"\",iniTurma!G35<>\"\"),(iniTurma!G35-iniTurma!G$1)/iniTurma!G$2,\"\")","v":""},{"$f":"IF(AND(iniTurma!H$2<>\"\",iniTurma!H35<>\"\"),(iniTurma!H35-iniTurma!H$1)/iniTurma!H$2,\"\")","v":""},{"$f":"IF(AND(iniTurma!I$2<>\"\",iniTurma!I35<>\"\"),(iniTurma!I35-iniTurma!I$1)/iniTurma!I$2,\"\")","v":""}]
[{"$f":"IF(iniTurma!B36<>\"\",iniTurma!B36,\"\")","v":""},{"$f":"iniTurma!A36","v":33},{"$f":"IF(iniTurma!C36<>\"\",iniTurma!C36,\"\")","v":""},{"$f":"IF(iniTurma!D36<>\"\",iniTurma!D36,\"\")","v":""},{"$f":"IF(AND(iniTurma!F$2<>\"\",iniTurma!F36<>\"\"),(iniTurma!F36-iniTurma!F$1)/iniTurma!F$2,\"\")","v":""},{"$f":"IF(AND(iniTurma!G$2<>\"\",iniTurma!G36<>\"\"),(iniTurma!G36-iniTurma!G$1)/iniTurma!G$2,\"\")","v":""},{"$f":"IF(AND(iniTurma!H$2<>\"\",iniTurma!H36<>\"\"),(iniTurma!H36-iniTurma!H$1)/iniTurma!H$2,\"\")","v":""},{"$f":"IF(AND(iniTurma!I$2<>\"\",iniTurma!I36<>\"\"),(iniTurma!I36-iniTurma!I$1)/iniTurma!I$2,\"\")","v":""}]
[{"$f":"IF(iniTurma!B37<>\"\",iniTurma!B37,\"\")","v":""},{"$f":"iniTurma!A37","v":34},{"$f":"IF(iniTurma!C37<>\"\",iniTurma!C37,\"\")","v":""},{"$f":"IF(iniTurma!D37<>\"\",iniTurma!D37,\"\")","v":""},{"$f":"IF(AND(iniTurma!F$2<>\"\",iniTurma!F37<>\"\"),(iniTurma!F37-iniTurma!F$1)/iniTurma!F$2,\"\")","v":""},{"$f":"IF(AND(iniTurma!G$2<>\"\",iniTurma!G37<>\"\"),(iniTurma!G37-iniTurma!G$1)/iniTurma!G$2,\"\")","v":""},{"$f":"IF(AND(iniTurma!H$2<>\"\",iniTurma!H37<>\"\"),(iniTurma!H37-iniTurma!H$1)/iniTurma!H$2,\"\")","v":""},{"$f":"IF(AND(iniTurma!I$2<>\"\",iniTurma!I37<>\"\"),(iniTurma!I37-iniTurma!I$1)/iniTurma!I$2,\"\")","v":""}]
[{"$f":"IF(iniTurma!B38<>\"\",iniTurma!B38,\"\")","v":""},{"$f":"iniTurma!A38","v":35},{"$f":"IF(iniTurma!C38<>\"\",iniTurma!C38,\"\")","v":""},{"$f":"IF(iniTurma!D38<>\"\",iniTurma!D38,\"\")","v":""},{"$f":"IF(AND(iniTurma!F$2<>\"\",iniTurma!F38<>\"\"),(iniTurma!F38-iniTurma!F$1)/iniTurma!F$2,\"\")","v":""},{"$f":"IF(AND(iniTurma!G$2<>\"\",iniTurma!G38<>\"\"),(iniTurma!G38-iniTurma!G$1)/iniTurma!G$2,\"\")","v":""},{"$f":"IF(AND(iniTurma!H$2<>\"\",iniTurma!H38<>\"\"),(iniTurma!H38-iniTurma!H$1)/iniTurma!H$2,\"\")","v":""},{"$f":"IF(AND(iniTurma!I$2<>\"\",iniTurma!I38<>\"\"),(iniTurma!I38-iniTurma!I$1)/iniTurma!I$2,\"\")","v":""}]
[{"$f":"IF(iniTurma!B39<>\"\",iniTurma!B39,\"\")","v":""},{"$f":"iniTurma!A39","v":36},{"$f":"IF(iniTurma!C39<>\"\",iniTurma!C39,\"\")","v":""},{"$f":"IF(iniTurma!D39<>\"\",iniTurma!D39,\"\")","v":""},{"$f":"IF(AND(iniTurma!F$2<>\"\",iniTurma!F39<>\"\"),(iniTurma!F39-iniTurma!F$1)/iniTurma!F$2,\"\")","v":""},{"$f":"IF(AND(iniTurma!G$2<>\"\",iniTurma!G39<>\"\"),(iniTurma!G39-iniTurma!G$1)/iniTurma!G$2,\"\")","v":""},{"$f":"IF(AND(iniTurma!H$2<>\"\",iniTurma!H39<>\"\"),(iniTurma!H39-iniTurma!H$1)/iniTurma!H$2,\"\")","v":""},{"$f":"IF(AND(iniTurma!I$2<>\"\",iniTurma!I39<>\"\"),(iniTurma!I39-iniTurma!I$1)/iniTurma!I$2,\"\")","v":""}]
[{"$f":"IF(iniTurma!B40<>\"\",iniTurma!B40,\"\")","v":""},{"$f":"iniTurma!A40","v":37},{"$f":"IF(iniTurma!C40<>\"\",iniTurma!C40,\"\")","v":""},{"$f":"IF(iniTurma!D40<>\"\",iniTurma!D40,\"\")","v":""},{"$f":"IF(AND(iniTurma!F$2<>\"\",iniTurma!F40<>\"\"),(iniTurma!F40-iniTurma!F$1)/iniTurma!F$2,\"\")","v":""},{"$f":"IF(AND(iniTurma!G$2<>\"\",iniTurma!G40<>\"\"),(iniTurma!G40-iniTurma!G$1)/iniTurma!G$2,\"\")","v":""},{"$f":"IF(AND(iniTurma!H$2<>\"\",iniTurma!H40<>\"\"),(iniTurma!H40-iniTurma!H$1)/iniTurma!H$2,\"\")","v":""},{"$f":"IF(AND(iniTurma!I$2<>\"\",iniTurma!I40<>\"\"),(iniTurma!I40-iniTurma!I$1)/iniTurma!I$2,\"\")","v":""}]
[{"$f":"IF(iniTurma!B41<>\"\",iniTurma!B41,\"\")","v":""},{"$f":"iniTurma!A41","v":38},{"$f":"IF(iniTurma!C41<>\"\",iniTurma!C41,\"\")","v":""},{"$f":"IF(iniTurma!D41<>\"\",iniTurma!D41,\"\")","v":""},{"$f":"IF(AND(iniTurma!F$2<>\"\",iniTurma!F41<>\"\"),(iniTurma!F41-iniTurma!F$1)/iniTurma!F$2,\"\")","v":""},{"$f":"IF(AND(iniTurma!G$2<>\"\",iniTurma!G41<>\"\"),(iniTurma!G41-iniTurma!G$1)/iniTurma!G$2,\"\")","v":""},{"$f":"IF(AND(iniTurma!H$2<>\"\",iniTurma!H41<>\"\"),(iniTurma!H41-iniTurma!H$1)/iniTurma!H$2,\"\")","v":""},{"$f":"IF(AND(iniTurma!I$2<>\"\",iniTurma!I41<>\"\"),(iniTurma!I41-iniTurma!I$1)/iniTurma!I$2,\"\")","v":""}]
[{"$f":"IF(iniTurma!B42<>\"\",iniTurma!B42,\"\")","v":""},{"$f":"iniTurma!A42","v":39},{"$f":"IF(iniTurma!C42<>\"\",iniTurma!C42,\"\")","v":""},{"$f":"IF(iniTurma!D42<>\"\",iniTurma!D42,\"\")","v":""},{"$f":"IF(AND(iniTurma!F$2<>\"\",iniTurma!F42<>\"\"),(iniTurma!F42-iniTurma!F$1)/iniTurma!F$2,\"\")","v":""},{"$f":"IF(AND(iniTurma!G$2<>\"\",iniTurma!G42<>\"\"),(iniTurma!G42-iniTurma!G$1)/iniTurma!G$2,\"\")","v":""},{"$f":"IF(AND(iniTurma!H$2<>\"\",iniTurma!H42<>\"\"),(iniTurma!H42-iniTurma!H$1)/iniTurma!H$2,\"\")","v":""},{"$f":"IF(AND(iniTurma!I$2<>\"\",iniTurma!I42<>\"\"),(iniTurma!I42-iniTurma!I$1)/iniTurma!I$2,\"\")","v":""}]
[{"$f":"IF(iniTurma!B43<>\"\",iniTurma!B43,\"\")","v":""},{"$f":"iniTurma!A43","v":40},{"$f":"IF(iniTurma!C43<>\"\",iniTurma!C43,\"\")","v":""},{"$f":"IF(iniTurma!D43<>\"\",iniTurma!D43,\"\")","v":""},{"$f":"IF(AND(iniTurma!F$2<>\"\",iniTurma!F43<>\"\"),(iniTurma!F43-iniTurma!F$1)/iniTurma!F$2,\"\")","v":""},{"$f":"IF(AND(iniTurma!G$2<>\"\",iniTurma!G43<>\"\"),(iniTurma!G43-iniTurma!G$1)/iniTurma!G$2,\"\")","v":""},{"$f":"IF(AND(iniTurma!H$2<>\"\",iniTurma!H43<>\"\"),(iniTurma!H43-iniTurma!H$1)/iniTurma!H$2,\"\")","v":""},{"$f":"IF(AND(iniTurma!I$2<>\"\",iniTurma!I43<>\"\"),(iniTurma!I43-iniTurma!I$1)/iniTurma!I$2,\"\")","v":""}]
[{"$f":"IF(iniTurma!B44<>\"\",iniTurma!B44,\"\")","v":""},{"$f":"iniTurma!A44","v":41},{"$f":"IF(iniTurma!C44<>\"\",iniTurma!C44,\"\")","v":""},{"$f":"IF(iniTurma!D44<>\"\",iniTurma!D44,\"\")","v":""},{"$f":"IF(AND(iniTurma!F$2<>\"\",iniTurma!F44<>\"\"),(iniTurma!F44-iniTurma!F$1)/iniTurma!F$2,\"\")","v":""},{"$f":"IF(AND(iniTurma!G$2<>\"\",iniTurma!G44<>\"\"),(iniTurma!G44-iniTurma!G$1)/iniTurma!G$2,\"\")","v":""},{"$f":"IF(AND(iniTurma!H$2<>\"\",iniTurma!H44<>\"\"),(iniTurma!H44-iniTurma!H$1)/iniTurma!H$2,\"\")","v":""},{"$f":"IF(AND(iniTurma!I$2<>\"\",iniTurma!I44<>\"\"),(iniTurma!I44-iniTurma!I$1)/iniTurma!I$2,\"\")","v":""}]
[{"$f":"IF(iniTurma!B45<>\"\",iniTurma!B45,\"\")","v":""},{"$f":"iniTurma!A45","v":42},{"$f":"IF(iniTurma!C45<>\"\",iniTurma!C45,\"\")","v":""},{"$f":"IF(iniTurma!D45<>\"\",iniTurma!D45,\"\")","v":""},{"$f":"IF(AND(iniTurma!F$2<>\"\",iniTurma!F45<>\"\"),(iniTurma!F45-iniTurma!F$1)/iniTurma!F$2,\"\")","v":""},{"$f":"IF(AND(iniTurma!G$2<>\"\",iniTurma!G45<>\"\"),(iniTurma!G45-iniTurma!G$1)/iniTurma!G$2,\"\")","v":""},{"$f":"IF(AND(iniTurma!H$2<>\"\",iniTurma!H45<>\"\"),(iniTurma!H45-iniTurma!H$1)/iniTurma!H$2,\"\")","v":""},{"$f":"IF(AND(iniTurma!I$2<>\"\",iniTurma!I45<>\"\"),(iniTurma!I45-iniTurma!I$1)/iniTurma!I$2,\"\")","v":""}]
[{"$f":"IF(iniTurma!B46<>\"\",iniTurma!B46,\"\")","v":""},{"$f":"iniTurma!A46","v":43},{"$f":"IF(iniTurma!C46<>\"\",iniTurma!C46,\"\")","v":""},{"$f":"IF(iniTurma!D46<>\"\",iniTurma!D46,\"\")","v":""},{"$f":"IF(AND(iniTurma!F$2<>\"\",iniTurma!F46<>\"\"),(iniTurma!F46-iniTurma!F$1)/iniTurma!F$2,\"\")","v":""},{"$f":"IF(AND(iniTurma!G$2<>\"\",iniTurma!G46<>\"\"),(iniTurma!G46-iniTurma!G$1)/iniTurma!G$2,\"\")","v":""},{"$f":"IF(AND(iniTurma!H$2<>\"\",iniTurma!H46<>\"\"),(iniTurma!H46-iniTurma!H$1)/iniTurma!H$2,\"\")","v":""},{"$f":"IF(AND(iniTurma!I$2<>\"\",iniTurma!I46<>\"\"),(iniTurma!I46-iniTurma!I$1)/iniTurma!I$2,\"\")","v":""}]
[{"$f":"IF(iniTurma!B47<>\"\",iniTurma!B47,\"\")","v":""},{"$f":"iniTurma!A47","v":44},{"$f":"IF(iniTurma!C47<>\"\",iniTurma!C47,\"\")","v":""},{"$f":"IF(iniTurma!D47<>\"\",iniTurma!D47,\"\")","v":""},{"$f":"IF(AND(iniTurma!F$2<>\"\",iniTurma!F47<>\"\"),(iniTurma!F47-iniTurma!F$1)/iniTurma!F$2,\"\")","v":""},{"$f":"IF(AND(iniTurma!G$2<>\"\",iniTurma!G47<>\"\"),(iniTurma!G47-iniTurma!G$1)/iniTurma!G$2,\"\")","v":""},{"$f":"IF(AND(iniTurma!H$2<>\"\",iniTurma!H47<>\"\"),(iniTurma!H47-iniTurma!H$1)/iniTurma!H$2,\"\")","v":""},{"$f":"IF(AND(iniTurma!I$2<>\"\",iniTurma!I47<>\"\"),(iniTurma!I47-iniTurma!I$1)/iniTurma!I$2,\"\")","v":""}]
[{"$f":"IF(iniTurma!B48<>\"\",iniTurma!B48,\"\")","v":""},{"$f":"iniTurma!A48","v":45},{"$f":"IF(iniTurma!C48<>\"\",iniTurma!C48,\"\")","v":""},{"$f":"IF(iniTurma!D48<>\"\",iniTurma!D48,\"\")","v":""},{"$f":"IF(AND(iniTurma!F$2<>\"\",iniTurma!F48<>\"\"),(iniTurma!F48-iniTurma!F$1)/iniTurma!F$2,\"\")","v":""},{"$f":"IF(AND(iniTurma!G$2<>\"\",iniTurma!G48<>\"\"),(iniTurma!G48-iniTurma!G$1)/iniTurma!G$2,\"\")","v":""},{"$f":"IF(AND(iniTurma!H$2<>\"\",iniTurma!H48<>\"\"),(iniTurma!H48-iniTurma!H$1)/iniTurma!H$2,\"\")","v":""},{"$f":"IF(AND(iniTurma!I$2<>\"\",iniTurma!I48<>\"\"),(iniTurma!I48-iniTurma!I$1)/iniTurma!I$2,\"\")","v":""}]
[{"$f":"IF(iniTurma!B49<>\"\",iniTurma!B49,\"\")","v":""},{"$f":"iniTurma!A49","v":46},{"$f":"IF(iniTurma!C49<>\"\",iniTurma!C49,\"\")","v":""},{"$f":"IF(iniTurma!D49<>\"\",iniTurma!D49,\"\")","v":""},{"$f":"IF(AND(iniTurma!F$2<>\"\",iniTurma!F49<>\"\"),(iniTurma!F49-iniTurma!F$1)/iniTurma!F$2,\"\")","v":""},{"$f":"IF(AND(iniTurma!G$2<>\"\",iniTurma!G49<>\"\"),(iniTurma!G49-iniTurma!G$1)/iniTurma!G$2,\"\")","v":""},{"$f":"IF(AND(iniTurma!H$2<>\"\",iniTurma!H49<>\"\"),(iniTurma!H49-iniTurma!H$1)/iniTurma!H$2,\"\")","v":""},{"$f":"IF(AND(iniTurma!I$2<>\"\",iniTurma!I49<>\"\"),(iniTurma!I49-iniTurma!I$1)/iniTurma!I$2,\"\")","v":""}]
[{"$f":"IF(iniTurma!B50<>\"\",iniTurma!B50,\"\")","v":""},{"$f":"iniTurma!A50","v":47},{"$f":"IF(iniTurma!C50<>\"\",iniTurma!C50,\"\")","v":""},{"$f":"IF(iniTurma!D50<>\"\",iniTurma!D50,\"\")","v":""},{"$f":"IF(AND(iniTurma!F$2<>\"\",iniTurma!F50<>\"\"),(iniTurma!F50-iniTurma!F$1)/iniTurma!F$2,\"\")","v":""},{"$f":"IF(AND(iniTurma!G$2<>\"\",iniTurma!G50<>\"\"),(iniTurma!G50-iniTurma!G$1)/iniTurma!G$2,\"\")","v":""},{"$f":"IF(AND(iniTurma!H$2<>\"\",iniTurma!H50<>\"\"),(iniTurma!H50-iniTurma!H$1)/iniTurma!H$2,\"\")","v":""},{"$f":"IF(AND(iniTurma!I$2<>\"\",iniTurma!I50<>\"\"),(iniTurma!I50-iniTurma!I$1)/iniTurma!I$2,\"\")","v":""}]
[{"$f":"IF(iniTurma!B51<>\"\",iniTurma!B51,\"\")","v":""},{"$f":"iniTurma!A51","v":48},{"$f":"IF(iniTurma!C51<>\"\",iniTurma!C51,\"\")","v":""},{"$f":"IF(iniTurma!D51<>\"\",iniTurma!D51,\"\")","v":""},{"$f":"IF(AND(iniTurma!F$2<>\"\",iniTurma!F51<>\"\"),(iniTurma!F51-iniTurma!F$1)/iniTurma!F$2,\"\")","v":""},{"$f":"IF(AND(iniTurma!G$2<>\"\",iniTurma!G51<>\"\"),(iniTurma!G51-iniTurma!G$1)/iniTurma!G$2,\"\")","v":""},{"$f":"IF(AND(iniTurma!H$2<>\"\",iniTurma!H51<>\"\"),(iniTurma!H51-iniTurma!H$1)/iniTurma!H$2,\"\")","v":""},{"$f":"IF(AND(iniTurma!I$2<>\"\",iniTurma!I51<>\"\"),(iniTurma!I51-iniTurma!I$1)/iniTurma!I$2,\"\")","v":""}]
[{"$f":"IF(iniTurma!B52<>\"\",iniTurma!B52,\"\")","v":""},{"$f":"iniTurma!A52","v":49},{"$f":"IF(iniTurma!C52<>\"\",iniTurma!C52,\"\")","v":""},{"$f":"IF(iniTurma!D52<>\"\",iniTurma!D52,\"\")","v":""},{"$f":"IF(AND(iniTurma!F$2<>\"\",iniTurma!F52<>\"\"),(iniTurma!F52-iniTurma!F$1)/iniTurma!F$2,\"\")","v":""},{"$f":"IF(AND(iniTurma!G$2<>\"\",iniTurma!G52<>\"\"),(iniTurma!G52-iniTurma!G$1)/iniTurma!G$2,\"\")","v":""},{"$f":"IF(AND(iniTurma!H$2<>\"\",iniTurma!H52<>\"\"),(iniTurma!H52-iniTurma!H$1)/iniTurma!H$2,\"\")","v":""},{"$f":"IF(AND(iniTurma!I$2<>\"\",iniTurma!I52<>\"\"),(iniTurma!I52-iniTurma!I$1)/iniTurma!I$2,\"\")","v":""}]
[{"$f":"IF(iniTurma!B53<>\"\",iniTurma!B53,\"\")","v":""},{"$f":"iniTurma!A53","v":50},{"$f":"IF(iniTurma!C53<>\"\",iniTurma!C53,\"\")","v":""},{"$f":"IF(iniTurma!D53<>\"\",iniTurma!D53,\"\")","v":""},{"$f":"IF(AND(iniTurma!F$2<>\"\",iniTurma!F53<>\"\"),(iniTurma!F53-iniTurma!F$1)/iniTurma!F$2,\"\")","v":""},{"$f":"IF(AND(iniTurma!G$2<>\"\",iniTurma!G53<>\"\"),(iniTurma!G53-iniTurma!G$1)/iniTurma!G$2,\"\")","v":""},{"$f":"IF(AND(iniTurma!H$2<>\"\",iniTurma!H53<>\"\"),(iniTurma!H53-iniTurma!H$1)/iniTurma!H$2,\"\")","v":""},{"$f":"IF(AND(iniTurma!I$2<>\"\",iniTurma!I53<>\"\"),(iniTurma!I53-iniTurma!I$1)/iniTurma!I$2,\"\")","v":""}]

{"sheet":"fimTurma","index":3,"n_rows":53,"n_cols":9,"rows_kept":53,"cut":false,"hidden":false,"merged":[]}
[null,"Ano:",{"$f":"IF(iniTurma!C1<>\"\",iniTurma!C1,\"\")","v":2},null,"Média:",{"$f":"IF(COUNTA(F4:F53)>0,AVERAGE(F4:F53),\"\")","v":14.916666666666666},{"$f":"IF(COUNTA(G4:G53)>0,AVERAGE(G4:G53),\"\")","v":11.75},7.7636363636363646,34.527272727272731]
[{"$f":"COUNTIF(B4:B53,\"x\")","v":1},"Turma:",{"$f":"IF(iniTurma!C2<>\"\",iniTurma!C2,\"\")","v":"A"},null,"Desvio-padrão:",{"$f":"IF(COUNTA(F4:F53)>0,_xlfn.STDEV.P(F4:F53),\"\")","v":1.3202482931462383},{"$f":"IF(COUNTA(G4:G53)>0,_xlfn.STDEV.P(G4:G53),\"\")","v":1.299038105676658},0.96603475118437687,3.0766247471394266]
["ID Aluno",{"$f":"_xlfn.CONCAT(\"Ver: \",COUNTIF(B4:B53,\"x\"))","v":"Ver: 1"},"Nome","Idade","Data",{"$f":"iniTurma!F3","v":"Agilidade"},{"$f":"iniTurma!G3","v":"Shuttle run 20m"},{"$f":"iniTurma!H3","v":"Força de preensão"},{"$f":"iniTurma!I3","v":"Salto horizontal"}]
[1,null,{"$f":"IF(iniTurma!C4<>\"\",iniTurma!C4,\"\")","v":"Micas"},13,"2025-06-08",15,12,6.5,35]
[{"$f":"A4+1","v":2},null,{"$f":"IF(iniTurma!C5<>\"\",iniTurma!C5,\"\")","v":"Tecas"},12,"2025-06-08",14,12,7]
[{"$f":"A5+1","v":3},null,{"$f":"IF(iniTurma!C6<>\"\",iniTurma!C6,\"\")","v":"Lecas"},15,"2025-06-08",13,13,8,34]
[4,"x",{"$f":"IF(iniTurma!C7<>\"\",iniTurma!C7,\"\")","v":"Becas"},8,"2025-06-08",14,11,null,39]
[5,null,{"$f":"IF(iniTurma!C8<>\"\",iniTurma!C8,\"\")","v":"Nocas"},11,"2025-06-08",15,14,7.2,41]
[6,null,{"$f":"IF(iniTurma!C9<>\"\",iniTurma!C9,\"\")","v":"Françoise Hardy"},13,"2025-06-08",16,12,8.4,36]
[7,null,{"$f":"IF(iniTurma!C10<>\"\",iniTurma!C10,\"\")","v":"Asterix"},16,"2025-06-09",17,10,8.1,32]
[8,null,{"$f":"IF(iniTurma!C11<>\"\",iniTurma!C11,\"\")","v":"Obelix"},14,"2025-06-09",13,9,7,30]
[9,null,{"$f":"IF(iniTurma!C12<>\"\",iniTurma!C12,\"\")","v":"Ideiafix"},14,"2025-06-09",14,11,7.2,32.200000000000003]
[10,null,{"$f":"IF(iniTurma!C13<>\"\",iniTurma!C13,\"\")","v":"Sylvie Vartan"},14,"2025-06-09",15,12,8.3000000000000007,35.1]
[11,null,{"$f":"IF(iniTurma!C14<>\"\",iniTurma!C14,\"\")","v":"Carlos Lopes"},14,"2025-06-09",16,12,10.199999999999999,33.299999999999997]
[12,null,{"$f":"IF(iniTurma!C15<>\"\",iniTurma!C15,\"\")","v":"Rosa Mota"},14,"2025-06-09",17,13,7.5,32.200000000000003]
[13,null,{"$f":"IF(iniTurma!C16<>\"\",iniTurma!C16,\"\")","v":""}]
[14,null,{"$f":"IF(iniTurma!C17<>\"\",iniTurma!C17,\"\")","v":""}]
[15,null,{"$f":"IF(iniTurma!C18<>\"\",iniTurma!C18,\"\")","v":""}]
[16,null,{"$f":"IF(iniTurma!C19<>\"\",iniTurma!C19,\"\")","v":""}]
[17,null,{"$f":"IF(iniTurma!C20<>\"\",iniTurma!C20,\"\")","v":""}]
[18,null,{"$f":"IF(iniTurma!C21<>\"\",iniTurma!C21,\"\")","v":""}]
[19,null,{"$f":"IF(iniTurma!C22<>\"\",iniTurma!C22,\"\")","v":""}]
[20,null,{"$f":"IF(iniTurma!C23<>\"\",iniTurma!C23,\"\")","v":""}]
[21,null,{"$f":"IF(iniTurma!C24<>\"\",iniTurma!C24,\"\")","v":""}]
[22,null,{"$f":"IF(iniTurma!C25<>\"\",iniTurma!C25,\"\")","v":""}]
[23,null,{"$f":"IF(iniTurma!C26<>\"\",iniTurma!C26,\"\")","v":""}]
[24,null,{"$f":"IF(iniTurma!C27<>\"\",iniTurma!C27,\"\")","v":""}]
[25,null,{"$f":"IF(iniTurma!C28<>\"\",iniTurma!C28,\"\")","v":""}]
[26,null,{"$f":"IF(iniTurma!C29<>\"\",iniTurma!C29,\"\")","v":""}]
[27,null,{"$f":"IF(iniTurma!C30<>\"\",iniTurma!C30,\"\")","v":""}]
[28,null,{"$f":"IF(iniTurma!C31<>\"\",iniTurma!C31,\"\")","v":""}]
[29,null,{"$f":"IF(iniTurma!C32<>\"\",iniTurma!C32,\"\")","v":""}]
[30,null,{"$f":"IF(iniTurma!C33<>\"\",iniTurma!C33,\"\")","v":""}]
[31,null,{"$f":"IF(iniTurma!C34<>\"\",iniTurma!C34,\"\")","v":""}]
[32,null,{"$f":"IF(iniTurma!C35<>\"\",iniTurma!C35,\"\")","v":""}]
[33,null,{"$f":"IF(iniTurma!C36<>\"\",iniTurma!C36,\"\")","v":""}]
[34,null,{"$f":"IF(iniTurma!C37<>\"\",iniTurma!C37,\"\")","v":""}]
[35,null,{"$f":"IF(iniTurma!C38<>\"\",iniTurma!C38,\"\")","v":""}]
[36,null,{"$f":"IF(iniTurma!C39<>\"\",iniTurma!C39,\"\")","v":""}]
[37,null,{"$f":"IF(iniTurma!C40<>\"\",iniTurma!C40,\"\")","v":""}]
[38,null,{"$f":"IF(iniTurma!C41<>\"\",iniTurma!C41,\"\")","v":""}]
[39,null,{"$f":"IF(iniTurma!C42<>\"\",iniTurma!C42,\"\")","v":""}]
[40,null,{"$f":"IF(iniTurma!C43<>\"\",iniTurma!C43,\"\")","v":""}]
[41,null,{"$f":"IF(iniTurma!C44<>\"\",iniTurma!C44,\"\")","v":""}]
[42,null,{"$f":"IF(iniTurma!C45<>\"\",iniTurma!C45,\"\")","v":""}]
[43,null,{"$f":"IF(iniTurma!C46<>\"\",iniTurma!C46,\"\")","v":""}]
[44,null,{"$f":"IF(iniTurma!C47<>\"\",iniTurma!C47,\"\")","v":""}]
[45,null,{"$f":"IF(iniTurma!C48<>\"\",iniTurma!C48,\"\")","v":""}]
[46,null,{"$f":"IF(iniTurma!C49<>\"\",iniTurma!C49,\"\")","v":""}]
[47,null,{"$f":"IF(iniTurma!C50<>\"\",iniTurma!C50,\"\")","v":""}]
[48,null,{"$f":"IF(iniTurma!C51<>\"\",iniTurma!C51,\"\")","v":""}]
[49,null,{"$f":"IF(iniTurma!C52<>\"\",iniTurma!C52,\"\")","v":""}]
[50,null,{"$f":"IF(iniTurma!C53<>\"\",iniTurma!C53,\"\")","v":""}]

{"sheet":"fimRelatório","index":4,"n_rows":25,"n_cols":8,"rows_kept":25,"cut":false,"hidden":false,"merged":[]}
["RELATÓRIO INDIVIDUAL PREFIT BATTERY"]
[{"$f":"IF(fimTurma!A2=1,VLOOKUP(\"x\",fimTurma!B$4:M$53,2,0),\"\")","v":"Becas"}]
[{"$f":"IF(fimTurma!A2=1,_xlfn.CONCAT(TEXT(VLOOKUP(\"x\",fimTurma!B$4:M$53,4,0),\"dd-mm-aaaa\"),\" | \",fimTurma!C1,\"º ano\",\" | \",fimTurma!C2),\"\")","v":"08-06-2025 | 2º ano | A"}]
[]
[null,"Resultado",null,"Média ",null,"Mínimo",null,"Máximo"]
[null,"da criança",null,"da turma",null,"da turma",null,"da turma"]
[{"$f":"iniRelatório!A7","v":"APTIDÃO MOTORA"}]
[{"$f":"IF(fimTurma!A2=1,IFERROR(VLOOKUP(1,fimAuxiliar!L3:Q3,2,0),\"\"),\"\")","v":"Agilidade"},{"$f":"IF(fimTurma!A2=1,IFERROR(VLOOKUP(1,fimAuxiliar!L3:Q3,3,0),0),0)","v":14},null,{"$f":"IF(fimTurma!A2=1,IFERROR(VLOOKUP(1,fimAuxiliar!L3:Q3,4,0),0),0)","v":14.916666666666666},null,{"$f":"IF(fimTurma!A2=1,IFERROR(VLOOKUP(1,fimAuxiliar!L3:Q3,5,0),0),0)","v":13},null,{"$f":"IF(fimTurma!A2=1,IFERROR(VLOOKUP(1,fimAuxiliar!L3:Q3,6,0),0),0)","v":17}]
[]
[]
[]
[{"$f":"iniRelatório!A12","v":"APTIDÃO CARDIORRESPIRATÓRIA"}]
[{"$f":"IF(fimTurma!A2=1,IFERROR(VLOOKUP(1,fimAuxiliar!L4:Q4,2,0),\"\"),\"\")","v":"Shuttle run 20m"},{"$f":"IF(fimTurma!A2=1,IFERROR(VLOOKUP(1,fimAuxiliar!L4:Q4,3,0),0),0)","v":11},null,{"$f":"IF(fimTurma!A2=1,IFERROR(VLOOKUP(1,fimAuxiliar!L4:Q4,4,0),0),0)","v":11.75},null,{"$f":"IF(fimTurma!A2=1,IFERROR(VLOOKUP(1,fimAuxiliar!L4:Q4,5,0),0),0)","v":9},null,{"$f":"IF(fimTurma!A2=1,IFERROR(VLOOKUP(1,fimAuxiliar!L4:Q4,6,0),0),0)","v":14}]
[]
[]
[]
[{"$f":"iniRelatório!A17","v":"APTIDÃO MOTORA"}]
[{"$f":"IF(fimTurma!A2=1,IFERROR(VLOOKUP(1,fimAuxiliar!L5:Q6,2,0),\"\"),\"\")","v":"Força de preensão"},{"$f":"IF(fimTurma!A2=1,IFERROR(VLOOKUP(1,fimAuxiliar!L5:Q6,3,0),0),0)","v":0},null,{"$f":"IF(fimTurma!A2=1,IFERROR(VLOOKUP(1,fimAuxiliar!L5:Q6,4,0),0),0)","v":7.7636363636363646},null,{"$f":"IF(fimTurma!A2=1,IFERROR(VLOOKUP(1,fimAuxiliar!L5:Q6,5,0),0),0)","v":6.5},null,{"$f":"IF(fimTurma!A2=1,IFERROR(VLOOKUP(1,fimAuxiliar!L5:Q6,6,0),0),0)","v":10.199999999999999}]
[]
[{"$f":"IF(fimTurma!A2=1,IFERROR(VLOOKUP(2,fimAuxiliar!L5:Q6,2,0),\"\"),\"\")","v":"Salto horizontal"},{"$f":"IF(fimTurma!A2=1,IFERROR(VLOOKUP(2,fimAuxiliar!L5:Q6,3,0),0),0)","v":39},null,{"$f":"IF(fimTurma!A2=1,IFERROR(VLOOKUP(2,fimAuxiliar!L5:Q6,4,0),0),0)","v":34.527272727272731},null,{"$f":"IF(fimTurma!A2=1,IFERROR(VLOOKUP(2,fimAuxiliar!L5:Q6,5,0),0),0)","v":30},null,{"$f":"IF(fimTurma!A2=1,IFERROR(VLOOKUP(2,fimAuxiliar!L5:Q6,6,0),0),0)","v":41}]
[]
[]
[]
[]
["Perfil multivariado"]

{"sheet":"fimScore Z","index":5,"n_rows":53,"n_cols":8,"rows_kept":53,"cut":false,"hidden":false,"merged":[]}
[]
[]
[{"$f":"fimTurma!B3","v":"Ver: 1"},{"$f":"fimTurma!A3","v":"ID Aluno"},{"$f":"fimTurma!C3","v":"Nome"},"Idade",{"$f":"fimTurma!F3","v":"Agilidade"},{"$f":"fimTurma!G3","v":"Shuttle run 20m"},{"$f":"fimTurma!H3","v":"Força de preensão"},{"$f":"fimTurma!I3","v":"Salto horizontal"}]
[{"$f":"IF(fimTurma!B4<>\"\",fimTurma!B4,\"\")","v":""},{"$f":"fimTurma!A4","v":1},{"$f":"IF(fimTurma!C4<>\"\",fimTurma!C4,\"\")","v":"Micas"},{"$f":"IF(fimTurma!D4<>\"\",fimTurma!D4,\"\")","v":13},{"$f":"IF(AND(fimTurma!F$2<>\"\",fimTurma!F4<>\"\"),(fimTurma!F4-fimTurma!F$1)/fimTurma!F$2,\"\")","v":6.3119440309780769E-2},{"$f":"IF(AND(fimTurma!G$2<>\"\",fimTurma!G4<>\"\"),(fimTurma!G4-fimTurma!G$1)/fimTurma!G$2,\"\")","v":0.19245008972987526},{"$f":"IF(AND(fimTurma!H$2<>\"\",fimTurma!H4<>\"\"),(fimTurma!H4-fimTurma!H$1)/fimTurma!H$2,\"\")","v":-1.3080651209359937},{"$f":"IF(AND(fimTurma!I$2<>\"\",fimTurma!I4<>\"\"),(fimTurma!I4-fimTurma!I$1)/fimTurma!I$2,\"\")","v":0.1536512612293065}]
[{"$f":"IF(fimTurma!B5<>\"\",fimTurma!B5,\"\")","v":""},{"$f":"fimTurma!A5","v":2},{"$f":"IF(fimTurma!C5<>\"\",fimTurma!C5,\"\")","v":"Tecas"},{"$f":"IF(fimTurma!D5<>\"\",fimTurma!D5,\"\")","v":12},{"$f":"IF(AND(fimTurma!F$2<>\"\",fimTurma!F5<>\"\"),(fimTurma!F5-fimTurma!F$1)/fimTurma!F$2,\"\")","v":-0.69431384340758306},{"$f":"IF(AND(fimTurma!G$2<>\"\",fimTurma!G5<>\"\"),(fimTurma!G5-fimTurma!G$1)/fimTurma!G$2,\"\")","v":0.19245008972987526},{"$f":"IF(AND(fimTurma!H$2<>\"\",fimTurma!H5<>\"\"),(fimTurma!H5-fimTurma!H$1)/fimTurma!H$2,\"\")","v":-0.7904853968246297},{"$f":"IF(AND(fimTurma!I$2<>\"\",fimTurma!I5<>\"\"),(fimTurma!I5-fimTurma!I$1)/fimTurma!I$2,\"\")","v":""}]
[{"$f":"IF(fimTurma!B6<>\"\",fimTurma!B6,\"\")","v":""},{"$f":"fimTurma!A6","v":3},{"$f":"IF(fimTurma!C6<>\"\",fimTurma!C6,\"\")","v":"Lecas"},{"$f":"IF(fimTurma!D6<>\"\",fimTurma!D6,\"\")","v":15},{"$f":"IF(AND(fimTurma!F$2<>\"\",fimTurma!F6<>\"\"),(fimTurma!F6-fimTurma!F$1)/fimTurma!F$2,\"\")","v":-1.4517471271249469},{"$f":"IF(AND(fimTurma!G$2<>\"\",fimTurma!G6<>\"\"),(fimTurma!G6-fimTurma!G$1)/fimTurma!G$2,\"\")","v":0.96225044864937626},{"$f":"IF(AND(fimTurma!H$2<>\"\",fimTurma!H6<>\"\"),(fimTurma!H6-fimTurma!H$1)/fimTurma!H$2,\"\")","v":0.24467405139809842},{"$f":"IF(AND(fimTurma!I$2<>\"\",fimTurma!I6<>\"\"),(fimTurma!I6-fimTurma!I$1)/fimTurma!I$2,\"\")","v":-0.17138025290961359}]
[{"$f":"IF(fimTurma!B7<>\"\",fimTurma!B7,\"\")","v":"x"},{"$f":"fimTurma!A7","v":4},{"$f":"IF(fimTurma!C7<>\"\",fimTurma!C7,\"\")","v":"Becas"},{"$f":"IF(fimTurma!D7<>\"\",fimTurma!D7,\"\")","v":8},{"$f":"IF(AND(fimTurma!F$2<>\"\",fimTurma!F7<>\"\"),(fimTurma!F7-fimTurma!F$1)/fimTurma!F$2,\"\")","v":-0.69431384340758306},{"$f":"IF(AND(fimTurma!G$2<>\"\",fimTurma!G7<>\"\"),(fimTurma!G7-fimTurma!G$1)/fimTurma!G$2,\"\")","v":-0.57735026918962573},{"$f":"IF(AND(fimTurma!H$2<>\"\",fimTurma!H7<>\"\"),(fimTurma!H7-fimTurma!H$1)/fimTurma!H$2,\"\")","v":""},{"$f":"IF(AND(fimTurma!I$2<>\"\",fimTurma!I7<>\"\"),(fimTurma!I7-fimTurma!I$1)/fimTurma!I$2,\"\")","v":1.4537773177849869}]
[{"$f":"IF(fimTurma!B8<>\"\",fimTurma!B8,\"\")","v":""},{"$f":"fimTurma!A8","v":5},{"$f":"IF(fimTurma!C8<>\"\",fimTurma!C8,\"\")","v":"Nocas"},{"$f":"IF(fimTurma!D8<>\"\",fimTurma!D8,\"\")","v":11},{"$f":"IF(AND(fimTurma!F$2<>\"\",fimTurma!F8<>\"\"),(fimTurma!F8-fimTurma!F$1)/fimTurma!F$2,\"\")","v":6.3119440309780769E-2},{"$f":"IF(AND(fimTurma!G$2<>\"\",fimTurma!G8<>\"\"),(fimTurma!G8-fimTurma!G$1)/fimTurma!G$2,\"\")","v":1.7320508075688772},{"$f":"IF(AND(fimTurma!H$2<>\"\",fimTurma!H8<>\"\"),(fimTurma!H8-fimTurma!H$1)/fimTurma!H$2,\"\")","v":-0.58345350718008393},{"$f":"IF(AND(fimTurma!I$2<>\"\",fimTurma!I8<>\"\"),(fimTurma!I8-fimTurma!I$1)/fimTurma!I$2,\"\")","v":2.1038403460628272}]
[{"$f":"IF(fimTurma!B9<>\"\",fimTurma!B9,\"\")","v":""},{"$f":"fimTurma!A9","v":6},{"$f":"IF(fimTurma!C9<>\"\",fimTurma!C9,\"\")","v":"Françoise Hardy"},{"$f":"IF(fimTurma!D9<>\"\",fimTurma!D9,\"\")","v":13},{"$f":"IF(AND(fimTurma!F$2<>\"\",fimTurma!F9<>\"\"),(fimTurma!F9-fimTurma!F$1)/fimTurma!F$2,\"\")","v":0.82055272402714463},{"$f":"IF(AND(fimTurma!G$2<>\"\",fimTurma!G9<>\"\"),(fimTurma!G9-fimTurma!G$1)/fimTurma!G$2,\"\")","v":0.19245008972987526},{"$f":"IF(AND(fimTurma!H$2<>\"\",fimTurma!H9<>\"\"),(fimTurma!H9-fimTurma!H$1)/fimTurma!H$2,\"\")","v":0.65873783068719005},{"$f":"IF(AND(fimTurma!I$2<>\"\",fimTurma!I9<>\"\"),(fimTurma!I9-fimTurma!I$1)/fimTurma!I$2,\"\")","v":0.47868277536822662}]
[{"$f":"IF(fimTurma!B10<>\"\",fimTurma!B10,\"\")","v":""},{"$f":"fimTurma!A10","v":7},{"$f":"IF(fimTurma!C10<>\"\",fimTurma!C10,\"\")","v":"Asterix"},{"$f":"IF(fimTurma!D10<>\"\",fimTurma!D10,\"\")","v":16},{"$f":"IF(AND(fimTurma!F$2<>\"\",fimTurma!F10<>\"\"),(fimTurma!F10-fimTurma!F$1)/fimTurma!F$2,\"\")","v":1.5779860077445085},{"$f":"IF(AND(fimTurma!G$2<>\"\",fimTurma!G10<>\"\"),(fimTurma!G10-fimTurma!G$1)/fimTurma!G$2,\"\")","v":-1.3471506281091268},{"$f":"IF(AND(fimTurma!H$2<>\"\",fimTurma!H10<>\"\"),(fimTurma!H10-fimTurma!H$1)/fimTurma!H$2,\"\")","v":0.34818999622037083},{"$f":"IF(AND(fimTurma!I$2<>\"\",fimTurma!I10<>\"\"),(fimTurma!I10-fimTurma!I$1)/fimTurma!I$2,\"\")","v":-0.8214432811874538}]
[{"$f":"IF(fimTurma!B11<>\"\",fimTurma!B11,\"\")","v":""},{"$f":"fimTurma!A11","v":8},{"$f":"IF(fimTurma!C11<>\"\",fimTurma!C11,\"\")","v":"Obelix"},{"$f":"IF(fimTurma!D11<>\"\",fimTurma!D11,\"\")","v":14},{"$f":"IF(AND(fimTurma!F$2<>\"\",fimTurma!F11<>\"\"),(fimTurma!F11-fimTurma!F$1)/fimTurma!F$2,\"\")","v":-1.4517471271249469},{"$f":"IF(AND(fimTurma!G$2<>\"\",fimTurma!G11<>\"\"),(fimTurma!G11-fimTurma!G$1)/fimTurma!G$2,\"\")","v":-2.1169509870286278},{"$f":"IF(AND(fimTurma!H$2<>\"\",fimTurma!H11<>\"\"),(fimTurma!H11-fimTurma!H$1)/fimTurma!H$2,\"\")","v":-0.7904853968246297},{"$f":"IF(AND(fimTurma!I$2<>\"\",fimTurma!I11<>\"\"),(fimTurma!I11-fimTurma!I$1)/fimTurma!I$2,\"\")","v":-1.471506309465294}]
[{"$f":"IF(fimTurma!B12<>\"\",fimTurma!B12,\"\")","v":""},{"$f":"fimTurma!A12","v":9},{"$f":"IF(fimTurma!C12<>\"\",fimTurma!C12,\"\")","v":"Ideiafix"},{"$f":"IF(fimTurma!D12<>\"\",fimTurma!D12,\"\")","v":14},{"$f":"IF(AND(fimTurma!F$2<>\"\",fimTurma!F12<>\"\"),(fimTurma!F12-fimTurma!F$1)/fimTurma!F$2,\"\")","v":-0.69431384340758306},{"$f":"IF(AND(fimTurma!G$2<>\"\",fimTurma!G12<>\"\"),(fimTurma!G12-fimTurma!G$1)/fimTurma!G$2,\"\")","v":-0.57735026918962573},{"$f":"IF(AND(fimTurma!H$2<>\"\",fimTurma!H12<>\"\"),(fimTurma!H12-fimTurma!H$1)/fimTurma!H$2,\"\")","v":-0.58345350718008393},{"$f":"IF(AND(fimTurma!I$2<>\"\",fimTurma!I12<>\"\"),(fimTurma!I12-fimTurma!I$1)/fimTurma!I$2,\"\")","v":-0.75643697835966883}]
[{"$f":"IF(fimTurma!B13<>\"\",fimTurma!B13,\"\")","v":""},{"$f":"fimTurma!A13","v":10},{"$f":"IF(fimTurma!C13<>\"\",fimTurma!C13,\"\")","v":"Sylvie Vartan"},{"$f":"IF(fimTurma!D13<>\"\",fimTurma!D13,\"\")","v":14},{"$f":"IF(AND(fimTurma!F$2<>\"\",fimTurma!F13<>\"\"),(fimTurma!F13-fimTurma!F$1)/fimTurma!F$2,\"\")","v":6.3119440309780769E-2},{"$f":"IF(AND(fimTurma!G$2<>\"\",fimTurma!G13<>\"\"),(fimTurma!G13-fimTurma!G$1)/fimTurma!G$2,\"\")","v":0.19245008972987526},{"$f":"IF(AND(fimTurma!H$2<>\"\",fimTurma!H13<>\"\"),(fimTurma!H13-fimTurma!H$1)/fimTurma!H$2,\"\")","v":0.55522188586491761},{"$f":"IF(AND(fimTurma!I$2<>\"\",fimTurma!I13<>\"\"),(fimTurma!I13-fimTurma!I$1)/fimTurma!I$2,\"\")","v":0.18615441264319899}]
[{"$f":"IF(fimTurma!B14<>\"\",fimTurma!B14,\"\")","v":""},{"$f":"fimTurma!A14","v":11},{"$f":"IF(fimTurma!C14<>\"\",fimTurma!C14,\"\")","v":"Carlos Lopes"},{"$f":"IF(fimTurma!D14<>\"\",fimTurma!D14,\"\")","v":14},{"$f":"IF(AND(fimTurma!F$2<>\"\",fimTurma!F14<>\"\"),(fimTurma!F14-fimTurma!F$1)/fimTurma!F$2,\"\")","v":0.82055272402714463},{"$f":"IF(AND(fimTurma!G$2<>\"\",fimTurma!G14<>\"\"),(fimTurma!G14-fimTurma!G$1)/fimTurma!G$2,\"\")","v":0.19245008972987526},{"$f":"IF(AND(fimTurma!H$2<>\"\",fimTurma!H14<>\"\"),(fimTurma!H14-fimTurma!H$1)/fimTurma!H$2,\"\")","v":2.5220248374880994},{"$f":"IF(AND(fimTurma!I$2<>\"\",fimTurma!I14<>\"\"),(fimTurma!I14-fimTurma!I$1)/fimTurma!I$2,\"\")","v":-0.39890231280685856}]
[{"$f":"IF(fimTurma!B15<>\"\",fimTurma!B15,\"\")","v":""},{"$f":"fimTurma!A15","v":12},{"$f":"IF(fimTurma!C15<>\"\",fimTurma!C15,\"\")","v":"Rosa Mota"},{"$f":"IF(fimTurma!D15<>\"\",fimTurma!D15,\"\")","v":14},{"$f":"IF(AND(fimTurma!F$2<>\"\",fimTurma!F15<>\"\"),(fimTurma!F15-fimTurma!F$1)/fimTurma!F$2,\"\")","v":1.5779860077445085},{"$f":"IF(AND(fimTurma!G$2<>\"\",fimTurma!G15<>\"\"),(fimTurma!G15-fimTurma!G$1)/fimTurma!G$2,\"\")","v":0.96225044864937626},{"$f":"IF(AND(fimTurma!H$2<>\"\",fimTurma!H15<>\"\"),(fimTurma!H15-fimTurma!H$1)/fimTurma!H$2,\"\")","v":-0.27290567271326566},{"$f":"IF(AND(fimTurma!I$2<>\"\",fimTurma!I15<>\"\"),(fimTurma!I15-fimTurma!I$1)/fimTurma!I$2,\"\")","v":-0.75643697835966883}]
[{"$f":"IF(fimTurma!B16<>\"\",fimTurma!B16,\"\")","v":""},{"$f":"fimTurma!A16","v":13},{"$f":"IF(fimTurma!C16<>\"\",fimTurma!C16,\"\")","v":""},{"$f":"IF(fimTurma!D16<>\"\",fimTurma!D16,\"\")","v":""},{"$f":"IF(AND(fimTurma!F$2<>\"\",fimTurma!F16<>\"\"),(fimTurma!F16-fimTurma!F$1)/fimTurma!F$2,\"\")","v":""},{"$f":"IF(AND(fimTurma!G$2<>\"\",fimTurma!G16<>\"\"),(fimTurma!G16-fimTurma!G$1)/fimTurma!G$2,\"\")","v":""},{"$f":"IF(AND(fimTurma!H$2<>\"\",fimTurma!H16<>\"\"),(fimTurma!H16-fimTurma!H$1)/fimTurma!H$2,\"\")","v":""},{"$f":"IF(AND(fimTurma!I$2<>\"\",fimTurma!I16<>\"\"),(fimTurma!I16-fimTurma!I$1)/fimTurma!I$2,\"\")","v":""}]
[{"$f":"IF(fimTurma!B17<>\"\",fimTurma!B17,\"\")","v":""},{"$f":"fimTurma!A17","v":14},{"$f":"IF(fimTurma!C17<>\"\",fimTurma!C17,\"\")","v":""},{"$f":"IF(fimTurma!D17<>\"\",fimTurma!D17,\"\")","v":""},{"$f":"IF(AND(fimTurma!F$2<>\"\",fimTurma!F17<>\"\"),(fimTurma!F17-fimTurma!F$1)/fimTurma!F$2,\"\")","v":""},{"$f":"IF(AND(fimTurma!G$2<>\"\",fimTurma!G17<>\"\"),(fimTurma!G17-fimTurma!G$1)/fimTurma!G$2,\"\")","v":""},{"$f":"IF(AND(fimTurma!H$2<>\"\",fimTurma!H17<>\"\"),(fimTurma!H17-fimTurma!H$1)/fimTurma!H$2,\"\")","v":""},{"$f":"IF(AND(fimTurma!I$2<>\"\",fimTurma!I17<>\"\"),(fimTurma!I17-fimTurma!I$1)/fimTurma!I$2,\"\")","v":""}]
[{"$f":"IF(fimTurma!B18<>\"\",fimTurma!B18,\"\")","v":""},{"$f":"fimTurma!A18","v":15},{"$f":"IF(fimTurma!C18<>\"\",fimTurma!C18,\"\")","v":""},{"$f":"IF(fimTurma!D18<>\"\",fimTurma!D18,\"\")","v":""},{"$f":"IF(AND(fimTurma!F$2<>\"\",fimTurma!F18<>\"\"),(fimTurma!F18-fimTurma!F$1)/fimTurma!F$2,\"\")","v":""},{"$f":"IF(AND(fimTurma!G$2<>\"\",fimTurma!G18<>\"\"),(fimTurma!G18-fimTurma!G$1)/fimTurma!G$2,\"\")","v":""},{"$f":"IF(AND(fimTurma!H$2<>\"\",fimTurma!H18<>\"\"),(fimTurma!H18-fimTurma!H$1)/fimTurma!H$2,\"\")","v":""},{"$f":"IF(AND(fimTurma!I$2<>\"\",fimTurma!I18<>\"\"),(fimTurma!I18-fimTurma!I$1)/fimTurma!I$2,\"\")","v":""}]
[{"$f":"IF(fimTurma!B19<>\"\",fimTurma!B19,\"\")","v":""},{"$f":"fimTurma!A19","v":16},{"$f":"IF(fimTurma!C19<>\"\",fimTurma!C19,\"\")","v":""},{"$f":"IF(fimTurma!D19<>\"\",fimTurma!D19,\"\")","v":""},{"$f":"IF(AND(fimTurma!F$2<>\"\",fimTurma!F19<>\"\"),(fimTurma!F19-fimTurma!F$1)/fimTurma!F$2,\"\")","v":""},{"$f":"IF(AND(fimTurma!G$2<>\"\",fimTurma!G19<>\"\"),(fimTurma!G19-fimTurma!G$1)/fimTurma!G$2,\"\")","v":""},{"$f":"IF(AND(fimTurma!H$2<>\"\",fimTurma!H19<>\"\"),(fimTurma!H19-fimTurma!H$1)/fimTurma!H$2,\"\")","v":""},{"$f":"IF(AND(fimTurma!I$2<>\"\",fimTurma!I19<>\"\"),(fimTurma!I19-fimTurma!I$1)/fimTurma!I$2,\"\")","v":""}]
[{"$f":"IF(fimTurma!B20<>\"\",fimTurma!B20,\"\")","v":""},{"$f":"fimTurma!A20","v":17},{"$f":"IF(fimTurma!C20<>\"\",fimTurma!C20,\"\")","v":""},{"$f":"IF(fimTurma!D20<>\"\",fimTurma!D20,\"\")","v":""},{"$f":"IF(AND(fimTurma!F$2<>\"\",fimTurma!F20<>\"\"),(fimTurma!F20-fimTurma!F$1)/fimTurma!F$2,\"\")","v":""},{"$f":"IF(AND(fimTurma!G$2<>\"\",fimTurma!G20<>\"\"),(fimTurma!G20-fimTurma!G$1)/fimTurma!G$2,\"\")","v":""},{"$f":"IF(AND(fimTurma!H$2<>\"\",fimTurma!H20<>\"\"),(fimTurma!H20-fimTurma!H$1)/fimTurma!H$2,\"\")","v":""},{"$f":"IF(AND(fimTurma!I$2<>\"\",fimTurma!I20<>\"\"),(fimTurma!I20-fimTurma!I$1)/fimTurma!I$2,\"\")","v":""}]
[{"$f":"IF(fimTurma!B21<>\"\",fimTurma!B21,\"\")","v":""},{"$f":"fimTurma!A21","v":18},{"$f":"IF(fimTurma!C21<>\"\",fimTurma!C21,\"\")","v":""},{"$f":"IF(fimTurma!D21<>\"\",fimTurma!D21,\"\")","v":""},{"$f":"IF(AND(fimTurma!F$2<>\"\",fimTurma!F21<>\"\"),(fimTurma!F21-fimTurma!F$1)/fimTurma!F$2,\"\")","v":""},{"$f":"IF(AND(fimTurma!G$2<>\"\",fimTurma!G21<>\"\"),(fimTurma!G21-fimTurma!G$1)/fimTurma!G$2,\"\")","v":""},{"$f":"IF(AND(fimTurma!H$2<>\"\",fimTurma!H21<>\"\"),(fimTurma!H21-fimTurma!H$1)/fimTurma!H$2,\"\")","v":""},{"$f":"IF(AND(fimTurma!I$2<>\"\",fimTurma!I21<>\"\"),(fimTurma!I21-fimTurma!I$1)/fimTurma!I$2,\"\")","v":""}]
[{"$f":"IF(fimTurma!B22<>\"\",fimTurma!B22,\"\")","v":""},{"$f":"fimTurma!A22","v":19},{"$f":"IF(fimTurma!C22<>\"\",fimTurma!C22,\"\")","v":""},{"$f":"IF(fimTurma!D22<>\"\",fimTurma!D22,\"\")","v":""},{"$f":"IF(AND(fimTurma!F$2<>\"\",fimTurma!F22<>\"\"),(fimTurma!F22-fimTurma!F$1)/fimTurma!F$2,\"\")","v":""},{"$f":"IF(AND(fimTurma!G$2<>\"\",fimTurma!G22<>\"\"),(fimTurma!G22-fimTurma!G$1)/fimTurma!G$2,\"\")","v":""},{"$f":"IF(AND(fimTurma!H$2<>\"\",fimTurma!H22<>\"\"),(fimTurma!H22-fimTurma!H$1)/fimTurma!H$2,\"\")","v":""},{"$f":"IF(AND(fimTurma!I$2<>\"\",fimTurma!I22<>\"\"),(fimTurma!I22-fimTurma!I$1)/fimTurma!I$2,\"\")","v":""}]
[{"$f":"IF(fimTurma!B23<>\"\",fimTurma!B23,\"\")","v":""},{"$f":"fimTurma!A23","v":20},{"$f":"IF(fimTurma!C23<>\"\",fimTurma!C23,\"\")","v":""},{"$f":"IF(fimTurma!D23<>\"\",fimTurma!D23,\"\")","v":""},{"$f":"IF(AND(fimTurma!F$2<>\"\",fimTurma!F23<>\"\"),(fimTurma!F23-fimTurma!F$1)/fimTurma!F$2,\"\")","v":""},{"$f":"IF(AND(fimTurma!G$2<>\"\",fimTurma!G23<>\"\"),(fimTurma!G23-fimTurma!G$1)/fimTurma!G$2,\"\")","v":""},{"$f":"IF(AND(fimTurma!H$2<>\"\",fimTurma!H23<>\"\"),(fimTurma!H23-fimTurma!H$1)/fimTurma!H$2,\"\")","v":""},{"$f":"IF(AND(fimTurma!I$2<>\"\",fimTurma!I23<>\"\"),(fimTurma!I23-fimTurma!I$1)/fimTurma!I$2,\"\")","v":""}]
[{"$f":"IF(fimTurma!B24<>\"\",fimTurma!B24,\"\")","v":""},{"$f":"fimTurma!A24","v":21},{"$f":"IF(fimTurma!C24<>\"\",fimTurma!C24,\"\")","v":""},{"$f":"IF(fimTurma!D24<>\"\",fimTurma!D24,\"\")","v":""},{"$f":"IF(AND(fimTurma!F$2<>\"\",fimTurma!F24<>\"\"),(fimTurma!F24-fimTurma!F$1)/fimTurma!F$2,\"\")","v":""},{"$f":"IF(AND(fimTurma!G$2<>\"\",fimTurma!G24<>\"\"),(fimTurma!G24-fimTurma!G$1)/fimTurma!G$2,\"\")","v":""},{"$f":"IF(AND(fimTurma!H$2<>\"\",fimTurma!H24<>\"\"),(fimTurma!H24-fimTurma!H$1)/fimTurma!H$2,\"\")","v":""},{"$f":"IF(AND(fimTurma!I$2<>\"\",fimTurma!I24<>\"\"),(fimTurma!I24-fimTurma!I$1)/fimTurma!I$2,\"\")","v":""}]
[{"$f":"IF(fimTurma!B25<>\"\",fimTurma!B25,\"\")","v":""},{"$f":"fimTurma!A25","v":22},{"$f":"IF(fimTurma!C25<>\"\",fimTurma!C25,\"\")","v":""},{"$f":"IF(fimTurma!D25<>\"\",fimTurma!D25,\"\")","v":""},{"$f":"IF(AND(fimTurma!F$2<>\"\",fimTurma!F25<>\"\"),(fimTurma!F25-fimTurma!F$1)/fimTurma!F$2,\"\")","v":""},{"$f":"IF(AND(fimTurma!G$2<>\"\",fimTurma!G25<>\"\"),(fimTurma!G25-fimTurma!G$1)/fimTurma!G$2,\"\")","v":""},{"$f":"IF(AND(fimTurma!H$2<>\"\",fimTurma!H25<>\"\"),(fimTurma!H25-fimTurma!H$1)/fimTurma!H$2,\"\")","v":""},{"$f":"IF(AND(fimTurma!I$2<>\"\",fimTurma!I25<>\"\"),(fimTurma!I25-fimTurma!I$1)/fimTurma!I$2,\"\")","v":""}]
[{"$f":"IF(fimTurma!B26<>\"\",fimTurma!B26,\"\")","v":""},{"$f":"fimTurma!A26","v":23},{"$f":"IF(fimTurma!C26<>\"\",fimTurma!C26,\"\")","v":""},{"$f":"IF(fimTurma!D26<>\"\",fimTurma!D26,\"\")","v":""},{"$f":"IF(AND(fimTurma!F$2<>\"\",fimTurma!F26<>\"\"),(fimTurma!F26-fimTurma!F$1)/fimTurma!F$2,\"\")","v":""},{"$f":"IF(AND(fimTurma!G$2<>\"\",fimTurma!G26<>\"\"),(fimTurma!G26-fimTurma!G$1)/fimTurma!G$2,\"\")","v":""},{"$f":"IF(AND(fimTurma!H$2<>\"\",fimTurma!H26<>\"\"),(fimTurma!H26-fimTurma!H$1)/fimTurma!H$2,\"\")","v":""},{"$f":"IF(AND(fimTurma!I$2<>\"\",fimTurma!I26<>\"\"),(fimTurma!I26-fimTurma!I$1)/fimTurma!I$2,\"\")","v":""}]
[{"$f":"IF(fimTurma!B27<>\"\",fimTurma!B27,\"\")","v":""},{"$f":"fimTurma!A27","v":24},{"$f":"IF(fimTurma!C27<>\"\",fimTurma!C27,\"\")","v":""},{"$f":"IF(fimTurma!D27<>\"\",fimTurma!D27,\"\")","v":""},{"$f":"IF(AND(fimTurma!F$2<>\"\",fimTurma!F27<>\"\"),(fimTurma!F27-fimTurma!F$1)/fimTurma!F$2,\"\")","v":""},{"$f":"IF(AND(fimTurma!G$2<>\"\",fimTurma!G27<>\"\"),(fimTurma!G27-fimTurma!G$1)/fimTurma!G$2,\"\")","v":""},{"$f":"IF(AND(fimTurma!H$2<>\"\",fimTurma!H27<>\"\"),(fimTurma!H27-fimTurma!H$1)/fimTurma!H$2,\"\")","v":""},{"$f":"IF(AND(fimTurma!I$2<>\"\",fimTurma!I27<>\"\"),(fimTurma!I27-fimTurma!I$1)/fimTurma!I$2,\"\")","v":""}]
[{"$f":"IF(fimTurma!B28<>\"\",fimTurma!B28,\"\")","v":""},{"$f":"fimTurma!A28","v":25},{"$f":"IF(fimTurma!C28<>\"\",fimTurma!C28,\"\")","v":""},{"$f":"IF(fimTurma!D28<>\"\",fimTurma!D28,\"\")","v":""},{"$f":"IF(AND(fimTurma!F$2<>\"\",fimTurma!F28<>\"\"),(fimTurma!F28-fimTurma!F$1)/fimTurma!F$2,\"\")","v":""},{"$f":"IF(AND(fimTurma!G$2<>\"\",fimTurma!G28<>\"\"),(fimTurma!G28-fimTurma!G$1)/fimTurma!G$2,\"\")","v":""},{"$f":"IF(AND(fimTurma!H$2<>\"\",fimTurma!H28<>\"\"),(fimTurma!H28-fimTurma!H$1)/fimTurma!H$2,\"\")","v":""},{"$f":"IF(AND(fimTurma!I$2<>\"\",fimTurma!I28<>\"\"),(fimTurma!I28-fimTurma!I$1)/fimTurma!I$2,\"\")","v":""}]
[{"$f":"IF(fimTurma!B29<>\"\",fimTurma!B29,\"\")","v":""},{"$f":"fimTurma!A29","v":26},{"$f":"IF(fimTurma!C29<>\"\",fimTurma!C29,\"\")","v":""},{"$f":"IF(fimTurma!D29<>\"\",fimTurma!D29,\"\")","v":""},{"$f":"IF(AND(fimTurma!F$2<>\"\",fimTurma!F29<>\"\"),(fimTurma!F29-fimTurma!F$1)/fimTurma!F$2,\"\")","v":""},{"$f":"IF(AND(fimTurma!G$2<>\"\",fimTurma!G29<>\"\"),(fimTurma!G29-fimTurma!G$1)/fimTurma!G$2,\"\")","v":""},{"$f":"IF(AND(fimTurma!H$2<>\"\",fimTurma!H29<>\"\"),(fimTurma!H29-fimTurma!H$1)/fimTurma!H$2,\"\")","v":""},{"$f":"IF(AND(fimTurma!I$2<>\"\",fimTurma!I29<>\"\"),(fimTurma!I29-fimTurma!I$1)/fimTurma!I$2,\"\")","v":""}]
[{"$f":"IF(fimTurma!B30<>\"\",fimTurma!B30,\"\")","v":""},{"$f":"fimTurma!A30","v":27},{"$f":"IF(fimTurma!C30<>\"\",fimTurma!C30,\"\")","v":""},{"$f":"IF(fimTurma!D30<>\"\",fimTurma!D30,\"\")","v":""},{"$f":"IF(AND(fimTurma!F$2<>\"\",fimTurma!F30<>\"\"),(fimTurma!F30-fimTurma!F$1)/fimTurma!F$2,\"\")","v":""},{"$f":"IF(AND(fimTurma!G$2<>\"\",fimTurma!G30<>\"\"),(fimTurma!G30-fimTurma!G$1)/fimTurma!G$2,\"\")","v":""},{"$f":"IF(AND(fimTurma!H$2<>\"\",fimTurma!H30<>\"\"),(fimTurma!H30-fimTurma!H$1)/fimTurma!H$2,\"\")","v":""},{"$f":"IF(AND(fimTurma!I$2<>\"\",fimTurma!I30<>\"\"),(fimTurma!I30-fimTurma!I$1)/fimTurma!I$2,\"\")","v":""}]
[{"$f":"IF(fimTurma!B31<>\"\",fimTurma!B31,\"\")","v":""},{"$f":"fimTurma!A31","v":28},{"$f":"IF(fimTurma!C31<>\"\",fimTurma!C31,\"\")","v":""},{"$f":"IF(fimTurma!D31<>\"\",fimTurma!D31,\"\")","v":""},{"$f":"IF(AND(fimTurma!F$2<>\"\",fimTurma!F31<>\"\"),(fimTurma!F31-fimTurma!F$1)/fimTurma!F$2,\"\")","v":""},{"$f":"IF(AND(fimTurma!G$2<>\"\",fimTurma!G31<>\"\"),(fimTurma!G31-fimTurma!G$1)/fimTurma!G$2,\"\")","v":""},{"$f":"IF(AND(fimTurma!H$2<>\"\",fimTurma!H31<>\"\"),(fimTurma!H31-fimTurma!H$1)/fimTurma!H$2,\"\")","v":""},{"$f":"IF(AND(fimTurma!I$2<>\"\",fimTurma!I31<>\"\"),(fimTurma!I31-fimTurma!I$1)/fimTurma!I$2,\"\")","v":""}]
[{"$f":"IF(fimTurma!B32<>\"\",fimTurma!B32,\"\")","v":""},{"$f":"fimTurma!A32","v":29},{"$f":"IF(fimTurma!C32<>\"\",fimTurma!C32,\"\")","v":""},{"$f":"IF(fimTurma!D32<>\"\",fimTurma!D32,\"\")","v":""},{"$f":"IF(AND(fimTurma!F$2<>\"\",fimTurma!F32<>\"\"),(fimTurma!F32-fimTurma!F$1)/fimTurma!F$2,\"\")","v":""},{"$f":"IF(AND(fimTurma!G$2<>\"\",fimTurma!G32<>\"\"),(fimTurma!G32-fimTurma!G$1)/fimTurma!G$2,\"\")","v":""},{"$f":"IF(AND(fimTurma!H$2<>\"\",fimTurma!H32<>\"\"),(fimTurma!H32-fimTurma!H$1)/fimTurma!H$2,\"\")","v":""},{"$f":"IF(AND(fimTurma!I$2<>\"\",fimTurma!I32<>\"\"),(fimTurma!I32-fimTurma!I$1)/fimTurma!I$2,\"\")","v":""}]
[{"$f":"IF(fimTurma!B33<>\"\",fimTurma!B33,\"\")","v":""},{"$f":"fimTurma!A33","v":30},{"$f":"IF(fimTurma!C33<>\"\",fimTurma!C33,\"\")","v":""},{"$f":"IF(fimTurma!D33<>\"\",fimTurma!D33,\"\")","v":""},{"$f":"IF(AND(fimTurma!F$2<>\"\",fimTurma!F33<>\"\"),(fimTurma!F33-fimTurma!F$1)/fimTurma!F$2,\"\")","v":""},{"$f":"IF(AND(fimTurma!G$2<>\"\",fimTurma!G33<>\"\"),(fimTurma!G33-fimTurma!G$1)/fimTurma!G$2,\"\")","v":""},{"$f":"IF(AND(fimTurma!H$2<>\"\",fimTurma!H33<>\"\"),(fimTurma!H33-fimTurma!H$1)/fimTurma!H$2,\"\")","v":""},{"$f":"IF(AND(fimTurma!I$2<>\"\",fimTurma!I33<>\"\"),(fimTurma!I33-fimTurma!I$1)/fimTurma!I$2,\"\")","v":""}]
[{"$f":"IF(fimTurma!B34<>\"\",fimTurma!B34,\"\")","v":""},{"$f":"fimTurma!A34","v":31},{"$f":"IF(fimTurma!C34<>\"\",fimTurma!C34,\"\")","v":""},{"$f":"IF(fimTurma!D34<>\"\",fimTurma!D34,\"\")","v":""},{"$f":"IF(AND(fimTurma!F$2<>\"\",fimTurma!F34<>\"\"),(fimTurma!F34-fimTurma!F$1)/fimTurma!F$2,\"\")","v":""},{"$f":"IF(AND(fimTurma!G$2<>\"\",fimTurma!G34<>\"\"),(fimTurma!G34-fimTurma!G$1)/fimTurma!G$2,\"\")","v":""},{"$f":"IF(AND(fimTurma!H$2<>\"\",fimTurma!H34<>\"\"),(fimTurma!H34-fimTurma!H$1)/fimTurma!H$2,\"\")","v":""},{"$f":"IF(AND(fimTurma!I$2<>\"\",fimTurma!I34<>\"\"),(fimTurma!I34-fimTurma!I$1)/fimTurma!I$2,\"\")","v":""}]
[{"$f":"IF(fimTurma!B35<>\"\",fimTurma!B35,\"\")","v":""},{"$f":"fimTurma!A35","v":32},{"$f":"IF(fimTurma!C35<>\"\",fimTurma!C35,\"\")","v":""},{"$f":"IF(fimTurma!D35<>\"\",fimTurma!D35,\"\")","v":""},{"$f":"IF(AND(fimTurma!F$2<>\"\",fimTurma!F35<>\"\"),(fimTurma!F35-fimTurma!F$1)/fimTurma!F$2,\"\")","v":""},{"$f":"IF(AND(fimTurma!G$2<>\"\",fimTurma!G35<>\"\"),(fimTurma!G35-fimTurma!G$1)/fimTurma!G$2,\"\")","v":""},{"$f":"IF(AND(fimTurma!H$2<>\"\",fimTurma!H35<>\"\"),(fimTurma!H35-fimTurma!H$1)/fimTurma!H$2,\"\")","v":""},{"$f":"IF(AND(fimTurma!I$2<>\"\",fimTurma!I35<>\"\"),(fimTurma!I35-fimTurma!I$1)/fimTurma!I$2,\"\")","v":""}]
[{"$f":"IF(fimTurma!B36<>\"\",fimTurma!B36,\"\")","v":""},{"$f":"fimTurma!A36","v":33},{"$f":"IF(fimTurma!C36<>\"\",fimTurma!C36,\"\")","v":""},{"$f":"IF(fimTurma!D36<>\"\",fimTurma!D36,\"\")","v":""},{"$f":"IF(AND(fimTurma!F$2<>\"\",fimTurma!F36<>\"\"),(fimTurma!F36-fimTurma!F$1)/fimTurma!F$2,\"\")","v":""},{"$f":"IF(AND(fimTurma!G$2<>\"\",fimTurma!G36<>\"\"),(fimTurma!G36-fimTurma!G$1)/fimTurma!G$2,\"\")","v":""},{"$f":"IF(AND(fimTurma!H$2<>\"\",fimTurma!H36<>\"\"),(fimTurma!H36-fimTurma!H$1)/fimTurma!H$2,\"\")","v":""},{"$f":"IF(AND(fimTurma!I$2<>\"\",fimTurma!I36<>\"\"),(fimTurma!I36-fimTurma!I$1)/fimTurma!I$2,\"\")","v":""}]
[{"$f":"IF(fimTurma!B37<>\"\",fimTurma!B37,\"\")","v":""},{"$f":"fimTurma!A37","v":34},{"$f":"IF(fimTurma!C37<>\"\",fimTurma!C37,\"\")","v":""},{"$f":"IF(fimTurma!D37<>\"\",fimTurma!D37,\"\")","v":""},{"$f":"IF(AND(fimTurma!F$2<>\"\",fimTurma!F37<>\"\"),(fimTurma!F37-fimTurma!F$1)/fimTurma!F$2,\"\")","v":""},{"$f":"IF(AND(fimTurma!G$2<>\"\",fimTurma!G37<>\"\"),(fimTurma!G37-fimTurma!G$1)/fimTurma!G$2,\"\")","v":""},{"$f":"IF(AND(fimTurma!H$2<>\"\",fimTurma!H37<>\"\"),(fimTurma!H37-fimTurma!H$1)/fimTurma!H$2,\"\")","v":""},{"$f":"IF(AND(fimTurma!I$2<>\"\",fimTurma!I37<>\"\"),(fimTurma!I37-fimTurma!I$1)/fimTurma!I$2,\"\")","v":""}]
[{"$f":"IF(fimTurma!B38<>\"\",fimTurma!B38,\"\")","v":""},{"$f":"fimTurma!A38","v":35},{"$f":"IF(fimTurma!C38<>\"\",fimTurma!C38,\"\")","v":""},{"$f":"IF(fimTurma!D38<>\"\",fimTurma!D38,\"\")","v":""},{"$f":"IF(AND(fimTurma!F$2<>\"\",fimTurma!F38<>\"\"),(fimTurma!F38-fimTurma!F$1)/fimTurma!F$2,\"\")","v":""},{"$f":"IF(AND(fimTurma!G$2<>\"\",fimTurma!G38<>\"\"),(fimTurma!G38-fimTurma!G$1)/fimTurma!G$2,\"\")","v":""},{"$f":"IF(AND(fimTurma!H$2<>\"\",fimTurma!H38<>\"\"),(fimTurma!H38-fimTurma!H$1)/fimTurma!H$2,\"\")","v":""},{"$f":"IF(AND(fimTurma!I$2<>\"\",fimTurma!I38<>\"\"),(fimTurma!I38-fimTurma!I$1)/fimTurma!I$2,\"\")","v":""}]
[{"$f":"IF(fimTurma!B39<>\"\",fimTurma!B39,\"\")","v":""},{"$f":"fimTurma!A39","v":36},{"$f":"IF(fimTurma!C39<>\"\",fimTurma!C39,\"\")","v":""},{"$f":"IF(fimTurma!D39<>\"\",fimTurma!D39,\"\")","v":""},{"$f":"IF(AND(fimTurma!F$2<>\"\",fimTurma!F39<>\"\"),(fimTurma!F39-fimTurma!F$1)/fimTurma!F$2,\"\")","v":""},{"$f":"IF(AND(fimTurma!G$2<>\"\",fimTurma!G39<>\"\"),(fimTurma!G39-fimTurma!G$1)/fimTurma!G$2,\"\")","v":""},{"$f":"IF(AND(fimTurma!H$2<>\"\",fimTurma!H39<>\"\"),(fimTurma!H39-fimTurma!H$1)/fimTurma!H$2,\"\")","v":""},{"$f":"IF(AND(fimTurma!I$2<>\"\",fimTurma!I39<>\"\"),(fimTurma!I39-fimTurma!I$1)/fimTurma!I$2,\"\")","v":""}]
[{"$f":"IF(fimTurma!B40<>\"\",fimTurma!B40,\"\")","v":""},{"$f":"fimTurma!A40","v":37},{"$f":"IF(fimTurma!C40<>\"\",fimTurma!C40,\"\")","v":""},{"$f":"IF(fimTurma!D40<>\"\",fimTurma!D40,\"\")","v":""},{"$f":"IF(AND(fimTurma!F$2<>\"\",fimTurma!F40<>\"\"),(fimTurma!F40-fimTurma!F$1)/fimTurma!F$2,\"\")","v":""},{"$f":"IF(AND(fimTurma!G$2<>\"\",fimTurma!G40<>\"\"),(fimTurma!G40-fimTurma!G$1)/fimTurma!G$2,\"\")","v":""},{"$f":"IF(AND(fimTurma!H$2<>\"\",fimTurma!H40<>\"\"),(fimTurma!H40-fimTurma!H$1)/fimTurma!H$2,\"\")","v":""},{"$f":"IF(AND(fimTurma!I$2<>\"\",fimTurma!I40<>\"\"),(fimTurma!I40-fimTurma!I$1)/fimTurma!I$2,\"\")","v":""}]
[{"$f":"IF(fimTurma!B41<>\"\",fimTurma!B41,\"\")","v":""},{"$f":"fimTurma!A41","v":38},{"$f":"IF(fimTurma!C41<>\"\",fimTurma!C41,\"\")","v":""},{"$f":"IF(fimTurma!D41<>\"\",fimTurma!D41,\"\")","v":""},{"$f":"IF(AND(fimTurma!F$2<>\"\",fimTurma!F41<>\"\"),(fimTurma!F41-fimTurma!F$1)/fimTurma!F$2,\"\")","v":""},{"$f":"IF(AND(fimTurma!G$2<>\"\",fimTurma!G41<>\"\"),(fimTurma!G41-fimTurma!G$1)/fimTurma!G$2,\"\")","v":""},{"$f":"IF(AND(fimTurma!H$2<>\"\",fimTurma!H41<>\"\"),(fimTurma!H41-fimTurma!H$1)/fimTurma!H$2,\"\")","v":""},{"$f":"IF(AND(fimTurma!I$2<>\"\",fimTurma!I41<>\"\"),(fimTurma!I41-fimTurma!I$1)/fimTurma!I$2,\"\")","v":""}]
[{"$f":"IF(fimTurma!B42<>\"\",fimTurma!B42,\"\")","v":""},{"$f":"fimTurma!A42","v":39},{"$f":"IF(fimTurma!C42<>\"\",fimTurma!C42,\"\")","v":""},{"$f":"IF(fimTurma!D42<>\"\",fimTurma!D42,\"\")","v":""},{"$f":"IF(AND(fimTurma!F$2<>\"\",fimTurma!F42<>\"\"),(fimTurma!F42-fimTurma!F$1)/fimTurma!F$2,\"\")","v":""},{"$f":"IF(AND(fimTurma!G$2<>\"\",fimTurma!G42<>\"\"),(fimTurma!G42-fimTurma!G$1)/fimTurma!G$2,\"\")","v":""},{"$f":"IF(AND(fimTurma!H$2<>\"\",fimTurma!H42<>\"\"),(fimTurma!H42-fimTurma!H$1)/fimTurma!H$2,\"\")","v":""},{"$f":"IF(AND(fimTurma!I$2<>\"\",fimTurma!I42<>\"\"),(fimTurma!I42-fimTurma!I$1)/fimTurma!I$2,\"\")","v":""}]
[{"$f":"IF(fimTurma!B43<>\"\",fimTurma!B43,\"\")","v":""},{"$f":"fimTurma!A43","v":40},{"$f":"IF(fimTurma!C43<>\"\",fimTurma!C43,\"\")","v":""},{"$f":"IF(fimTurma!D43<>\"\",fimTurma!D43,\"\")","v":""},{"$f":"IF(AND(fimTurma!F$2<>\"\",fimTurma!F43<>\"\"),(fimTurma!F43-fimTurma!F$1)/fimTurma!F$2,\"\")","v":""},{"$f":"IF(AND(fimTurma!G$2<>\"\",fimTurma!G43<>\"\"),(fimTurma!G43-fimTurma!G$1)/fimTurma!G$2,\"\")","v":""},{"$f":"IF(AND(fimTurma!H$2<>\"\",fimTurma!H43<>\"\"),(fimTurma!H43-fimTurma!H$1)/fimTurma!H$2,\"\")","v":""},{"$f":"IF(AND(fimTurma!I$2<>\"\",fimTurma!I43<>\"\"),(fimTurma!I43-fimTurma!I$1)/fimTurma!I$2,\"\")","v":""}]
[{"$f":"IF(fimTurma!B44<>\"\",fimTurma!B44,\"\")","v":""},{"$f":"fimTurma!A44","v":41},{"$f":"IF(fimTurma!C44<>\"\",fimTurma!C44,\"\")","v":""},{"$f":"IF(fimTurma!D44<>\"\",fimTurma!D44,\"\")","v":""},{"$f":"IF(AND(fimTurma!F$2<>\"\",fimTurma!F44<>\"\"),(fimTurma!F44-fimTurma!F$1)/fimTurma!F$2,\"\")","v":""},{"$f":"IF(AND(fimTurma!G$2<>\"\",fimTurma!G44<>\"\"),(fimTurma!G44-fimTurma!G$1)/fimTurma!G$2,\"\")","v":""},{"$f":"IF(AND(fimTurma!H$2<>\"\",fimTurma!H44<>\"\"),(fimTurma!H44-fimTurma!H$1)/fimTurma!H$2,\"\")","v":""},{"$f":"IF(AND(fimTurma!I$2<>\"\",fimTurma!I44<>\"\"),(fimTurma!I44-fimTurma!I$1)/fimTurma!I$2,\"\")","v":""}]
[{"$f":"IF(fimTurma!B45<>\"\",fimTurma!B45,\"\")","v":""},{"$f":"fimTurma!A45","v":42},{"$f":"IF(fimTurma!C45<>\"\",fimTurma!C45,\"\")","v":""},{"$f":"IF(fimTurma!D45<>\"\",fimTurma!D45,\"\")","v":""},{"$f":"IF(AND(fimTurma!F$2<>\"\",fimTurma!F45<>\"\"),(fimTurma!F45-fimTurma!F$1)/fimTurma!F$2,\"\")","v":""},{"$f":"IF(AND(fimTurma!G$2<>\"\",fimTurma!G45<>\"\"),(fimTurma!G45-fimTurma!G$1)/fimTurma!G$2,\"\")","v":""},{"$f":"IF(AND(fimTurma!H$2<>\"\",fimTurma!H45<>\"\"),(fimTurma!H45-fimTurma!H$1)/fimTurma!H$2,\"\")","v":""},{"$f":"IF(AND(fimTurma!I$2<>\"\",fimTurma!I45<>\"\"),(fimTurma!I45-fimTurma!I$1)/fimTurma!I$2,\"\")","v":""}]
[{"$f":"IF(fimTurma!B46<>\"\",fimTurma!B46,\"\")","v":""},{"$f":"fimTurma!A46","v":43},{"$f":"IF(fimTurma!C46<>\"\",fimTurma!C46,\"\")","v":""},{"$f":"IF(fimTurma!D46<>\"\",fimTurma!D46,\"\")","v":""},{"$f":"IF(AND(fimTurma!F$2<>\"\",fimTurma!F46<>\"\"),(fimTurma!F46-fimTurma!F$1)/fimTurma!F$2,\"\")","v":""},{"$f":"IF(AND(fimTurma!G$2<>\"\",fimTurma!G46<>\"\"),(fimTurma!G46-fimTurma!G$1)/fimTurma!G$2,\"\")","v":""},{"$f":"IF(AND(fimTurma!H$2<>\"\",fimTurma!H46<>\"\"),(fimTurma!H46-fimTurma!H$1)/fimTurma!H$2,\"\")","v":""},{"$f":"IF(AND(fimTurma!I$2<>\"\",fimTurma!I46<>\"\"),(fimTurma!I46-fimTurma!I$1)/fimTurma!I$2,\"\")","v":""}]
[{"$f":"IF(fimTurma!B47<>\"\",fimTurma!B47,\"\")","v":""},{"$f":"fimTurma!A47","v":44},{"$f":"IF(fimTurma!C47<>\"\",fimTurma!C47,\"\")","v":""},{"$f":"IF(fimTurma!D47<>\"\",fimTurma!D47,\"\")","v":""},{"$f":"IF(AND(fimTurma!F$2<>\"\",fimTurma!F47<>\"\"),(fimTurma!F47-fimTurma!F$1)/fimTurma!F$2,\"\")","v":""},{"$f":"IF(AND(fimTurma!G$2<>\"\",fimTurma!G47<>\"\"),(fimTurma!G47-fimTurma!G$1)/fimTurma!G$2,\"\")","v":""},{"$f":"IF(AND(fimTurma!H$2<>\"\",fimTurma!H47<>\"\"),(fimTurma!H47-fimTurma!H$1)/fimTurma!H$2,\"\")","v":""},{"$f":"IF(AND(fimTurma!I$2<>\"\",fimTurma!I47<>\"\"),(fimTurma!I47-fimTurma!I$1)/fimTurma!I$2,\"\")","v":""}]
[{"$f":"IF(fimTurma!B48<>\"\",fimTurma!B48,\"\")","v":""},{"$f":"fimTurma!A48","v":45},{"$f":"IF(fimTurma!C48<>\"\",fimTurma!C48,\"\")","v":""},{"$f":"IF(fimTurma!D48<>\"\",fimTurma!D48,\"\")","v":""},{"$f":"IF(AND(fimTurma!F$2<>\"\",fimTurma!F48<>\"\"),(fimTurma!F48-fimTurma!F$1)/fimTurma!F$2,\"\")","v":""},{"$f":"IF(AND(fimTurma!G$2<>\"\",fimTurma!G48<>\"\"),(fimTurma!G48-fimTurma!G$1)/fimTurma!G$2,\"\")","v":""},{"$f":"IF(AND(fimTurma!H$2<>\"\",fimTurma!H48<>\"\"),(fimTurma!H48-fimTurma!H$1)/fimTurma!H$2,\"\")","v":""},{"$f":"IF(AND(fimTurma!I$2<>\"\",fimTurma!I48<>\"\"),(fimTurma!I48-fimTurma!I$1)/fimTurma!I$2,\"\")","v":""}]
[{"$f":"IF(fimTurma!B49<>\"\",fimTurma!B49,\"\")","v":""},{"$f":"fimTurma!A49","v":46},{"$f":"IF(fimTurma!C49<>\"\",fimTurma!C49,\"\")","v":""},{"$f":"IF(fimTurma!D49<>\"\",fimTurma!D49,\"\")","v":""},{"$f":"IF(AND(fimTurma!F$2<>\"\",fimTurma!F49<>\"\"),(fimTurma!F49-fimTurma!F$1)/fimTurma!F$2,\"\")","v":""},{"$f":"IF(AND(fimTurma!G$2<>\"\",fimTurma!G49<>\"\"),(fimTurma!G49-fimTurma!G$1)/fimTurma!G$2,\"\")","v":""},{"$f":"IF(AND(fimTurma!H$2<>\"\",fimTurma!H49<>\"\"),(fimTurma!H49-fimTurma!H$1)/fimTurma!H$2,\"\")","v":""},{"$f":"IF(AND(fimTurma!I$2<>\"\",fimTurma!I49<>\"\"),(fimTurma!I49-fimTurma!I$1)/fimTurma!I$2,\"\")","v":""}]
[{"$f":"IF(fimTurma!B50<>\"\",fimTurma!B50,\"\")","v":""},{"$f":"fimTurma!A50","v":47},{"$f":"IF(fimTurma!C50<>\"\",fimTurma!C50,\"\")","v":""},{"$f":"IF(fimTurma!D50<>\"\",fimTurma!D50,\"\")","v":""},{"$f":"IF(AND(fimTurma!F$2<>\"\",fimTurma!F50<>\"\"),(fimTurma!F50-fimTurma!F$1)/fimTurma!F$2,\"\")","v":""},{"$f":"IF(AND(fimTurma!G$2<>\"\",fimTurma!G50<>\"\"),(fimTurma!G50-fimTurma!G$1)/fimTurma!G$2,\"\")","v":""},{"$f":"IF(AND(fimTurma!H$2<>\"\",fimTurma!H50<>\"\"),(fimTurma!H50-fimTurma!H$1)/fimTurma!H$2,\"\")","v":""},{"$f":"IF(AND(fimTurma!I$2<>\"\",fimTurma!I50<>\"\"),(fimTurma!I50-fimTurma!I$1)/fimTurma!I$2,\"\")","v":""}]
[{"$f":"IF(fimTurma!B51<>\"\",fimTurma!B51,\"\")","v":""},{"$f":"fimTurma!A51","v":48},{"$f":"IF(fimTurma!C51<>\"\",fimTurma!C51,\"\")","v":""},{"$f":"IF(fimTurma!D51<>\"\",fimTurma!D51,\"\")","v":""},{"$f":"IF(AND(fimTurma!F$2<>\"\",fimTurma!F51<>\"\"),(fimTurma!F51-fimTurma!F$1)/fimTurma!F$2,\"\")","v":""},{"$f":"IF(AND(fimTurma!G$2<>\"\",fimTurma!G51<>\"\"),(fimTurma!G51-fimTurma!G$1)/fimTurma!G$2,\"\")","v":""},{"$f":"IF(AND(fimTurma!H$2<>\"\",fimTurma!H51<>\"\"),(fimTurma!H51-fimTurma!H$1)/fimTurma!H$2,\"\")","v":""},{"$f":"IF(AND(fimTurma!I$2<>\"\",fimTurma!I51<>\"\"),(fimTurma!I51-fimTurma!I$1)/fimTurma!I$2,\"\")","v":""}]
[{"$f":"IF(fimTurma!B52<>\"\",fimTurma!B52,\"\")","v":""},{"$f":"fimTurma!A52","v":49},{"$f":"IF(fimTurma!C52<>\"\",fimTurma!C52,\"\")","v":""},{"$f":"IF(fimTurma!D52<>\"\",fimTurma!D52,\"\")","v":""},{"$f":"IF(AND(fimTurma!F$2<>\"\",fimTurma!F52<>\"\"),(fimTurma!F52-fimTurma!F$1)/fimTurma!F$2,\"\")","v":""},{"$f":"IF(AND(fimTurma!G$2<>\"\",fimTurma!G52<>\"\"),(fimTurma!G52-fimTurma!G$1)/fimTurma!G$2,\"\")","v":""},{"$f":"IF(AND(fimTurma!H$2<>\"\",fimTurma!H52<>\"\"),(fimTurma!H52-fimTurma!H$1)/fimTurma!H$2,\"\")","v":""},{"$f":"IF(AND(fimTurma!I$2<>\"\",fimTurma!I52<>\"\"),(fimTurma!I52-fimTurma!I$1)/fimTurma!I$2,\"\")","v":""}]
[{"$f":"IF(fimTurma!B53<>\"\",fimTurma!B53,\"\")","v":""},{"$f":"fimTurma!A53","v":50},{"$f":"IF(fimTurma!C53<>\"\",fimTurma!C53,\"\")","v":""},{"$f":"IF(fimTurma!D53<>\"\",fimTurma!D53,\"\")","v":""},{"$f":"IF(AND(fimTurma!F$2<>\"\",fimTurma!F53<>\"\"),(fimTurma!F53-fimTurma!F$1)/fimTurma!F$2,\"\")","v":""},{"$f":"IF(AND(fimTurma!G$2<>\"\",fimTurma!G53<>\"\"),(fimTurma!G53-fimTurma!G$1)/fimTurma!G$2,\"\")","v":""},{"$f":"IF(AND(fimTurma!H$2<>\"\",fimTurma!H53<>\"\"),(fimTurma!H53-fimTurma!H$1)/fimTurma!H$2,\"\")","v":""},{"$f":"IF(AND(fimTurma!I$2<>\"\",fimTurma!I53<>\"\"),(fimTurma!I53-fimTurma!I$1)/fimTurma!I$2,\"\")","v":""}]

{"sheet":"profRelatório","index":6,"n_rows":20,"n_cols":11,"rows_kept":20,"cut":false,"hidden":false,"merged":[[3,2,3,4],[3,6,3,8]]}
["RELATÓRIO RESUMO PARA O PROFESSOR/TREINADOR"]
[{"$f":"_xlfn.CONCAT(fimTurma!C1,\"º ano\",\" | \",fimTurma!C2)","v":"2º ano | A"}]
[]
[null,null,"Início do Ano",null,null,null,"Fim do Ano",null,null,null,"Melhoria"]
[null,null,"Média",null,"Desvio",null,"Média",null,"Desvio",null,"Com"]
[null,null,null,null,"Padrão",null,null,null,"Padrão",null,"Significado?"]
["APTIDÃO MOTORA"]
[{"$f":"IF(fimTurma!A2=1,IFERROR(VLOOKUP(1,fimAuxiliar!L3:Q3,2,0),\"\"),\"\")","v":"Agilidade"},null,{"$f":"IF(fimTurma!$A$2=1,IFERROR(VLOOKUP(1,fimAuxiliar!$L$3:$X$3,11,0),0),0)","v":12.5},null,{"$f":"IF(fimTurma!$A$2=1,IFERROR(VLOOKUP(1,fimAuxiliar!L3:X3,12,0),0),0)","v":1.707825127659933},null,{"$f":"IF(fimTurma!A2=1,IFERROR(VLOOKUP(1,fimAuxiliar!L3:X3,4,0),0),0)","v":14.916666666666666},null,{"$f":"IF(fimTurma!A2=1,IFERROR(VLOOKUP(1,fimAuxiliar!L3:X3,13,0),0),0)","v":1.3202482931462383},null,{"$f":"IF(fimTurma!A2=1,IFERROR(VLOOKUP(1,fimAuxiliar!L3:X3,9,0),0),0)","v":"Não"}]
[]
[]
[]
["APTIDÃO CARDIORRESPIRATÓRIA"]
[{"$f":"IF(fimTurma!A2=1,IFERROR(VLOOKUP(1,fimAuxiliar!L4:Q4,2,0),\"\"),\"\")","v":"Shuttle run 20m"},null,{"$f":"IF(fimTurma!A2=1,IFERROR(VLOOKUP(1,fimAuxiliar!L4:X4,11,0),0),0)","v":10.166666666666666},null,{"$f":"IF(fimTurma!A2=1,IFERROR(VLOOKUP(1,fimAuxiliar!L4:X4,12,0),0),0)","v":1.818118685772619},null,{"$f":"IF(fimTurma!A2=1,IFERROR(VLOOKUP(1,fimAuxiliar!L4:X4,4,0),0),0)","v":11.75},null,{"$f":"IF(fimTurma!A2=1,IFERROR(VLOOKUP(1,fimAuxiliar!L4:X4,13,0),0),0)","v":1.299038105676658},null,{"$f":"IF(fimTurma!A2=1,IFERROR(VLOOKUP(1,fimAuxiliar!L4:X4,9,0),0),0)","v":"Sim"}]
[]
[]
[]
["APTIDÃO MUSCULAR"]
[{"$f":"IF(fimTurma!A2=1,IFERROR(VLOOKUP(1,fimAuxiliar!L5:Q6,2,0),\"\"),\"\")","v":"Força de preensão"},null,{"$f":"IF(fimTurma!A2=1,IFERROR(VLOOKUP(1,fimAuxiliar!L5:X6,11,0),0),0)","v":8.9454545454545453},null,{"$f":"IF(fimTurma!A2=1,IFERROR(VLOOKUP(1,fimAuxiliar!L5:X6,12,0),0),0)","v":2.424632544367626},null,{"$f":"IF(fimTurma!A2=1,IFERROR(VLOOKUP(1,fimAuxiliar!L5:X6,4,0),0),0)","v":7.7636363636363646},null,{"$f":"IF(fimTurma!A2=1,IFERROR(VLOOKUP(1,fimAuxiliar!L5:X6,13,0),0),0)","v":0.96603475118437687},null,{"$f":"IF(fimTurma!A2=1,IFERROR(VLOOKUP(1,fimAuxiliar!L5:X6,9,0),0),0)","v":"Não"}]
[]
[{"$f":"IF(fimTurma!A2=1,IFERROR(VLOOKUP(2,fimAuxiliar!L5:Q6,2,0),\"\"),\"\")","v":"Salto horizontal"},null,{"$f":"IF(fimTurma!A2=1,IFERROR(VLOOKUP(2,fimAuxiliar!L5:X6,11,0),0),0)","v":29.866666666666664},null,{"$f":"IF(fimTurma!A2=1,IFERROR(VLOOKUP(2,fimAuxiliar!L5:X6,12,0),0),0)","v":4.0778534658431482},null,{"$f":"IF(fimTurma!A2=1,IFERROR(VLOOKUP(2,fimAuxiliar!L5:X6,4,0),0),0)","v":34.527272727272731},null,{"$f":"IF(fimTurma!A2=1,IFERROR(VLOOKUP(2,fimAuxiliar!L5:X6,13,0),0),0)","v":3.0766247471394266},null,{"$f":"IF(fimTurma!A2=1,IFERROR(VLOOKUP(2,fimAuxiliar!L5:X6,9,0),0),0)","v":"Sim"}]

{"sheet":"profPorTeste","index":7,"n_rows":5,"n_cols":1,"rows_kept":5,"cut":false,"hidden":false,"merged":[]}
["RELATÓRIO POR TESTE PARA O PROFESSOR/TREINADOR"]
[{"$f":"_xlfn.CONCAT(fimTurma!C1,\"º ano\",\" | \",fimTurma!C2)","v":"2º ano | A"}]
[]
[]
["Teste: Salto horizontal"]

{"sheet":"iniAuxiliar","index":8,"n_rows":17,"n_cols":17,"rows_kept":17,"cut":false,"hidden":true,"merged":[]}
["Número","Ordem","Teste","Criança","Média","Mínimo","Máximo","Score Z","Nome Gráfico","Dpadrão","Grupo","Ordem Resumo","Nome","Criança","Média","Mínimo","Máximo"]
[null,0]
[{"$f":"COUNT(iniTurma!F4:F53)","v":12},{"$f":"IF(A3>0,B2+1,B2)","v":1},{"$f":"iniTurma!F3","v":"Agilidade"},{"$f":"IF(AND(iniTurma!$A$2=1,B3=B2+1),VLOOKUP(\"x\",iniTurma!$B$4:$M$53,5,0),\"\")","v":12},{"$f":"IF(B3=B2+1,iniTurma!$F$1,\"\")","v":12.5},{"$f":"IF(AND(iniTurma!$A$2=1,B3=B2+1),SMALL(iniTurma!$F$4:$F$53,1),\"\")","v":10},{"$f":"IF(AND(iniTurma!$A$2=1,B3=B2+1),LARGE(iniTurma!$F$4:$F$53,1),\"\")","v":15},{"$f":"IF(AND(iniTurma!$A$2=1,B3=B2+1),VLOOKUP(\"x\",'iniScore Z'!$A$4:$L$53,5,0),\"\")","v":-0.29277002188455997},{"$f":"C3","v":"Agilidade"},{"$f":"IF(B3=B2+1,iniTurma!$F$2,\"\")","v":1.707825127659933},"APTIDÃO MOTORA",{"$f":"IF(K3<>K2,IF(A3>0,1,0),IF(A3>0,L2+1,L2))","v":1},{"$f":"I3","v":"Agilidade"},{"$f":"D3","v":12},{"$f":"E3","v":12.5},10,15]
[{"$f":"COUNT(iniTurma!G4:G53)","v":12},{"$f":"IF(A4>0,B3+1,B3)","v":2},{"$f":"iniTurma!G3","v":"Shuttle run 20m"},{"$f":"IF(AND(iniTurma!$A$2=1,B4=B3+1),VLOOKUP(\"x\",iniTurma!$B$4:$M$53,6,0),\"\")","v":8},{"$f":"IF(B4=B3+1,iniTurma!$G$1,\"\")","v":10.166666666666666},{"$f":"IF(AND(iniTurma!$A$2=1,B4=B3+1),SMALL(iniTurma!$G$4:$G$53,1),\"\")","v":7},{"$f":"IF(AND(iniTurma!$A$2=1,B4=B3+1),LARGE(iniTurma!$G$4:$G$53,1),\"\")","v":13},{"$f":"IF(AND(iniTurma!$A$2=1,B4=B3+1),VLOOKUP(\"x\",'iniScore Z'!$A$4:$L$53,6,0),\"\")","v":-1.1917080461366745},{"$f":"C4","v":"Shuttle run 20m"},{"$f":"IF(B4=B3+1,iniTurma!$G$2,\"\")","v":1.818118685772619},"APTIDÃO CARDIORRESPIRATÓRIA",{"$f":"IF(K4<>K3,IF(A4>0,1,0),IF(A4>0,L3+1,L3))","v":1},{"$f":"I4","v":"Shuttle run 20m"},{"$f":"D4","v":8},{"$f":"E4","v":10.166666666666666},{"$f":"F4","v":7},{"$f":"G4","v":13}]
[{"$f":"COUNT(iniTurma!H4:H53)","v":11},3,{"$f":"iniTurma!H3","v":"Força de preensão"},{"$f":"IF(AND(iniTurma!$A$2=1,B5=B4+1),VLOOKUP(\"x\",iniTurma!$B$4:$M$53,7,0),\"\")","v":8.3000000000000007},{"$f":"IF(B5=B4+1,iniTurma!$H$1,\"\")","v":8.9454545454545453},{"$f":"IF(AND(iniTurma!$A$2=1,B5=B4+1),SMALL(iniTurma!$H$4:$H$53,1),\"\")","v":6},{"$f":"IF(AND(iniTurma!$A$2=1,B5=B4+1),LARGE(iniTurma!$H$4:$H$53,1),\"\")","v":14.7},{"$f":"IF(AND(iniTurma!$A$2=1,B5=B4+1),VLOOKUP(\"x\",'iniScore Z'!$A$4:$L$53,7,0),\"\")","v":-0.26620716073201395},"Força de preensão",{"$f":"IF(B5=B4+1,iniTurma!$H$2,\"\")","v":2.424632544367626},"APTIDÃO MUSCULAR",1,"Força de preensão",8.3000000000000007,8.9454545454545453,6,14.7]
[{"$f":"COUNT(iniTurma!I4:I53)","v":12},4,{"$f":"iniTurma!I3","v":"Salto horizontal"},{"$f":"IF(AND(iniTurma!$A$2=1,B6=B5+1),VLOOKUP(\"x\",iniTurma!$B$4:$M$53,8,0),\"\")","v":25},{"$f":"IF(B6=B5+1,iniTurma!$I$1,\"\")","v":29.866666666666664},{"$f":"IF(AND(iniTurma!$A$2=1,B6=B5+1),SMALL(iniTurma!$I$4:$I$53,1),\"\")","v":24},{"$f":"IF(AND(iniTurma!$A$2=1,B6=B5+1),LARGE(iniTurma!$I$4:$I$53,1),\"\")","v":38},{"$f":"IF(AND(iniTurma!$A$2=1,B6=B5+1),VLOOKUP(\"x\",'iniScore Z'!$A$4:$L$53,8,0),\"\")","v":-1.1934383389277619},"Salto horizontal",{"$f":"IF(B6=B5+1,iniTurma!$I$2,\"\")","v":4.0778534658431482},"APTIDÃO MUSCULAR",2,"Salto horizontal",25,29.866666666666664,24,38]
[]
[]
[]
[]
[]
[]
[null,null,"Dados para o gráfico","Score Z"]
[null,null,{"$f":"IF(iniTurma!A2=1,IFERROR(VLOOKUP(1,iniAuxiliar!B3:G10,2,0),\"\"),\"\")","v":"Agilidade"},{"$f":"IF(iniTurma!A2=1,IFERROR(VLOOKUP(1,iniAuxiliar!B3:H10,7,0),\"\"),\"\")","v":-0.29277002188455997}]
[null,null,{"$f":"IF(iniTurma!A2=1,IFERROR(VLOOKUP(2,iniAuxiliar!B3:G10,2,0),\"\"),\"\")","v":"Shuttle run 20m"},{"$f":"IF(iniTurma!A2=1,IFERROR(VLOOKUP(2,iniAuxiliar!B3:H10,7,0),\"\"),\"\")","v":-1.1917080461366745}]
[null,null,{"$f":"IF(iniTurma!A2=1,IFERROR(VLOOKUP(3,iniAuxiliar!B3:G10,2,0),\"\"),\"\")","v":"Força de preensão"},{"$f":"IF(iniTurma!A2=1,IFERROR(VLOOKUP(3,iniAuxiliar!B3:H10,7,0),\"\"),\"\")","v":-0.26620716073201395}]
[null,null,{"$f":"IF(iniTurma!A2=1,IFERROR(VLOOKUP(4,iniAuxiliar!B3:G10,2,0),\"\"),\"\")","v":"Salto horizontal"},{"$f":"IF(iniTurma!A2=1,IFERROR(VLOOKUP(4,iniAuxiliar!B3:H10,7,0),\"\"),\"\")","v":-1.1934383389277619}]

{"sheet":"fimAuxiliar","index":9,"n_rows":21,"n_cols":24,"rows_kept":21,"cut":false,"hidden":true,"merged":[]}
["Número","Ordem Resumo","Teste","Criança","Média","Mínimo","Máximo","Score Z","Nome Gráfico","Dpadrão","Grupo","Ordem Relatório","Nome","Criança","Média","Mínimo","Máximo","Melhor","difMédia","Conclusão","Teste T","média","desvio padrão","dpadrão"]
[null,0,null,"fim","fim","fim","fim","fim",null,"fim",null,null,null,"fim","fim","fim","fim",null,null,null,null,"ini","ini","fim"]
[{"$f":"COUNT(fimTurma!F4:F53)","v":12},{"$f":"IF(A3>0,B2+1,B2)","v":1},{"$f":"I3","v":"Agilidade"},{"$f":"IF(AND(fimTurma!$A$2=1,B3=B2+1),VLOOKUP(\"x\",fimTurma!$B$4:$M$53,5,0),\"\")","v":14},{"$f":"IF(B3=B2+1,fimTurma!$F$1,\"\")","v":14.916666666666666},{"$f":"IF(AND(fimTurma!$A$2=1,B3=B2+1),SMALL(fimTurma!$F$4:$F$53,1),\"\")","v":13},{"$f":"IF(AND(fimTurma!$A$2=1,B3=B2+1),LARGE(fimTurma!$F$4:$F$53,1),\"\")","v":17},{"$f":"IF(AND(fimTurma!$A$2=1,B3=B2+1),VLOOKUP(\"x\",'fimScore Z'!$A$4:$L$53,5,0),\"\")","v":-0.69431384340758306},{"$f":"fimTurma!F3","v":"Agilidade"},{"$f":"IF(B3=B2+1,fimTurma!$F$2,\"\")","v":1.3202482931462383},"APTIDÃO MOTORA",{"$f":"IF(K3<>K2,IF(A3>0,1,0),IF(A3>0,L2+1,L2))","v":1},{"$f":"I3","v":"Agilidade"},{"$f":"D3","v":14},{"$f":"E3","v":14.916666666666666},13,17,-1,{"$f":"IF(AND(E3<>\"\",iniAuxiliar!E3<>\"\"),E3-iniAuxiliar!E3,\"\")","v":2.4166666666666661},{"$f":"IF(AND(E3<>\"\",iniAuxiliar!E3<>\"\"),IF(S3*R3<=0,\"Não\",IF(U3>=0.05,\"Não\",\"Sim\")),\"\")","v":"Não"},{"$f":"IF(AND(E3<>\"\",iniAuxiliar!E3<>\"\"),IFERROR(_xlfn.T.TEST(iniTurma!F$4:F$53,fimTurma!F$4:F$53,1,1),_xlfn.T.TEST(iniTurma!F$4:F$53,fimTurma!F$4:F$53,1,2)),\"\")","v":4.0185331583574013E-4},{"$f":"iniAuxiliar!E3","v":12.5},{"$f":"iniAuxiliar!J3","v":1.707825127659933},{"$f":"J3","v":1.3202482931462383}]
[{"$f":"COUNT(fimTurma!G4:G53)","v":12},{"$f":"IF(A4>0,B3+1,B3)","v":2},{"$f":"I4","v":"Shuttle run 20m"},{"$f":"IF(AND(fimTurma!$A$2=1,B4=B3+1),VLOOKUP(\"x\",fimTurma!$B$4:$M$53,6,0),\"\")","v":11},{"$f":"IF(B4=B3+1,fimTurma!$G$1,\"\")","v":11.75},{"$f":"IF(AND(fimTurma!$A$2=1,B4=B3+1),SMALL(fimTurma!$G$4:$G$53,1),\"\")","v":9},{"$f":"IF(AND(fimTurma!$A$2=1,B4=B3+1),LARGE(fimTurma!$G$4:$G$53,1),\"\")","v":14},{"$f":"IF(AND(fimTurma!$A$2=1,B4=B3+1),VLOOKUP(\"x\",'fimScore Z'!$A$4:$L$53,6,0),\"\")","v":-0.57735026918962573},{"$f":"fimTurma!G3","v":"Shuttle run 20m"},{"$f":"IF(B4=B3+1,fimTurma!$G$2,\"\")","v":1.299038105676658},"APTIDÃO CARDIORRESPIRATÓRIA",{"$f":"IF(K4<>K3,IF(A4>0,1,0),IF(A4>0,L3+1,L3))","v":1},{"$f":"I4","v":"Shuttle run 20m"},{"$f":"D4","v":11},{"$f":"E4","v":11.75},{"$f":"F4","v":9},{"$f":"G4","v":14},1,{"$f":"IF(AND(E4<>\"\",iniAuxiliar!E4<>\"\"),E4-iniAuxiliar!E4,\"\")","v":1.5833333333333339},{"$f":"IF(AND(E4<>\"\",iniAuxiliar!E4<>\"\"),IF(S4*R4<=0,\"Não\",IF(U4>=0.05,\"Não\",\"Sim\")),\"\")","v":"Sim"},{"$f":"IF(AND(E4<>\"\",iniAuxiliar!E4<>\"\"),IFERROR(_xlfn.T.TEST(iniTurma!G$4:G$53,fimTurma!G$4:G$53,1,1),_xlfn.T.TEST(iniTurma!G$4:G$53,fimTurma!G$4:G$53,1,2)),\"\")","v":2.1262012613991868E-2},{"$f":"iniAuxiliar!E4","v":10.166666666666666},{"$f":"iniAuxiliar!J4","v":1.818118685772619},{"$f":"J4","v":1.299038105676658}]
[{"$f":"COUNT(fimTurma!H4:H53)","v":11},3,"Força de preensão",{"$f":"IF(AND(fimTurma!$A$2=1,B5=B4+1),VLOOKUP(\"x\",fimTurma!$B$4:$M$53,7,0),\"\")","v":0},{"$f":"IF(B5=B4+1,fimTurma!$H$1,\"\")","v":7.7636363636363646},{"$f":"IF(AND(fimTurma!$A$2=1,B5=B4+1),SMALL(fimTurma!$H$4:$H$53,1),\"\")","v":6.5},{"$f":"IF(AND(fimTurma!$A$2=1,B5=B4+1),LARGE(fimTurma!$H$4:$H$53,1),\"\")","v":10.199999999999999},{"$f":"IF(AND(fimTurma!$A$2=1,B5=B4+1),VLOOKUP(\"x\",'fimScore Z'!$A$4:$L$53,7,0),\"\")","v":""},{"$f":"fimTurma!H3","v":"Força de preensão"},{"$f":"IF(B5=B4+1,fimTurma!$H$2,\"\")","v":0.96603475118437687},"APTIDÃO MUSCULAR",1,"Força de preensão",0,7.7636363636363646,6.5,10.199999999999999,1,{"$f":"IF(AND(E5<>\"\",iniAuxiliar!E5<>\"\"),E5-iniAuxiliar!E5,\"\")","v":-1.1818181818181808},{"$f":"IF(AND(E5<>\"\",iniAuxiliar!E5<>\"\"),IF(S5*R5<=0,\"Não\",IF(U5>=0.05,\"Não\",\"Sim\")),\"\")","v":"Não"},{"$f":"IF(AND(E5<>\"\",iniAuxiliar!E5<>\"\"),IFERROR(_xlfn.T.TEST(iniTurma!H$4:H$53,fimTurma!H$4:H$53,1,1),_xlfn.T.TEST(iniTurma!H$4:H$53,fimTurma!H$4:H$53,1,2)),\"\")","v":9.5792366204519225E-2},{"$f":"iniAuxiliar!E5","v":8.9454545454545453},{"$f":"iniAuxiliar!J5","v":2.424632544367626},0.96603475118437687]
[{"$f":"COUNT(fimTurma!I4:I53)","v":11},4,"Salto horizontal",{"$f":"IF(AND(fimTurma!$A$2=1,B6=B5+1),VLOOKUP(\"x\",fimTurma!$B$4:$M$53,8,0),\"\")","v":39},{"$f":"IF(B6=B5+1,fimTurma!$I$1,\"\")","v":34.527272727272731},{"$f":"IF(AND(fimTurma!$A$2=1,B6=B5+1),SMALL(fimTurma!$I$4:$I$53,1),\"\")","v":30},{"$f":"IF(AND(fimTurma!$A$2=1,B6=B5+1),LARGE(fimTurma!$I$4:$I$53,1),\"\")","v":41},{"$f":"IF(AND(fimTurma!$A$2=1,B6=B5+1),VLOOKUP(\"x\",'fimScore Z'!$A$4:$L$53,8,0),\"\")","v":1.4537773177849869},{"$f":"fimTurma!I3","v":"Salto horizontal"},{"$f":"IF(B6=B5+1,fimTurma!$I$2,\"\")","v":3.0766247471394266},"APTIDÃO MUSCULAR",2,"Salto horizontal",39,34.527272727272731,30,41,1,{"$f":"IF(AND(E6<>\"\",iniAuxiliar!E6<>\"\"),E6-iniAuxiliar!E6,\"\")","v":4.6606060606060673},{"$f":"IF(AND(E6<>\"\",iniAuxiliar!E6<>\"\"),IF(S6*R6<=0,\"Não\",IF(U6>=0.05,\"Não\",\"Sim\")),\"\")","v":"Sim"},{"$f":"IF(AND(E6<>\"\",iniAuxiliar!E6<>\"\"),IFERROR(_xlfn.T.TEST(iniTurma!I$4:I$53,fimTurma!I$4:I$53,1,1),_xlfn.T.TEST(iniTurma!I$4:I$53,fimTurma!I$4:I$53,1,2)),\"\")","v":3.7411206561437215E-3},{"$f":"iniAuxiliar!E6","v":29.866666666666664},{"$f":"iniAuxiliar!J6","v":4.0778534658431482},3.0766247471394266]
[]
[]
[]
[]
[]
[]
[null,null,"Dados para o gráfico","Score Z"]
[null,null,{"$f":"IF(fimTurma!A2=1,IFERROR(VLOOKUP(1,fimAuxiliar!B3:G10,2,0),\"\"),\"\")","v":"Agilidade"},{"$f":"IF(fimTurma!A2=1,IFERROR(VLOOKUP(1,fimAuxiliar!B3:H10,7,0),\"\"),\"\")","v":-0.69431384340758306}]
[null,null,{"$f":"IF(fimTurma!A2=1,IFERROR(VLOOKUP(2,fimAuxiliar!B3:G10,2,0),\"\"),\"\")","v":"Shuttle run 20m"},{"$f":"IF(fimTurma!A2=1,IFERROR(VLOOKUP(2,fimAuxiliar!B3:H10,7,0),\"\"),\"\")","v":-0.57735026918962573}]
[null,null,{"$f":"IF(fimTurma!A2=1,IFERROR(VLOOKUP(3,fimAuxiliar!B3:G10,2,0),\"\"),\"\")","v":"Força de preensão"},{"$f":"IF(fimTurma!A2=1,IFERROR(VLOOKUP(3,fimAuxiliar!B3:H10,7,0),\"\"),\"\")","v":""}]
[null,null,{"$f":"IF(fimTurma!A2=1,IFERROR(VLOOKUP(4,fimAuxiliar!B3:G10,2,0),\"\"),\"\")","v":"Salto horizontal"},{"$f":"IF(fimTurma!A2=1,IFERROR(VLOOKUP(4,fimAuxiliar!B3:H10,7,0),\"\"),\"\")","v":1.4537773177849869}]
[null,null,{"$f":"IF(fimTurma!A2=1,IFERROR(VLOOKUP(5,fimAuxiliar!B3:G10,2,0),\"\"),\"\")","v":""},{"$f":"IF(fimTurma!A2=1,IFERROR(VLOOKUP(5,fimAuxiliar!B3:H10,7,0),\"\"),\"\")","v":""}]
[null,null,{"$f":"IF(fimTurma!A2=1,IFERROR(VLOOKUP(6,fimAuxiliar!B3:G10,2,0),\"\"),\"\")","v":""},{"$f":"IF(fimTurma!A2=1,IFERROR(VLOOKUP(6,fimAuxiliar!B3:H10,7,0),\"\"),\"\")","v":""}]
[null,null,{"$f":"IF(fimTurma!A2=1,IFERROR(VLOOKUP(7,fimAuxiliar!B3:G10,2,0),\"\"),\"\")","v":""},{"$f":"IF(fimTurma!A2=1,IFERROR(VLOOKUP(7,fimAuxiliar!B4:H11,7,0),\"\"),\"\")","v":""}]
[null,null,{"$f":"IF(fimTurma!A2=1,IFERROR(VLOOKUP(8,fimAuxiliar!B3:G10,2,0),\"\"),\"\")","v":""},{"$f":"IF(fimTurma!A2=1,IFERROR(VLOOKUP(8,fimAuxiliar!B3:H10,7,0),\"\"),\"\")","v":""}]