{"text_format":"1","workbook":"xlsx","n_sheets":10,"sheets":["iniTurma","iniRelatório","iniScore Z","fimTurma","fimRelatório","fimScore Z","profRelatório","profPorTeste","iniAuxiliar","fimAuxiliar"],"not_rendered":{"charts":0,"images":5,"macros":1,"external_links":0,"defined_names":0,"comments":2,"pivot_tables":0},"unopened":[],"bounds":{"document_bytes":16777216,"sheet_cells":100000,"rows_first":2000,"rows_last":500,"rows_between":2000,"halvings":0,"cell_chars":16384,"cell_head_chars":4096},"cells_cut":0,"cells_raw":0,"read":"whole","date_system":"1900"}

{"sheet":"iniTurma","index":0,"n_rows":53,"n_cols":9,"rows_kept":53,"cut":false,"hidden":false,"merged":[]}
[null,"Ano:",2,null,"Média:",{"$f":"IF(COUNTA(F4:F53)>0,AVERAGE(F4:F53),\"\")","v":12.5},{"$f":"IF(COUNTA(G4:G53)>0,AVERAGE(G4:G53),\"\")","v":10.166666666666666},8.9454545454545453,29.866666666666664]
[{"$f":"COUNTIF(B4:B53,\"x\")","v":1},"Turma:","A",null,"Desvio-padrão:",{"$f":"IF(COUNTA(F4:F53)>0,_xlfn.STDEV.P(F4:F53),\"\")","v":1.707825127659933},{"$f":"IF(COUNTA(G4:G53)>0,_xlfn.STDEV.P(G4:G53),\"\")","v":1.818118685772619},2.424632544367626,4.0778534658431482]
["ID Aluno",{"$f":"_xlfn.CONCAT(\"Ver: \",COUNTIF(B4:B53,\"x\"))","v":"Ver: 1"},"Nome","Idade","Data","Agilidade","Shuttle run 20m","Força de preensão","Salto horizontal"]
[1,null,"Micas",13,"2024-12-12",10,10,6,32]
[{"$f":"A4+1","v":2},null,"Tecas",12,"2024-12-12",11,9,7,38]
[{"$f":"A5+1","v":3},"x","Lecas",15,"2024-12-12",12,8,8.3000000000000007,25]
[4,null,"Becas",8,"2024-12-13",13,7,null,31]
[5,null,"Nocas",11,"2024-12-13",14,11,7,24]
{"$rows_left_out":46}
{"sheet":"iniRelatório","index":1,"n_rows":25,"n_cols":8,"rows_kept":25,"cut":false,"hidden":false,"merged":[]}
["RELATÓRIO INDIVIDUAL PREFIT BATTERY"]
[{"$f":"IF(iniTurma!A2=1,VLOOKUP(\"x\",iniTurma!B$4:M$53,2,0),\"\")","v":"Lecas"}]
[{"$f":"IF(iniTurma!A2=1,_xlfn.CONCAT(TEXT(VLOOKUP(\"x\",iniTurma!B$4:M$53,4,0),\"dd-mm-aaaa\"),\" | \",iniTurma!C1,\"º ano\",\" | \",iniTurma!C2),\"\")","v":"12-12-2024 | 2º ano | A"}]
[]
[null,"Resultado",null,"Média ",null,"Mínimo",null,"Máximo"]
[null,"da criança",null,"da turma",null,"da turma",null,"da turma"]
["APTIDÃO MOTORA"]
[{"$f":"IF(iniTurma!A2=1,IFERROR(VLOOKUP(1,iniAuxiliar!L3:Q3,2,0),\"\"),\"\")","v":"Agilidade"},{"$f":"IF(iniTurma!A2=1,IFERROR(VLOOKUP(1,iniAuxiliar!L3:Q3,3,0),0),0)","v":12},null,{"$f":"IF(iniTurma!A2=1,IFERROR(VLOOKUP(1,iniAuxiliar!L3:Q3,4,0),0),0)","v":12.5},null,{"$f":"IF(iniTurma!A2=1,IFERROR(VLOOKUP(1,iniAuxiliar!L3:Q3,5,0),0),0)","v":10},null,{"$f":"IF(iniTurma!A2=1,IFERROR(VLOOKUP(1,iniAuxiliar!L3:Q3,6,0),0),0)","v":15}]
{"$rows_left_out":18}
{"sheet":"iniScore Z","index":2,"n_rows":53,"n_cols":8,"rows_kept":53,"cut":false,"hidden":false,"merged":[]}
[]
[]
[{"$f":"iniTurma!B3","v":"Ver: 1"},{"$f":"iniTurma!A3","v":"ID Aluno"},{"$f":"iniTurma!C3","v":"Nome"},{"$f":"iniTurma!D3","v":"Idade"},{"$f":"iniTurma!F3","v":"Agilidade"},{"$f":"iniTurma!G3","v":"Shuttle run 20m"},{"$f":"iniTurma!H3","v":"Força de preensão"},{"$f":"iniTurma!I3","v":"Salto horizontal"}]
[{"$f":"IF(iniTurma!B4<>\"\",iniTurma!B4,\"\")","v":""},{"$f":"iniTurma!A4","v":1},{"$f":"IF(iniTurma!C4<>\"\",iniTurma!C4,\"\")","v":"Micas"},{"$f":"IF(iniTurma!D4<>\"\",iniTurma!D4,\"\")","v":13},{"$f":"IF(AND(iniTurma!F$2<>\"\",iniTurma!F4<>\"\"),(iniTurma!F4-iniTurma!F$1)/iniTurma!F$2,\"\")","v":-1.4638501094227998},{"$f":"IF(AND(iniTurma!G$2<>\"\",iniTurma!G4<>\"\"),(iniTurma!G4-iniTurma!G$1)/iniTurma!G$2,\"\")","v":-9.1669849702820799E-2},{"$f":"IF(AND(iniTurma!H$2<>\"\",iniTurma!H4<>\"\"),(iniTurma!H4-iniTurma!H$1)/iniTurma!H$2,\"\")","v":-1.2148045081291921},{"$f":"IF(AND(iniTurma!I$2<>\"\",iniTurma!I4<>\"\"),(iniTurma!I4-iniTurma!I$1)/iniTurma!I$2,\"\")","v":0.52315105268066386}]
[{"$f":"IF(iniTurma!B5<>\"\",iniTurma!B5,\"\")","v":""},{"$f":"iniTurma!A5","v":2},{"$f":"IF(iniTurma!C5<>\"\",iniTurma!C5,\"\")","v":"Tecas"},{"$f":"IF(iniTurma!D5<>\"\",iniTurma!D5,\"\")","v":12},{"$f":"IF(AND(iniTurma!F$2<>\"\",iniTurma!F5<>\"\"),(iniTurma!F5-iniTurma!F$1)/iniTurma!F$2,\"\")","v":-0.87831006565367986},{"$f":"IF(AND(iniTurma!G$2<>\"\",iniTurma!G5<>\"\"),(iniTurma!G5-iniTurma!G$1)/iniTurma!G$2,\"\")","v":-0.64168894791974762},{"$f":"IF(AND(iniTurma!H$2<>\"\",iniTurma!H5<>\"\"),(iniTurma!H5-iniTurma!H$1)/iniTurma!H$2,\"\")","v":-0.80237087882607128},{"$f":"IF(AND(iniTurma!I$2<>\"\",iniTurma!I5<>\"\"),(iniTurma!I5-iniTurma!I$1)/iniTurma!I$2,\"\")","v":1.9945133883450288}]
[{"$f":"IF(iniTurma!B6<>\"\",iniTurma!B6,\"\")","v":"x"},{"$f":"iniTurma!A6","v":3},{"$f":"IF(iniTurma!C6<>\"\",iniTurma!C6,\"\")","v":"Lecas"},{"$f":"IF(iniTurma!D6<>\"\",iniTurma!D6,\"\")","v":15},{"$f":"IF(AND(iniTurma!F$2<>\"\",iniTurma!F6<>\"\"),(iniTurma!F6-iniTurma!F$1)/iniTurma!F$2,\"\")","v":-0.29277002188455997},{"$f":"IF(AND(iniTurma!G$2<>\"\",iniTurma!G6<>\"\"),(iniTurma!G6-iniTurma!G$1)/iniTurma!G$2,\"\")","v":-1.1917080461366745},{"$f":"IF(AND(iniTurma!H$2<>\"\",iniTurma!H6<>\"\"),(iniTurma!H6-iniTurma!H$1)/iniTurma!H$2,\"\")","v":-0.26620716073201395},{"$f":"IF(AND(iniTurma!I$2<>\"\",iniTurma!I6<>\"\"),(iniTurma!I6-iniTurma!I$1)/iniTurma!I$2,\"\")","v":-1.1934383389277619}]
[{"$f":"IF(iniTurma!B7<>\"\",iniTurma!B7,\"\")","v":""},{"$f":"iniTurma!A7","v":4},{"$f":"IF(iniTurma!C7<>\"\",iniTurma!C7,\"\")","v":"Becas"},{"$f":"IF(iniTurma!D7<>\"\",iniTurma!D7,\"\")","v":8},{"$f":"IF(AND(iniTurma!F$2<>\"\",iniTurma!F7<>\"\"),(iniTurma!F7-iniTurma!F$1)/iniTurma!F$2,\"\")","v":0.29277002188455997},{"$f":"IF(AND(iniTurma!G$2<>\"\",iniTurma!G7<>\"\"),(iniTurma!G7-iniTurma!G$1)/iniTurma!G$2,\"\")","v":-1.7417271443536011},{"$f":"IF(AND(iniTurma!H$2<>\"\",iniTurma!H7<>\"\"),(iniTurma!H7-iniTurma!H$1)/iniTurma!H$2,\"\")","v":""},{"$f":"IF(AND(iniTurma!I$2<>\"\",iniTurma!I7<>\"\"),(iniTurma!I7-iniTurma!I$1)/iniTurma!I$2,\"\")","v":0.27792399673660301}]
[{"$f":"IF(iniTurma!B8<>\"\",iniTurma!B8,\"\")","v":""},{"$f":"iniTurma!A8","v":5},{"$f":"IF(iniTurma!C8<>\"\",iniTurma!C8,\"\")","v":"Nocas"},{"$f":"IF(iniTurma!D8<>\"\",iniTurma!D8,\"\")","v":11},{"$f":"IF(AND(iniTurma!F$2<>\"\",iniTurma!F8<>\"\"),(iniTurma!F8-iniTurma!F$1)/iniTurma!F$2,\"\")","v":0.87831006565367986},{"$f":"IF(AND(iniTurma!G$2<>\"\",iniTurma!G8<>\"\"),(iniTurma!G8-iniTurma!G$1)/iniTurma!G$2,\"\")","v":0.45834924851410597},{"$f":"IF(AND(iniTurma!H$2<>\"\",iniTurma!H8<>\"\"),(iniTurma!H8-iniTurma!H$1)/iniTurma!H$2,\"\")","v":-0.80237087882607128},{"$f":"IF(AND(iniTurma!I$2<>\"\",iniTurma!I8<>\"\"),(iniTurma!I8-iniTurma!I$1)/iniTurma!I$2,\"\")","v":-1.4386653948718227}]
{"$rows_left_out":46}
{"sheet":"fimTurma","index":3,"n_rows":53,"n_cols":9,"rows_kept":53,"cut":false,"hidden":false,"merged":[]}
[null,"Ano:",{"$f":"IF(iniTurma!C1<>\"\",iniTurma!C1,\"\")","v":2},null,"Média:",{"$f":"IF(COUNTA(F4:F53)>0,AVERAGE(F4:F53),\"\")","v":14.916666666666666},{"$f":"IF(COUNTA(G4:G53)>0,AVERAGE(G4:G53),\"\")","v":11.75},7.7636363636363646,34.527272727272731]
[{"$f":"COUNTIF(B4:B53,\"x\")","v":1},"Turma:",{"$f":"IF(iniTurma!C2<>\"\",iniTurma!C2,\"\")","v":"A"},null,"Desvio-padrão:",{"$f":"IF(COUNTA(F4:F53)>0,_xlfn.STDEV.P(F4:F53),\"\")","v":1.3202482931462383},{"$f":"IF(COUNTA(G4:G53)>0,_xlfn.STDEV.P(G4:G53),\"\")","v":1.299038105676658},0.96603475118437687,3.0766247471394266]
["ID Aluno",{"$f":"_xlfn.CONCAT(\"Ver: \",COUNTIF(B4:B53,\"x\"))","v":"Ver: 1"},"Nome","Idade","Data",{"$f":"iniTurma!F3","v":"Agilidade"},{"$f":"iniTurma!G3","v":"Shuttle run 20m"},{"$f":"iniTurma!H3","v":"Força de preensão"},{"$f":"iniTurma!I3","v":"Salto horizontal"}]
[1,null,{"$f":"IF(iniTurma!C4<>\"\",iniTurma!C4,\"\")","v":"Micas"},13,"2025-06-08",15,12,6.5,35]
[{"$f":"A4+1","v":2},null,{"$f":"IF(iniTurma!C5<>\"\",iniTurma!C5,\"\")","v":"Tecas"},12,"2025-06-08",14,12,7]
[{"$f":"A5+1","v":3},null,{"$f":"IF(iniTurma!C6<>\"\",iniTurma!C6,\"\")","v":"Lecas"},15,"2025-06-08",13,13,8,34]
[4,"x",{"$f":"IF(iniTurma!C7<>\"\",iniTurma!C7,\"\")","v":"Becas"},8,"2025-06-08",14,11,null,39]
[5,null,{"$f":"IF(iniTurma!C8<>\"\",iniTurma!C8,\"\")","v":"Nocas"},11,"2025-06-08",15,14,7.2,41]
{"$rows_left_out":46}
{"sheet":"fimRelatório","index":4,"n_rows":25,"n_cols":8,"rows_kept":25,"cut":false,"hidden":false,"merged":[]}
["RELATÓRIO INDIVIDUAL PREFIT BATTERY"]
[{"$f":"IF(fimTurma!A2=1,VLOOKUP(\"x\",fimTurma!B$4:M$53,2,0),\"\")","v":"Becas"}]
[{"$f":"IF(fimTurma!A2=1,_xlfn.CONCAT(TEXT(VLOOKUP(\"x\",fimTurma!B$4:M$53,4,0),\"dd-mm-aaaa\"),\" | \",fimTurma!C1,\"º ano\",\" | \",fimTurma!C2),\"\")","v":"08-06-2025 | 2º ano | A"}]
[]
[null,"Resultado",null,"Média ",null,"Mínimo",null,"Máximo"]
[null,"da criança",null,"da turma",null,"da turma",null,"da turma"]
[{"$f":"iniRelatório!A7","v":"APTIDÃO MOTORA"}]
[{"$f":"IF(fimTurma!A2=1,IFERROR(VLOOKUP(1,fimAuxiliar!L3:Q3,2,0),\"\"),\"\")","v":"Agilidade"},{"$f":"IF(fimTurma!A2=1,IFERROR(VLOOKUP(1,fimAuxiliar!L3:Q3,3,0),0),0)","v":14},null,{"$f":"IF(fimTurma!A2=1,IFERROR(VLOOKUP(1,fimAuxiliar!L3:Q3,4,0),0),0)","v":14.916666666666666},null,{"$f":"IF(fimTurma!A2=1,IFERROR(VLOOKUP(1,fimAuxiliar!L3:Q3,5,0),0),0)","v":13},null,{"$f":"IF(fimTurma!A2=1,IFERROR(VLOOKUP(1,fimAuxiliar!L3:Q3,6,0),0),0)","v":17}]
{"$rows_left_out":18}
{"sheet":"fimScore Z","index":5,"n_rows":53,"n_cols":8,"rows_kept":53,"cut":false,"hidden":false,"merged":[]}
[]
[]
[{"$f":"fimTurma!B3","v":"Ver: 1"},{"$f":"fimTurma!A3","v":"ID Aluno"},{"$f":"fimTurma!C3","v":"Nome"},"Idade",{"$f":"fimTurma!F3","v":"Agilidade"},{"$f":"fimTurma!G3","v":"Shuttle run 20m"},{"$f":"fimTurma!H3","v":"Força de preensão"},{"$f":"fimTurma!I3","v":"Salto horizontal"}]
[{"$f":"IF(fimTurma!B4<>\"\",fimTurma!B4,\"\")","v":""},{"$f":"fimTurma!A4","v":1},{"$f":"IF(fimTurma!C4<>\"\",fimTurma!C4,\"\")","v":"Micas"},{"$f":"IF(fimTurma!D4<>\"\",fimTurma!D4,\"\")","v":13},{"$f":"IF(AND(fimTurma!F$2<>\"\",fimTurma!F4<>\"\"),(fimTurma!F4-fimTurma!F$1)/fimTurma!F$2,\"\")","v":6.3119440309780769E-2},{"$f":"IF(AND(fimTurma!G$2<>\"\",fimTurma!G4<>\"\"),(fimTurma!G4-fimTurma!G$1)/fimTurma!G$2,\"\")","v":0.19245008972987526},{"$f":"IF(AND(fimTurma!H$2<>\"\",fimTurma!H4<>\"\"),(fimTurma!H4-fimTurma!H$1)/fimTurma!H$2,\"\")","v":-1.3080651209359937},{"$f":"IF(AND(fimTurma!I$2<>\"\",fimTurma!I4<>\"\"),(fimTurma!I4-fimTurma!I$1)/fimTurma!I$2,\"\")","v":0.1536512612293065}]
[{"$f":"IF(fimTurma!B5<>\"\",fimTurma!B5,\"\")","v":""},{"$f":"fimTurma!A5","v":2},{"$f":"IF(fimTurma!C5<>\"\",fimTurma!C5,\"\")","v":"Tecas"},{"$f":"IF(fimTurma!D5<>\"\",fimTurma!D5,\"\")","v":12},{"$f":"IF(AND(fimTurma!F$2<>\"\",fimTurma!F5<>\"\"),(fimTurma!F5-fimTurma!F$1)/fimTurma!F$2,\"\")","v":-0.69431384340758306},{"$f":"IF(AND(fimTurma!G$2<>\"\",fimTurma!G5<>\"\"),(fimTurma!G5-fimTurma!G$1)/fimTurma!G$2,\"\")","v":0.19245008972987526},{"$f":"IF(AND(fimTurma!H$2<>\"\",fimTurma!H5<>\"\"),(fimTurma!H5-fimTurma!H$1)/fimTurma!H$2,\"\")","v":-0.7904853968246297},{"$f":"IF(AND(fimTurma!I$2<>\"\",fimTurma!I5<>\"\"),(fimTurma!I5-fimTurma!I$1)/fimTurma!I$2,\"\")","v":""}]
[{"$f":"IF(fimTurma!B6<>\"\",fimTurma!B6,\"\")","v":""},{"$f":"fimTurma!A6","v":3},{"$f":"IF(fimTurma!C6<>\"\",fimTurma!C6,\"\")","v":"Lecas"},{"$f":"IF(fimTurma!D6<>\"\",fimTurma!D6,\"\")","v":15},{"$f":"IF(AND(fimTurma!F$2<>\"\",fimTurma!F6<>\"\"),(fimTurma!F6-fimTurma!F$1)/fimTurma!F$2,\"\")","v":-1.4517471271249469},{"$f":"IF(AND(fimTurma!G$2<>\"\",fimTurma!G6<>\"\"),(fimTurma!G6-fimTurma!G$1)/fimTurma!G$2,\"\")","v":0.96225044864937626},{"$f":"IF(AND(fimTurma!H$2<>\"\",fimTurma!H6<>\"\"),(fimTurma!H6-fimTurma!H$1)/fimTurma!H$2,\"\")","v":0.24467405139809842},{"$f":"IF(AND(fimTurma!I$2<>\"\",fimTurma!I6<>\"\"),(fimTurma!I6-fimTurma!I$1)/fimTurma!I$2,\"\")","v":-0.17138025290961359}]
[{"$f":"IF(fimTurma!B7<>\"\",fimTurma!B7,\"\")","v":"x"},{"$f":"fimTurma!A7","v":4},{"$f":"IF(fimTurma!C7<>\"\",fimTurma!C7,\"\")","v":"Becas"},{"$f":"IF(fimTurma!D7<>\"\",fimTurma!D7,\"\")","v":8},{"$f":"IF(AND(fimTurma!F$2<>\"\",fimTurma!F7<>\"\"),(fimTurma!F7-fimTurma!F$1)/fimTurma!F$2,\"\")","v":-0.69431384340758306},{"$f":"IF(AND(fimTurma!G$2<>\"\",fimTurma!G7<>\"\"),(fimTurma!G7-fimTurma!G$1)/fimTurma!G$2,\"\")","v":-0.57735026918962573},{"$f":"IF(AND(fimTurma!H$2<>\"\",fimTurma!H7<>\"\"),(fimTurma!H7-fimTurma!H$1)/fimTurma!H$2,\"\")","v":""},{"$f":"IF(AND(fimTurma!I$2<>\"\",fimTurma!I7<>\"\"),(fimTurma!I7-fimTurma!I$1)/fimTurma!I$2,\"\")","v":1.4537773177849869}]
[{"$f":"IF(fimTurma!B8<>\"\",fimTurma!B8,\"\")","v":""},{"$f":"fimTurma!A8","v":5},{"$f":"IF(fimTurma!C8<>\"\",fimTurma!C8,\"\")","v":"Nocas"},{"$f":"IF(fimTurma!D8<>\"\",fimTurma!D8,\"\")","v":11},{"$f":"IF(AND(fimTurma!F$2<>\"\",fimTurma!F8<>\"\"),(fimTurma!F8-fimTurma!F$1)/fimTurma!F$2,\"\")","v":6.3119440309780769E-2},{"$f":"IF(AND(fimTurma!G$2<>\"\",fimTurma!G8<>\"\"),(fimTurma!G8-fimTurma!G$1)/fimTurma!G$2,\"\")","v":1.7320508075688772},{"$f":"IF(AND(fimTurma!H$2<>\"\",fimTurma!H8<>\"\"),(fimTurma!H8-fimTurma!H$1)/fimTurma!H$2,\"\")","v":-0.58345350718008393},{"$f":"IF(AND(fimTurma!I$2<>\"\",fimTurma!I8<>\"\"),(fimTurma!I8-fimTurma!I$1)/fimTurma!I$2,\"\")","v":2.1038403460628272}]
{"$rows_left_out":46}
{"sheet":"profRelatório","index":6,"n_rows":20,"n_cols":11,"rows_kept":20,"cut":false,"hidden":false,"merged":[[3,2,3,4],[3,6,3,8]]}
["RELATÓRIO RESUMO PARA O PROFESSOR/TREINADOR"]
[{"$f":"_xlfn.CONCAT(fimTurma!C1,\"º ano\",\" | \",fimTurma!C2)","v":"2º ano | A"}]
[]
[null,null,"Início do Ano",null,null,null,"Fim do Ano",null,null,null,"Melhoria"]
[null,null,"Média",null,"Desvio",null,"Média",null,"Desvio",null,"Com"]
[null,null,null,null,"Padrão",null,null,null,"Padrão",null,"Significado?"]
["APTIDÃO MOTORA"]
[{"$f":"IF(fimTurma!A2=1,IFERROR(VLOOKUP(1,fimAuxiliar!L3:Q3,2,0),\"\"),\"\")","v":"Agilidade"},null,{"$f":"IF(fimTurma!$A$2=1,IFERROR(VLOOKUP(1,fimAuxiliar!$L$3:$X$3,11,0),0),0)","v":12.5},null,{"$f":"IF(fimTurma!$A$2=1,IFERROR(VLOOKUP(1,fimAuxiliar!L3:X3,12,0),0),0)","v":1.707825127659933},null,{"$f":"IF(fimTurma!A2=1,IFERROR(VLOOKUP(1,fimAuxiliar!L3:X3,4,0),0),0)","v":14.916666666666666},null,{"$f":"IF(fimTurma!A2=1,IFERROR(VLOOKUP(1,fimAuxiliar!L3:X3,13,0),0),0)","v":1.3202482931462383},null,{"$f":"IF(fimTurma!A2=1,IFERROR(VLOOKUP(1,fimAuxiliar!L3:X3,9,0),0),0)","v":"Não"}]
{"$rows_left_out":13}
{"sheet":"profPorTeste","index":7,"n_rows":5,"n_cols":1,"rows_kept":5,"cut":false,"hidden":false,"merged":[]}
["RELATÓRIO POR TESTE PARA O PROFESSOR/TREINADOR"]
[{"$f":"_xlfn.CONCAT(fimTurma!C1,\"º ano\",\" | \",fimTurma!C2)","v":"2º ano | A"}]
[]
[]
["Teste: Salto horizontal"]

{"sheet":"iniAuxiliar","index":8,"n_rows":17,"n_cols":17,"rows_kept":17,"cut":false,"hidden":true,"merged":[]}
["Número","Ordem","Teste","Criança","Média","Mínimo","Máximo","Score Z","Nome Gráfico","Dpadrão","Grupo","Ordem Resumo","Nome","Criança","Média","Mínimo","Máximo"]
[null,0]
[{"$f":"COUNT(iniTurma!F4:F53)","v":12},{"$f":"IF(A3>0,B2+1,B2)","v":1},{"$f":"iniTurma!F3","v":"Agilidade"},{"$f":"IF(AND(iniTurma!$A$2=1,B3=B2+1),VLOOKUP(\"x\",iniTurma!$B$4:$M$53,5,0),\"\")","v":12},{"$f":"IF(B3=B2+1,iniTurma!$F$1,\"\")","v":12.5},{"$f":"IF(AND(iniTurma!$A$2=1,B3=B2+1),SMALL(iniTurma!$F$4:$F$53,1),\"\")","v":10},{"$f":"IF(AND(iniTurma!$A$2=1,B3=B2+1),LARGE(iniTurma!$F$4:$F$53,1),\"\")","v":15},{"$f":"IF(AND(iniTurma!$A$2=1,B3=B2+1),VLOOKUP(\"x\",'iniScore Z'!$A$4:$L$53,5,0),\"\")","v":-0.29277002188455997},{"$f":"C3","v":"Agilidade"},{"$f":"IF(B3=B2+1,iniTurma!$F$2,\"\")","v":1.707825127659933},"APTIDÃO MOTORA",{"$f":"IF(K3<>K2,IF(A3>0,1,0),IF(A3>0,L2+1,L2))","v":1},{"$f":"I3","v":"Agilidade"},{"$f":"D3","v":12},{"$f":"E3","v":12.5},10,15]
[{"$f":"COUNT(iniTurma!G4:G53)","v":12},{"$f":"IF(A4>0,B3+1,B3)","v":2},{"$f":"iniTurma!G3","v":"Shuttle run 20m"},{"$f":"IF(AND(iniTurma!$A$2=1,B4=B3+1),VLOOKUP(\"x\",iniTurma!$B$4:$M$53,6,0),\"\")","v":8},{"$f":"IF(B4=B3+1,iniTurma!$G$1,\"\")","v":10.166666666666666},{"$f":"IF(AND(iniTurma!$A$2=1,B4=B3+1),SMALL(iniTurma!$G$4:$G$53,1),\"\")","v":7},{"$f":"IF(AND(iniTurma!$A$2=1,B4=B3+1),LARGE(iniTurma!$G$4:$G$53,1),\"\")","v":13},{"$f":"IF(AND(iniTurma!$A$2=1,B4=B3+1),VLOOKUP(\"x\",'iniScore Z'!$A$4:$L$53,6,0),\"\")","v":-1.1917080461366745},{"$f":"C4","v":"Shuttle run 20m"},{"$f":"IF(B4=B3+1,iniTurma!$G$2,\"\")","v":1.818118685772619},"APTIDÃO CARDIORRESPIRATÓRIA",{"$f":"IF(K4<>K3,IF(A4>0,1,0),IF(A4>0,L3+1,L3))","v":1},{"$f":"I4","v":"Shuttle run 20m"},{"$f":"D4","v":8},{"$f":"E4","v":10.166666666666666},{"$f":"F4","v":7},{"$f":"G4","v":13}]
[{"$f":"COUNT(iniTurma!H4:H53)","v":11},3,{"$f":"iniTurma!H3","v":"Força de preensão"},{"$f":"IF(AND(iniTurma!$A$2=1,B5=B4+1),VLOOKUP(\"x\",iniTurma!$B$4:$M$53,7,0),\"\")","v":8.3000000000000007},{"$f":"IF(B5=B4+1,iniTurma!$H$1,\"\")","v":8.9454545454545453},{"$f":"IF(AND(iniTurma!$A$2=1,B5=B4+1),SMALL(iniTurma!$H$4:$H$53,1),\"\")","v":6},{"$f":"IF(AND(iniTurma!$A$2=1,B5=B4+1),LARGE(iniTurma!$H$4:$H$53,1),\"\")","v":14.7},{"$f":"IF(AND(iniTurma!$A$2=1,B5=B4+1),VLOOKUP(\"x\",'iniScore Z'!$A$4:$L$53,7,0),\"\")","v":-0.26620716073201395},"Força de preensão",{"$f":"IF(B5=B4+1,iniTurma!$H$2,\"\")","v":2.424632544367626},"APTIDÃO MUSCULAR",1,"Força de preensão",8.3000000000000007,8.9454545454545453,6,14.7]
[{"$f":"COUNT(iniTurma!I4:I53)","v":12},4,{"$f":"iniTurma!I3","v":"Salto horizontal"},{"$f":"IF(AND(iniTurma!$A$2=1,B6=B5+1),VLOOKUP(\"x\",iniTurma!$B$4:$M$53,8,0),\"\")","v":25},{"$f":"IF(B6=B5+1,iniTurma!$I$1,\"\")","v":29.866666666666664},{"$f":"IF(AND(iniTurma!$A$2=1,B6=B5+1),SMALL(iniTurma!$I$4:$I$53,1),\"\")","v":24},{"$f":"IF(AND(iniTurma!$A$2=1,B6=B5+1),LARGE(iniTurma!$I$4:$I$53,1),\"\")","v":38},{"$f":"IF(AND(iniTurma!$A$2=1,B6=B5+1),VLOOKUP(\"x\",'iniScore Z'!$A$4:$L$53,8,0),\"\")","v":-1.1934383389277619},"Salto horizontal",{"$f":"IF(B6=B5+1,iniTurma!$I$2,\"\")","v":4.0778534658431482},"APTIDÃO MUSCULAR",2,"Salto horizontal",25,29.866666666666664,24,38]
[]
[]
{"$rows_left_out":10}
{"sheet":"fimAuxiliar","index":9,"n_rows":21,"n_cols":24,"rows_kept":21,"cut":false,"hidden":true,"merged":[]}
["Número","Ordem Resumo","Teste","Criança","Média","Mínimo","Máximo","Score Z","Nome Gráfico","Dpadrão","Grupo","Ordem Relatório","Nome","Criança","Média","Mínimo","Máximo","Melhor","difMédia","Conclusão","Teste T","média","desvio padrão","dpadrão"]
[null,0,null,"fim","fim","fim","fim","fim",null,"fim",null,null,null,"fim","fim","fim","fim",null,null,null,null,"ini","ini","fim"]
[{"$f":"COUNT(fimTurma!F4:F53)","v":12},{"$f":"IF(A3>0,B2+1,B2)","v":1},{"$f":"I3","v":"Agilidade"},{"$f":"IF(AND(fimTurma!$A$2=1,B3=B2+1),VLOOKUP(\"x\",fimTurma!$B$4:$M$53,5,0),\"\")","v":14},{"$f":"IF(B3=B2+1,fimTurma!$F$1,\"\")","v":14.916666666666666},{"$f":"IF(AND(fimTurma!$A$2=1,B3=B2+1),SMALL(fimTurma!$F$4:$F$53,1),\"\")","v":13},{"$f":"IF(AND(fimTurma!$A$2=1,B3=B2+1),LARGE(fimTurma!$F$4:$F$53,1),\"\")","v":17},{"$f":"IF(AND(fimTurma!$A$2=1,B3=B2+1),VLOOKUP(\"x\",'fimScore Z'!$A$4:$L$53,5,0),\"\")","v":-0.69431384340758306},{"$f":"fimTurma!F3","v":"Agilidade"},{"$f":"IF(B3=B2+1,fimTurma!$F$2,\"\")","v":1.3202482931462383},"APTIDÃO MOTORA",{"$f":"IF(K3<>K2,IF(A3>0,1,0),IF(A3>0,L2+1,L2))","v":1},{"$f":"I3","v":"Agilidade"},{"$f":"D3","v":14},{"$f":"E3","v":14.916666666666666},13,17,-1,{"$f":"IF(AND(E3<>\"\",iniAuxiliar!E3<>\"\"),E3-iniAuxiliar!E3,\"\")","v":2.4166666666666661},{"$f":"IF(AND(E3<>\"\",iniAuxiliar!E3<>\"\"),IF(S3*R3<=0,\"Não\",IF(U3>=0.05,\"Não\",\"Sim\")),\"\")","v":"Não"},{"$f":"IF(AND(E3<>\"\",iniAuxiliar!E3<>\"\"),IFERROR(_xlfn.T.TEST(iniTurma!F$4:F$53,fimTurma!F$4:F$53,1,1),_xlfn.T.TEST(iniTurma!F$4:F$53,fimTurma!F$4:F$53,1,2)),\"\")","v":4.0185331583574013E-4},{"$f":"iniAuxiliar!E3","v":12.5},{"$f":"iniAuxiliar!J3","v":1.707825127659933},{"$f":"J3","v":1.3202482931462383}]
[{"$f":"COUNT(fimTurma!G4:G53)","v":12},{"$f":"IF(A4>0,B3+1,B3)","v":2},{"$f":"I4","v":"Shuttle run 20m"},{"$f":"IF(AND(fimTurma!$A$2=1,B4=B3+1),VLOOKUP(\"x\",fimTurma!$B$4:$M$53,6,0),\"\")","v":11},{"$f":"IF(B4=B3+1,fimTurma!$G$1,\"\")","v":11.75},{"$f":"IF(AND(fimTurma!$A$2=1,B4=B3+1),SMALL(fimTurma!$G$4:$G$53,1),\"\")","v":9},{"$f":"IF(AND(fimTurma!$A$2=1,B4=B3+1),LARGE(fimTurma!$G$4:$G$53,1),\"\")","v":14},{"$f":"IF(AND(fimTurma!$A$2=1,B4=B3+1),VLOOKUP(\"x\",'fimScore Z'!$A$4:$L$53,6,0),\"\")","v":-0.57735026918962573},{"$f":"fimTurma!G3","v":"Shuttle run 20m"},{"$f":"IF(B4=B3+1,fimTurma!$G$2,\"\")","v":1.299038105676658},"APTIDÃO CARDIORRESPIRATÓRIA",{"$f":"IF(K4<>K3,IF(A4>0,1,0),IF(A4>0,L3+1,L3))","v":1},{"$f":"I4","v":"Shuttle run 20m"},{"$f":"D4","v":11},{"$f":"E4","v":11.75},{"$f":"F4","v":9},{"$f":"G4","v":14},1,{"$f":"IF(AND(E4<>\"\",iniAuxiliar!E4<>\"\"),E4-iniAuxiliar!E4,\"\")","v":1.5833333333333339},{"$f":"IF(AND(E4<>\"\",iniAuxiliar!E4<>\"\"),IF(S4*R4<=0,\"Não\",IF(U4>=0.05,\"Não\",\"Sim\")),\"\")","v":"Sim"},{"$f":"IF(AND(E4<>\"\",iniAuxiliar!E4<>\"\"),IFERROR(_xlfn.T.TEST(iniTurma!G$4:G$53,fimTurma!G$4:G$53,1,1),_xlfn.T.TEST(iniTurma!G$4:G$53,fimTurma!G$4:G$53,1,2)),\"\")","v":2.1262012613991868E-2},{"$f":"iniAuxiliar!E4","v":10.166666666666666},{"$f":"iniAuxiliar!J4","v":1.818118685772619},{"$f":"J4","v":1.299038105676658}]
[{"$f":"COUNT(fimTurma!H4:H53)","v":11},3,"Força de preensão",{"$f":"IF(AND(fimTurma!$A$2=1,B5=B4+1),VLOOKUP(\"x\",fimTurma!$B$4:$M$53,7,0),\"\")","v":0},{"$f":"IF(B5=B4+1,fimTurma!$H$1,\"\")","v":7.7636363636363646},{"$f":"IF(AND(fimTurma!$A$2=1,B5=B4+1),SMALL(fimTurma!$H$4:$H$53,1),\"\")","v":6.5},{"$f":"IF(AND(fimTurma!$A$2=1,B5=B4+1),LARGE(fimTurma!$H$4:$H$53,1),\"\")","v":10.199999999999999},{"$f":"IF(AND(fimTurma!$A$2=1,B5=B4+1),VLOOKUP(\"x\",'fimScore Z'!$A$4:$L$53,7,0),\"\")","v":""},{"$f":"fimTurma!H3","v":"Força de preensão"},{"$f":"IF(B5=B4+1,fimTurma!$H$2,\"\")","v":0.96603475118437687},"APTIDÃO MUSCULAR",1,"Força de preensão",0,7.7636363636363646,6.5,10.199999999999999,1,{"$f":"IF(AND(E5<>\"\",iniAuxiliar!E5<>\"\"),E5-iniAuxiliar!E5,\"\")","v":-1.1818181818181808},{"$f":"IF(AND(E5<>\"\",iniAuxiliar!E5<>\"\"),IF(S5*R5<=0,\"Não\",IF(U5>=0.05,\"Não\",\"Sim\")),\"\")","v":"Não"},{"$f":"IF(AND(E5<>\"\",iniAuxiliar!E5<>\"\"),IFERROR(_xlfn.T.TEST(iniTurma!H$4:H$53,fimTurma!H$4:H$53,1,1),_xlfn.T.TEST(iniTurma!H$4:H$53,fimTurma!H$4:H$53,1,2)),\"\")","v":9.5792366204519225E-2},{"$f":"iniAuxiliar!E5","v":8.9454545454545453},{"$f":"iniAuxiliar!J5","v":2.424632544367626},0.96603475118437687]
[{"$f":"COUNT(fimTurma!I4:I53)","v":11},4,"Salto horizontal",{"$f":"IF(AND(fimTurma!$A$2=1,B6=B5+1),VLOOKUP(\"x\",fimTurma!$B$4:$M$53,8,0),\"\")","v":39},{"$f":"IF(B6=B5+1,fimTurma!$I$1,\"\")","v":34.527272727272731},{"$f":"IF(AND(fimTurma!$A$2=1,B6=B5+1),SMALL(fimTurma!$I$4:$I$53,1),\"\")","v":30},{"$f":"IF(AND(fimTurma!$A$2=1,B6=B5+1),LARGE(fimTurma!$I$4:$I$53,1),\"\")","v":41},{"$f":"IF(AND(fimTurma!$A$2=1,B6=B5+1),VLOOKUP(\"x\",'fimScore Z'!$A$4:$L$53,8,0),\"\")","v":1.4537773177849869},{"$f":"fimTurma!I3","v":"Salto horizontal"},{"$f":"IF(B6=B5+1,fimTurma!$I$2,\"\")","v":3.0766247471394266},"APTIDÃO MUSCULAR",2,"Salto horizontal",39,34.527272727272731,30,41,1,{"$f":"IF(AND(E6<>\"\",iniAuxiliar!E6<>\"\"),E6-iniAuxiliar!E6,\"\")","v":4.6606060606060673},{"$f":"IF(AND(E6<>\"\",iniAuxiliar!E6<>\"\"),IF(S6*R6<=0,\"Não\",IF(U6>=0.05,\"Não\",\"Sim\")),\"\")","v":"Sim"},{"$f":"IF(AND(E6<>\"\",iniAuxiliar!E6<>\"\"),IFERROR(_xlfn.T.TEST(iniTurma!I$4:I$53,fimTurma!I$4:I$53,1,1),_xlfn.T.TEST(iniTurma!I$4:I$53,fimTurma!I$4:I$53,1,2)),\"\")","v":3.7411206561437215E-3},{"$f":"iniAuxiliar!E6","v":29.866666666666664},{"$f":"iniAuxiliar!J6","v":4.0778534658431482},3.0766247471394266]
[]
[]
{"$rows_left_out":13}