{"text_format":"1","workbook":"xlsx","n_sheets":11,"sheets":["iniTurma","iniRelatório","iniScore Z","fimTurma","fimRelatório","fimScore Z","profRelatório","profPorTeste","iniAuxiliar","fimAuxiliar","difAuxiliar"],"not_rendered":{"charts":0,"images":5,"macros":1,"external_links":0,"defined_names":0,"comments":2,"pivot_tables":0},"unopened":[],"bounds":{"document_bytes":16777216,"sheet_cells":100000,"rows_first":2000,"rows_last":500,"rows_between":2000,"halvings":0,"cell_chars":16384,"cell_head_chars":4096},"cells_cut":0,"cells_raw":0,"read":"whole","date_system":"1900"}

{"sheet":"iniTurma","index":0,"n_rows":53,"n_cols":11,"rows_kept":53,"cut":false,"hidden":false,"merged":[]}
[null,"Ano:",2,null,"Média:",{"$f":"IF(COUNTA(F4:F53)>0,AVERAGE(F4:F53),\"\")","v":12.3575},{"$f":"IF(COUNTA(G4:G53)>0,AVERAGE(G4:G53),\"\")","v":13.333333333333334},9.0333333333333332,29.866666666666664,12.363636363636363,10.951666666666668]
[{"$f":"COUNTIF(B4:B53,\"x\")","v":1},"Turma:","A",null,"Desvio-padrão:",{"$f":"IF(COUNTA(F4:F53)>0,_xlfn.STDEV.P(F4:F53),\"\")","v":1.1577717463587831},{"$f":"IF(COUNTA(G4:G53)>0,_xlfn.STDEV.P(G4:G53),\"\")","v":1.5986105077709065},2.3396343493992631,4.0778534658431482,4.3332273773865397,1.3716281890107287]
["ID Aluno",{"$f":"_xlfn.CONCAT(\"Ver: \",COUNTIF(B4:B53,\"x\"))","v":"Ver: 1"},"Nome","Idade","Data","Corrida vaivém","Corrida velocidade","Salto horizontal","Receber","Lançar","Equilíbrio"]
[1,null,"Micas",13,"2024-12-12",13.12,13,6,32,8,11.2]
[{"$f":"A4+1","v":2},null,"Tecas",12,"2024-12-12",12.43,14,7,38,9,10.199999999999999]
[{"$f":"A5+1","v":3},null,"Lecas",15,"2024-12-12",10,14,8.3000000000000007,25,12,9.9]
[4,"x","Becas",8,"2024-12-13",11.64,15,10,31,null,10.119999999999999]
[5,null,"Nocas",11,"2024-12-13",12.2,12,7,24,6,10]
[6,null,"Françoise Hardy",12,"2024-12-14",13.1,16,8,27,17,9.5]
[7,null,"Asterix",16,"2024-12-14",10.5,13,11.5,36,8,10.1]
[8,null,"Obelix",14,"2024-12-14",14.2,12,14.7,27,12,13.2]
[9,null,"Ideiafix",13,"2024-12-14",13.5,14,11,28,11,11.2]
[10,null,"Sylvie Vartan",13,"2024-12-15",12,15,7.3,31,20,14]
[11,null,"Carlos Lopes",14,"2024-12-15",12.5,10,8.3000000000000007,32,16,12]
[12,null,"Rosa Mota",14,"2024-12-15",13.1,12,9.3000000000000007,27.4,17,10]
[13]
[14]
[15]
[16]
[17]
[18]
[19]
[20]
[21]
[22]
[23]
[24]
[25]
[26]
[27]
[28]
[29]
[30]
[31]
[32]
[33]
[34]
[35]
[36]
[37]
[38]
[39]
[40]
[41]
[42]
[43]
[44]
[45]
[46]
[47]
[48]
[49]
[50]

{"sheet":"iniRelatório","index":1,"n_rows":23,"n_cols":8,"rows_kept":23,"cut":false,"hidden":false,"merged":[]}
["RELATÓRIO INDIVIDUAL PRESCHOOL TEST BATTERY"]
[{"$f":"IF(iniTurma!A2=1,VLOOKUP(\"x\",iniTurma!B$4:M$53,2,0),\"\")","v":"Becas"}]
[{"$f":"IF(iniTurma!A2=1,_xlfn.CONCAT(TEXT(VLOOKUP(\"x\",iniTurma!B$4:M$53,4,0),\"dd-mm-aaaa\"),\" | \",iniTurma!C1,\"º ano\",\" | \",iniTurma!C2),\"\")","v":"13-12-2024 | 2º ano | A"}]
[]
[null,"Resultado",null,"Média ",null,"Mínimo",null,"Máximo"]
[null,"da criança",null,"da turma",null,"da turma",null,"da turma"]
["HABILIDADES DE LOCOMOÇÃO"]
[{"$f":"IF(iniTurma!A2=1,IFERROR(VLOOKUP(1,iniAuxiliar!L3:Q5,2,0),\"\"),\"\")","v":"Corrida vaivém"},{"$f":"IF(iniTurma!A2=1,IFERROR(VLOOKUP(1,iniAuxiliar!L3:Q5,3,0),0),\"\")","v":11.64},null,{"$f":"IF(iniTurma!A2=1,IFERROR(VLOOKUP(1,iniAuxiliar!L3:Q5,4,0),0),\"\")","v":12.3575},null,{"$f":"IF(iniTurma!A2=1,IFERROR(VLOOKUP(1,iniAuxiliar!L3:Q5,5,0),0),\"\")","v":10},null,{"$f":"IF(iniTurma!A2=1,IFERROR(VLOOKUP(1,iniAuxiliar!L3:Q5,6,0),0),\"\")","v":14.2}]
[]
[{"$f":"IF(iniTurma!A2=1,IFERROR(VLOOKUP(2,iniAuxiliar!L3:Q5,2,0),\"\"),\"\")","v":"Corrida velocidade"},{"$f":"IF(iniTurma!A2=1,IFERROR(VLOOKUP(2,iniAuxiliar!L3:Q5,3,0),0),\"\")","v":15},null,{"$f":"IF(iniTurma!A2=1,IFERROR(VLOOKUP(2,iniAuxiliar!L3:Q5,4,0),0),\"\")","v":13.333333333333334},null,{"$f":"IF(iniTurma!A2=1,IFERROR(VLOOKUP(2,iniAuxiliar!L3:Q5,5,0),0),\"\")","v":10},null,{"$f":"IF(iniTurma!A2=1,IFERROR(VLOOKUP(2,iniAuxiliar!L3:Q5,6,0),0),\"\")","v":16}]
[]
[{"$f":"IF(iniTurma!A2=1,IFERROR(VLOOKUP(3,iniAuxiliar!L3:Q5,2,0),\"\"),\"\")","v":"Salto horizontal"},{"$f":"IF(iniTurma!A2=1,IFERROR(VLOOKUP(3,iniAuxiliar!L3:Q5,3,0),0),\"\")","v":10},null,{"$f":"IF(iniTurma!A2=1,IFERROR(VLOOKUP(3,iniAuxiliar!L3:Q5,4,0),0),\"\")","v":9.0333333333333332},null,{"$f":"IF(iniTurma!A2=1,IFERROR(VLOOKUP(3,iniAuxiliar!L3:Q5,5,0),0),\"\")","v":6},null,{"$f":"IF(iniTurma!A2=1,IFERROR(VLOOKUP(3,iniAuxiliar!L3:Q5,6,0),0),\"\")","v":14.7}]
[]
["HABILIDADES DE CONTROLO DE OBJETOS"]
[{"$f":"IF(iniTurma!A2=1,IFERROR(VLOOKUP(1,iniAuxiliar!L6:Q7,2,0),\"\"),\"\")","v":"Receber"},{"$f":"IF(iniTurma!A2=1,IFERROR(VLOOKUP(1,iniAuxiliar!L6:Q7,3,0),0),\"\")","v":31},null,{"$f":"IF(iniTurma!A2=1,IFERROR(VLOOKUP(1,iniAuxiliar!L6:Q7,4,0),0),\"\")","v":29.866666666666664},null,{"$f":"IF(iniTurma!A2=1,IFERROR(VLOOKUP(1,iniAuxiliar!L6:Q7,5,0),0),\"\")","v":24},null,{"$f":"IF(iniTurma!A2=1,IFERROR(VLOOKUP(1,iniAuxiliar!L6:Q7,6,0),0),\"\")","v":38}]
[]
[{"$f":"IF(iniTurma!A2=1,IFERROR(VLOOKUP(2,iniAuxiliar!L6:Q7,2,0),\"\"),\"\")","v":"Lançar"},{"$f":"IF(iniTurma!A2=1,IFERROR(VLOOKUP(2,iniAuxiliar!L6:Q7,3,0),0),\"\")","v":0},null,{"$f":"IF(iniTurma!A2=1,IFERROR(VLOOKUP(2,iniAuxiliar!L6:Q7,4,0),0),\"\")","v":12.363636363636363},null,{"$f":"IF(iniTurma!A2=1,IFERROR(VLOOKUP(2,iniAuxiliar!L6:Q7,5,0),0),\"\")","v":6},null,{"$f":"IF(iniTurma!A2=1,IFERROR(VLOOKUP(2,iniAuxiliar!L6:Q7,6,0),0),\"\")","v":20}]
[]
["HABILIDADE DE ESTABILIZAÇÃO"]
[{"$f":"IF(iniTurma!A2=1,IFERROR(VLOOKUP(1,iniAuxiliar!L8:Q8,2,0),\"\"),\"\")","v":"Equilíbrio"},{"$f":"IF(iniTurma!A2=1,IFERROR(VLOOKUP(1,iniAuxiliar!L8:Q8,3,0),0),\"\")","v":10.119999999999999},null,{"$f":"IF(iniTurma!A2=1,IFERROR(VLOOKUP(1,iniAuxiliar!L8:Q8,4,0),0),\"\")","v":10.951666666666668},null,{"$f":"IF(iniTurma!A2=1,IFERROR(VLOOKUP(1,iniAuxiliar!L8:Q8,5,0),0),\"\")","v":9.5},null,{"$f":"IF(iniTurma!A2=1,IFERROR(VLOOKUP(1,iniAuxiliar!L8:Q8,6,0),0),\"\")","v":14}]
[]
[]
["Perfil multivariado"]

{"sheet":"iniScore Z","index":2,"n_rows":53,"n_cols":12,"rows_kept":53,"cut":false,"hidden":false,"merged":[]}
[]
[]
[{"$f":"iniTurma!B3","v":"Ver: 1"},{"$f":"iniTurma!A3","v":"ID Aluno"},{"$f":"iniTurma!C3","v":"Nome"},{"$f":"iniTurma!D3","v":"Idade"},{"$f":"iniTurma!F3","v":"Corrida vaivém"},{"$f":"iniTurma!G3","v":"Corrida velocidade"},{"$f":"iniTurma!H3","v":"Salto horizontal"},{"$f":"iniTurma!I3","v":"Receber"},{"$f":"iniTurma!J3","v":"Lançar"},{"$f":"iniTurma!K3","v":"Equilíbrio"}]
[{"$f":"IF(iniTurma!B4<>\"\",iniTurma!B4,\"\")","v":""},{"$f":"iniTurma!A4","v":1},{"$f":"IF(iniTurma!C4<>\"\",iniTurma!C4,\"\")","v":"Micas"},{"$f":"IF(iniTurma!D4<>\"\",iniTurma!D4,\"\")","v":13},{"$f":"IF(AND(iniTurma!F$2<>\"\",iniTurma!F4<>\"\"),(iniTurma!F4-iniTurma!F$1)/iniTurma!F$2,\"\")","v":0.65859268236427271},{"$f":"IF(AND(iniTurma!G$2<>\"\",iniTurma!G4<>\"\"),(iniTurma!G4-iniTurma!G$1)/iniTurma!G$2,\"\")","v":-0.20851441405707513},{"$f":"IF(AND(iniTurma!H$2<>\"\",iniTurma!H4<>\"\"),(iniTurma!H4-iniTurma!H$1)/iniTurma!H$2,\"\")","v":-1.2964988884319415},{"$f":"IF(AND(iniTurma!I$2<>\"\",iniTurma!I4<>\"\"),(iniTurma!I4-iniTurma!I$1)/iniTurma!I$2,\"\")","v":0.52315105268066386},{"$f":"IF(AND(iniTurma!J$2<>\"\",iniTurma!J4<>\"\"),(iniTurma!J4-iniTurma!J$1)/iniTurma!J$2,\"\")","v":-1.0070176299560269},{"$f":"IF(AND(iniTurma!K$2<>\"\",iniTurma!K4<>\"\"),(iniTurma!K4-iniTurma!K$1)/iniTurma!K$2,\"\")","v":0.1810500362437425},{"$f":"IF(AND(iniTurma!L$2<>\"\",iniTurma!L4<>\"\"),(iniTurma!L4-iniTurma!L$1)/iniTurma!L$2,\"\")","v":""},{"$f":"IF(AND(iniTurma!M$2<>\"\",iniTurma!M4<>\"\"),(iniTurma!M4-iniTurma!M$1)/iniTurma!M$2,\"\")","v":""}]
[{"$f":"IF(iniTurma!B5<>\"\",iniTurma!B5,\"\")","v":""},{"$f":"iniTurma!A5","v":2},{"$f":"IF(iniTurma!C5<>\"\",iniTurma!C5,\"\")","v":"Tecas"},{"$f":"IF(iniTurma!D5<>\"\",iniTurma!D5,\"\")","v":12},{"$f":"IF(AND(iniTurma!F$2<>\"\",iniTurma!F5<>\"\"),(iniTurma!F5-iniTurma!F$1)/iniTurma!F$2,\"\")","v":6.2620287831356952E-2},{"$f":"IF(AND(iniTurma!G$2<>\"\",iniTurma!G5<>\"\"),(iniTurma!G5-iniTurma!G$1)/iniTurma!G$2,\"\")","v":0.41702882811414915},{"$f":"IF(AND(iniTurma!H$2<>\"\",iniTurma!H5<>\"\"),(iniTurma!H5-iniTurma!H$1)/iniTurma!H$2,\"\")","v":-0.86908167246536738},{"$f":"IF(AND(iniTurma!I$2<>\"\",iniTurma!I5<>\"\"),(iniTurma!I5-iniTurma!I$1)/iniTurma!I$2,\"\")","v":1.9945133883450288},{"$f":"IF(AND(iniTurma!J$2<>\"\",iniTurma!J5<>\"\"),(iniTurma!J5-iniTurma!J$1)/iniTurma!J$2,\"\")","v":-0.77624275642443741},{"$f":"IF(AND(iniTurma!K$2<>\"\",iniTurma!K5<>\"\"),(iniTurma!K5-iniTurma!K$1)/iniTurma!K$2,\"\")","v":-0.54801051238878362},{"$f":"IF(AND(iniTurma!L$2<>\"\",iniTurma!L5<>\"\"),(iniTurma!L5-iniTurma!L$1)/iniTurma!L$2,\"\")","v":""},{"$f":"IF(AND(iniTurma!M$2<>\"\",iniTurma!M5<>\"\"),(iniTurma!M5-iniTurma!M$1)/iniTurma!M$2,\"\")","v":""}]
[{"$f":"IF(iniTurma!B6<>\"\",iniTurma!B6,\"\")","v":""},{"$f":"iniTurma!A6","v":3},{"$f":"IF(iniTurma!C6<>\"\",iniTurma!C6,\"\")","v":"Lecas"},{"$f":"IF(iniTurma!D6<>\"\",iniTurma!D6,\"\")","v":15},{"$f":"IF(AND(iniTurma!F$2<>\"\",iniTurma!F6<>\"\"),(iniTurma!F6-iniTurma!F$1)/iniTurma!F$2,\"\")","v":-2.03623901465413},{"$f":"IF(AND(iniTurma!G$2<>\"\",iniTurma!G6<>\"\"),(iniTurma!G6-iniTurma!G$1)/iniTurma!G$2,\"\")","v":0.41702882811414915},{"$f":"IF(AND(iniTurma!H$2<>\"\",iniTurma!H6<>\"\"),(iniTurma!H6-iniTurma!H$1)/iniTurma!H$2,\"\")","v":-0.31343929170882068},{"$f":"IF(AND(iniTurma!I$2<>\"\",iniTurma!I6<>\"\"),(iniTurma!I6-iniTurma!I$1)/iniTurma!I$2,\"\")","v":-1.1934383389277619},{"$f":"IF(AND(iniTurma!J$2<>\"\",iniTurma!J6<>\"\"),(iniTurma!J6-iniTurma!J$1)/iniTurma!J$2,\"\")","v":-8.3918135829668838E-2},{"$f":"IF(AND(iniTurma!K$2<>\"\",iniTurma!K6<>\"\"),(iniTurma!K6-iniTurma!K$1)/iniTurma!K$2,\"\")","v":-0.76672867697854064},{"$f":"IF(AND(iniTurma!L$2<>\"\",iniTurma!L6<>\"\"),(iniTurma!L6-iniTurma!L$1)/iniTurma!L$2,\"\")","v":""},{"$f":"IF(AND(iniTurma!M$2<>\"\",iniTurma!M6<>\"\"),(iniTurma!M6-iniTurma!M$1)/iniTurma!M$2,\"\")","v":""}]
[{"$f":"IF(iniTurma!B7<>\"\",iniTurma!B7,\"\")","v":"x"},{"$f":"iniTurma!A7","v":4},{"$f":"IF(iniTurma!C7<>\"\",iniTurma!C7,\"\")","v":"Becas"},{"$f":"IF(iniTurma!D7<>\"\",iniTurma!D7,\"\")","v":8},{"$f":"IF(AND(iniTurma!F$2<>\"\",iniTurma!F7<>\"\"),(iniTurma!F7-iniTurma!F$1)/iniTurma!F$2,\"\")","v":-0.61972491750343039},{"$f":"IF(AND(iniTurma!G$2<>\"\",iniTurma!G7<>\"\"),(iniTurma!G7-iniTurma!G$1)/iniTurma!G$2,\"\")","v":1.0425720702853734},{"$f":"IF(AND(iniTurma!H$2<>\"\",iniTurma!H7<>\"\"),(iniTurma!H7-iniTurma!H$1)/iniTurma!H$2,\"\")","v":0.41316997543435507},{"$f":"IF(AND(iniTurma!I$2<>\"\",iniTurma!I7<>\"\"),(iniTurma!I7-iniTurma!I$1)/iniTurma!I$2,\"\")","v":0.27792399673660301},{"$f":"IF(AND(iniTurma!J$2<>\"\",iniTurma!J7<>\"\"),(iniTurma!J7-iniTurma!J$1)/iniTurma!J$2,\"\")","v":""},{"$f":"IF(AND(iniTurma!K$2<>\"\",iniTurma!K7<>\"\"),(iniTurma!K7-iniTurma!K$1)/iniTurma!K$2,\"\")","v":-0.60633535627938573},{"$f":"IF(AND(iniTurma!L$2<>\"\",iniTurma!L7<>\"\"),(iniTurma!L7-iniTurma!L$1)/iniTurma!L$2,\"\")","v":""},{"$f":"IF(AND(iniTurma!M$2<>\"\",iniTurma!M7<>\"\"),(iniTurma!M7-iniTurma!M$1)/iniTurma!M$2,\"\")","v":""}]
[{"$f":"IF(iniTurma!B8<>\"\",iniTurma!B8,\"\")","v":""},{"$f":"iniTurma!A8","v":5},{"$f":"IF(iniTurma!C8<>\"\",iniTurma!C8,\"\")","v":"Nocas"},{"$f":"IF(iniTurma!D8<>\"\",iniTurma!D8,\"\")","v":11},{"$f":"IF(AND(iniTurma!F$2<>\"\",iniTurma!F8<>\"\"),(iniTurma!F8-iniTurma!F$1)/iniTurma!F$2,\"\")","v":-0.13603717701294879},{"$f":"IF(AND(iniTurma!G$2<>\"\",iniTurma!G8<>\"\"),(iniTurma!G8-iniTurma!G$1)/iniTurma!G$2,\"\")","v":-0.83405765622829942},{"$f":"IF(AND(iniTurma!H$2<>\"\",iniTurma!H8<>\"\"),(iniTurma!H8-iniTurma!H$1)/iniTurma!H$2,\"\")","v":-0.86908167246536738},{"$f":"IF(AND(iniTurma!I$2<>\"\",iniTurma!I8<>\"\"),(iniTurma!I8-iniTurma!I$1)/iniTurma!I$2,\"\")","v":-1.4386653948718227},{"$f":"IF(AND(iniTurma!J$2<>\"\",iniTurma!J8<>\"\"),(iniTurma!J8-iniTurma!J$1)/iniTurma!J$2,\"\")","v":-1.4685673770192058},{"$f":"IF(AND(iniTurma!K$2<>\"\",iniTurma!K8<>\"\"),(iniTurma!K8-iniTurma!K$1)/iniTurma!K$2,\"\")","v":-0.69382262211528822},{"$f":"IF(AND(iniTurma!L$2<>\"\",iniTurma!L8<>\"\"),(iniTurma!L8-iniTurma!L$1)/iniTurma!L$2,\"\")","v":""},{"$f":"IF(AND(iniTurma!M$2<>\"\",iniTurma!M8<>\"\"),(iniTurma!M8-iniTurma!M$1)/iniTurma!M$2,\"\")","v":""}]
[{"$f":"IF(iniTurma!B9<>\"\",iniTurma!B9,\"\")","v":""},{"$f":"iniTurma!A9","v":6},{"$f":"IF(iniTurma!C9<>\"\",iniTurma!C9,\"\")","v":"Françoise Hardy"},{"$f":"IF(iniTurma!D9<>\"\",iniTurma!D9,\"\")","v":12},{"$f":"IF(AND(iniTurma!F$2<>\"\",iniTurma!F9<>\"\"),(iniTurma!F9-iniTurma!F$1)/iniTurma!F$2,\"\")","v":0.64131812020389867},{"$f":"IF(AND(iniTurma!G$2<>\"\",iniTurma!G9<>\"\"),(iniTurma!G9-iniTurma!G$1)/iniTurma!G$2,\"\")","v":1.6681153124565977},{"$f":"IF(AND(iniTurma!H$2<>\"\",iniTurma!H9<>\"\"),(iniTurma!H9-iniTurma!H$1)/iniTurma!H$2,\"\")","v":-0.44166445649879321},{"$f":"IF(AND(iniTurma!I$2<>\"\",iniTurma!I9<>\"\"),(iniTurma!I9-iniTurma!I$1)/iniTurma!I$2,\"\")","v":-0.70298422703964025},{"$f":"IF(AND(iniTurma!J$2<>\"\",iniTurma!J9<>\"\"),(iniTurma!J9-iniTurma!J$1)/iniTurma!J$2,\"\")","v":1.0699562318282787},{"$f":"IF(AND(iniTurma!K$2<>\"\",iniTurma!K9<>\"\"),(iniTurma!K9-iniTurma!K$1)/iniTurma!K$2,\"\")","v":-1.0583528964315514},{"$f":"IF(AND(iniTurma!L$2<>\"\",iniTurma!L9<>\"\"),(iniTurma!L9-iniTurma!L$1)/iniTurma!L$2,\"\")","v":""},{"$f":"IF(AND(iniTurma!M$2<>\"\",iniTurma!M9<>\"\"),(iniTurma!M9-iniTurma!M$1)/iniTurma!M$2,\"\")","v":""}]
[{"$f":"IF(iniTurma!B10<>\"\",iniTurma!B10,\"\")","v":""},{"$f":"iniTurma!A10","v":7},{"$f":"IF(iniTurma!C10<>\"\",iniTurma!C10,\"\")","v":"Asterix"},{"$f":"IF(iniTurma!D10<>\"\",iniTurma!D10,\"\")","v":16},{"$f":"IF(AND(iniTurma!F$2<>\"\",iniTurma!F10<>\"\"),(iniTurma!F10-iniTurma!F$1)/iniTurma!F$2,\"\")","v":-1.6043749606447706},{"$f":"IF(AND(iniTurma!G$2<>\"\",iniTurma!G10<>\"\"),(iniTurma!G10-iniTurma!G$1)/iniTurma!G$2,\"\")","v":-0.20851441405707513},{"$f":"IF(AND(iniTurma!H$2<>\"\",iniTurma!H10<>\"\"),(iniTurma!H10-iniTurma!H$1)/iniTurma!H$2,\"\")","v":1.0542957993842164},{"$f":"IF(AND(iniTurma!I$2<>\"\",iniTurma!I10<>\"\"),(iniTurma!I10-iniTurma!I$1)/iniTurma!I$2,\"\")","v":1.5040592764569072},{"$f":"IF(AND(iniTurma!J$2<>\"\",iniTurma!J10<>\"\"),(iniTurma!J10-iniTurma!J$1)/iniTurma!J$2,\"\")","v":-1.0070176299560269},{"$f":"IF(AND(iniTurma!K$2<>\"\",iniTurma!K10<>\"\"),(iniTurma!K10-iniTurma!K$1)/iniTurma!K$2,\"\")","v":-0.62091656725203592},{"$f":"IF(AND(iniTurma!L$2<>\"\",iniTurma!L10<>\"\"),(iniTurma!L10-iniTurma!L$1)/iniTurma!L$2,\"\")","v":""},{"$f":"IF(AND(iniTurma!M$2<>\"\",iniTurma!M10<>\"\"),(iniTurma!M10-iniTurma!M$1)/iniTurma!M$2,\"\")","v":""}]
[{"$f":"IF(iniTurma!B11<>\"\",iniTurma!B11,\"\")","v":""},{"$f":"iniTurma!A11","v":8},{"$f":"IF(iniTurma!C11<>\"\",iniTurma!C11,\"\")","v":"Obelix"},{"$f":"IF(iniTurma!D11<>\"\",iniTurma!D11,\"\")","v":14},{"$f":"IF(AND(iniTurma!F$2<>\"\",iniTurma!F11<>\"\"),(iniTurma!F11-iniTurma!F$1)/iniTurma!F$2,\"\")","v":1.5914190390244893},{"$f":"IF(AND(iniTurma!G$2<>\"\",iniTurma!G11<>\"\"),(iniTurma!G11-iniTurma!G$1)/iniTurma!G$2,\"\")","v":-0.83405765622829942},{"$f":"IF(AND(iniTurma!H$2<>\"\",iniTurma!H11<>\"\"),(iniTurma!H11-iniTurma!H$1)/iniTurma!H$2,\"\")","v":2.4220308904772532},{"$f":"IF(AND(iniTurma!I$2<>\"\",iniTurma!I11<>\"\"),(iniTurma!I11-iniTurma!I$1)/iniTurma!I$2,\"\")","v":-0.70298422703964025},{"$f":"IF(AND(iniTurma!J$2<>\"\",iniTurma!J11<>\"\"),(iniTurma!J11-iniTurma!J$1)/iniTurma!J$2,\"\")","v":-8.3918135829668838E-2},{"$f":"IF(AND(iniTurma!K$2<>\"\",iniTurma!K11<>\"\"),(iniTurma!K11-iniTurma!K$1)/iniTurma!K$2,\"\")","v":1.6391711335087946},{"$f":"IF(AND(iniTurma!L$2<>\"\",iniTurma!L11<>\"\"),(iniTurma!L11-iniTurma!L$1)/iniTurma!L$2,\"\")","v":""},{"$f":"IF(AND(iniTurma!M$2<>\"\",iniTurma!M11<>\"\"),(iniTurma!M11-iniTurma!M$1)/iniTurma!M$2,\"\")","v":""}]
[{"$f":"IF(iniTurma!B12<>\"\",iniTurma!B12,\"\")","v":""},{"$f":"iniTurma!A12","v":9},{"$f":"IF(iniTurma!C12<>\"\",iniTurma!C12,\"\")","v":"Ideiafix"},{"$f":"IF(iniTurma!D12<>\"\",iniTurma!D12,\"\")","v":13},{"$f":"IF(AND(iniTurma!F$2<>\"\",iniTurma!F12<>\"\"),(iniTurma!F12-iniTurma!F$1)/iniTurma!F$2,\"\")","v":0.98680936341138659},{"$f":"IF(AND(iniTurma!G$2<>\"\",iniTurma!G12<>\"\"),(iniTurma!G12-iniTurma!G$1)/iniTurma!G$2,\"\")","v":0.41702882811414915},{"$f":"IF(AND(iniTurma!H$2<>\"\",iniTurma!H12<>\"\"),(iniTurma!H12-iniTurma!H$1)/iniTurma!H$2,\"\")","v":0.84058719140092919},{"$f":"IF(AND(iniTurma!I$2<>\"\",iniTurma!I12<>\"\"),(iniTurma!I12-iniTurma!I$1)/iniTurma!I$2,\"\")","v":-0.45775717109557945},{"$f":"IF(AND(iniTurma!J$2<>\"\",iniTurma!J12<>\"\"),(iniTurma!J12-iniTurma!J$1)/iniTurma!J$2,\"\")","v":-0.31469300936125832},{"$f":"IF(AND(iniTurma!K$2<>\"\",iniTurma!K12<>\"\"),(iniTurma!K12-iniTurma!K$1)/iniTurma!K$2,\"\")","v":0.1810500362437425},{"$f":"IF(AND(iniTurma!L$2<>\"\",iniTurma!L12<>\"\"),(iniTurma!L12-iniTurma!L$1)/iniTurma!L$2,\"\")","v":""},{"$f":"IF(AND(iniTurma!M$2<>\"\",iniTurma!M12<>\"\"),(iniTurma!M12-iniTurma!M$1)/iniTurma!M$2,\"\")","v":""}]
[{"$f":"IF(iniTurma!B13<>\"\",iniTurma!B13,\"\")","v":""},{"$f":"iniTurma!A13","v":10},{"$f":"IF(iniTurma!C13<>\"\",iniTurma!C13,\"\")","v":"Sylvie Vartan"},{"$f":"IF(iniTurma!D13<>\"\",iniTurma!D13,\"\")","v":13},{"$f":"IF(AND(iniTurma!F$2<>\"\",iniTurma!F13<>\"\"),(iniTurma!F13-iniTurma!F$1)/iniTurma!F$2,\"\")","v":-0.308782798616692},{"$f":"IF(AND(iniTurma!G$2<>\"\",iniTurma!G13<>\"\"),(iniTurma!G13-iniTurma!G$1)/iniTurma!G$2,\"\")","v":1.0425720702853734},{"$f":"IF(AND(iniTurma!H$2<>\"\",iniTurma!H13<>\"\"),(iniTurma!H13-iniTurma!H$1)/iniTurma!H$2,\"\")","v":-0.74085650767539524},{"$f":"IF(AND(iniTurma!I$2<>\"\",iniTurma!I13<>\"\"),(iniTurma!I13-iniTurma!I$1)/iniTurma!I$2,\"\")","v":0.27792399673660301},{"$f":"IF(AND(iniTurma!J$2<>\"\",iniTurma!J13<>\"\"),(iniTurma!J13-iniTurma!J$1)/iniTurma!J$2,\"\")","v":1.7622808524230473},{"$f":"IF(AND(iniTurma!K$2<>\"\",iniTurma!K13<>\"\"),(iniTurma!K13-iniTurma!K$1)/iniTurma!K$2,\"\")","v":2.2224195724148159},{"$f":"IF(AND(iniTurma!L$2<>\"\",iniTurma!L13<>\"\"),(iniTurma!L13-iniTurma!L$1)/iniTurma!L$2,\"\")","v":""},{"$f":"IF(AND(iniTurma!M$2<>\"\",iniTurma!M13<>\"\"),(iniTurma!M13-iniTurma!M$1)/iniTurma!M$2,\"\")","v":""}]
[{"$f":"IF(iniTurma!B14<>\"\",iniTurma!B14,\"\")","v":""},{"$f":"iniTurma!A14","v":11},{"$f":"IF(iniTurma!C14<>\"\",iniTurma!C14,\"\")","v":"Carlos Lopes"},{"$f":"IF(iniTurma!D14<>\"\",iniTurma!D14,\"\")","v":14},{"$f":"IF(AND(iniTurma!F$2<>\"\",iniTurma!F14<>\"\"),(iniTurma!F14-iniTurma!F$1)/iniTurma!F$2,\"\")","v":0.12308125539266752},{"$f":"IF(AND(iniTurma!G$2<>\"\",iniTurma!G14<>\"\"),(iniTurma!G14-iniTurma!G$1)/iniTurma!G$2,\"\")","v":-2.085144140570748},{"$f":"IF(AND(iniTurma!H$2<>\"\",iniTurma!H14<>\"\"),(iniTurma!H14-iniTurma!H$1)/iniTurma!H$2,\"\")","v":-0.31343929170882068},{"$f":"IF(AND(iniTurma!I$2<>\"\",iniTurma!I14<>\"\"),(iniTurma!I14-iniTurma!I$1)/iniTurma!I$2,\"\")","v":0.52315105268066386},{"$f":"IF(AND(iniTurma!J$2<>\"\",iniTurma!J14<>\"\"),(iniTurma!J14-iniTurma!J$1)/iniTurma!J$2,\"\")","v":0.83918135829668916},{"$f":"IF(AND(iniTurma!K$2<>\"\",iniTurma!K14<>\"\"),(iniTurma!K14-iniTurma!K$1)/iniTurma!K$2,\"\")","v":0.76429847514976379},{"$f":"IF(AND(iniTurma!L$2<>\"\",iniTurma!L14<>\"\"),(iniTurma!L14-iniTurma!L$1)/iniTurma!L$2,\"\")","v":""},{"$f":"IF(AND(iniTurma!M$2<>\"\",iniTurma!M14<>\"\"),(iniTurma!M14-iniTurma!M$1)/iniTurma!M$2,\"\")","v":""}]
[{"$f":"IF(iniTurma!B15<>\"\",iniTurma!B15,\"\")","v":""},{"$f":"iniTurma!A15","v":12},{"$f":"IF(iniTurma!C15<>\"\",iniTurma!C15,\"\")","v":"Rosa Mota"},{"$f":"IF(iniTurma!D15<>\"\",iniTurma!D15,\"\")","v":14},{"$f":"IF(AND(iniTurma!F$2<>\"\",iniTurma!F15<>\"\"),(iniTurma!F15-iniTurma!F$1)/iniTurma!F$2,\"\")","v":0.64131812020389867},{"$f":"IF(AND(iniTurma!G$2<>\"\",iniTurma!G15<>\"\"),(iniTurma!G15-iniTurma!G$1)/iniTurma!G$2,\"\")","v":-0.83405765622829942},{"$f":"IF(AND(iniTurma!H$2<>\"\",iniTurma!H15<>\"\"),(iniTurma!H15-iniTurma!H$1)/iniTurma!H$2,\"\")","v":0.11397792425775345},{"$f":"IF(AND(iniTurma!I$2<>\"\",iniTurma!I15<>\"\"),(iniTurma!I15-iniTurma!I$1)/iniTurma!I$2,\"\")","v":-0.60489340466201624},{"$f":"IF(AND(iniTurma!J$2<>\"\",iniTurma!J15<>\"\"),(iniTurma!J15-iniTurma!J$1)/iniTurma!J$2,\"\")","v":1.0699562318282787},{"$f":"IF(AND(iniTurma!K$2<>\"\",iniTurma!K15<>\"\"),(iniTurma!K15-iniTurma!K$1)/iniTurma!K$2,\"\")","v":-0.69382262211528822},{"$f":"IF(AND(iniTurma!L$2<>\"\",iniTurma!L15<>\"\"),(iniTurma!L15-iniTurma!L$1)/iniTurma!L$2,\"\")","v":""},{"$f":"IF(AND(iniTurma!M$2<>\"\",iniTurma!M15<>\"\"),(iniTurma!M15-iniTurma!M$1)/iniTurma!M$2,\"\")","v":""}]
[{"$f":"IF(iniTurma!B16<>\"\",iniTurma!B16,\"\")","v":""},{"$f":"iniTurma!A16","v":13},{"$f":"IF(iniTurma!C16<>\"\",iniTurma!C16,\"\")","v":""},{"$f":"IF(iniTurma!D16<>\"\",iniTurma!D16,\"\")","v":""},{"$f":"IF(AND(iniTurma!F$2<>\"\",iniTurma!F16<>\"\"),(iniTurma!F16-iniTurma!F$1)/iniTurma!F$2,\"\")","v":""},{"$f":"IF(AND(iniTurma!G$2<>\"\",iniTurma!G16<>\"\"),(iniTurma!G16-iniTurma!G$1)/iniTurma!G$2,\"\")","v":""},{"$f":"IF(AND(iniTurma!H$2<>\"\",iniTurma!H16<>\"\"),(iniTurma!H16-iniTurma!H$1)/iniTurma!H$2,\"\")","v":""},{"$f":"IF(AND(iniTurma!I$2<>\"\",iniTurma!I16<>\"\"),(iniTurma!I16-iniTurma!I$1)/iniTurma!I$2,\"\")","v":""},{"$f":"IF(AND(iniTurma!J$2<>\"\",iniTurma!J16<>\"\"),(iniTurma!J16-iniTurma!J$1)/iniTurma!J$2,\"\")","v":""},{"$f":"IF(AND(iniTurma!K$2<>\"\",iniTurma!K16<>\"\"),(iniTurma!K16-iniTurma!K$1)/iniTurma!K$2,\"\")","v":""},{"$f":"IF(AND(iniTurma!L$2<>\"\",iniTurma!L16<>\"\"),(iniTurma!L16-iniTurma!L$1)/iniTurma!L$2,\"\")","v":""},{"$f":"IF(AND(iniTurma!M$2<>\"\",iniTurma!M16<>\"\"),(iniTurma!M16-iniTurma!M$1)/iniTurma!M$2,\"\")","v":""}]
[{"$f":"IF(iniTurma!B17<>\"\",iniTurma!B17,\"\")","v":""},{"$f":"iniTurma!A17","v":14},{"$f":"IF(iniTurma!C17<>\"\",iniTurma!C17,\"\")","v":""},{"$f":"IF(iniTurma!D17<>\"\",iniTurma!D17,\"\")","v":""},{"$f":"IF(AND(iniTurma!F$2<>\"\",iniTurma!F17<>\"\"),(iniTurma!F17-iniTurma!F$1)/iniTurma!F$2,\"\")","v":""},{"$f":"IF(AND(iniTurma!G$2<>\"\",iniTurma!G17<>\"\"),(iniTurma!G17-iniTurma!G$1)/iniTurma!G$2,\"\")","v":""},{"$f":"IF(AND(iniTurma!H$2<>\"\",iniTurma!H17<>\"\"),(iniTurma!H17-iniTurma!H$1)/iniTurma!H$2,\"\")","v":""},{"$f":"IF(AND(iniTurma!I$2<>\"\",iniTurma!I17<>\"\"),(iniTurma!I17-iniTurma!I$1)/iniTurma!I$2,\"\")","v":""},{"$f":"IF(AND(iniTurma!J$2<>\"\",iniTurma!J17<>\"\"),(iniTurma!J17-iniTurma!J$1)/iniTurma!J$2,\"\")","v":""},{"$f":"IF(AND(iniTurma!K$2<>\"\",iniTurma!K17<>\"\"),(iniTurma!K17-iniTurma!K$1)/iniTurma!K$2,\"\")","v":""},{"$f":"IF(AND(iniTurma!L$2<>\"\",iniTurma!L17<>\"\"),(iniTurma!L17-iniTurma!L$1)/iniTurma!L$2,\"\")","v":""},{"$f":"IF(AND(iniTurma!M$2<>\"\",iniTurma!M17<>\"\"),(iniTurma!M17-iniTurma!M$1)/iniTurma!M$2,\"\")","v":""}]
[{"$f":"IF(iniTurma!B18<>\"\",iniTurma!B18,\"\")","v":""},{"$f":"iniTurma!A18","v":15},{"$f":"IF(iniTurma!C18<>\"\",iniTurma!C18,\"\")","v":""},{"$f":"IF(iniTurma!D18<>\"\",iniTurma!D18,\"\")","v":""},{"$f":"IF(AND(iniTurma!F$2<>\"\",iniTurma!F18<>\"\"),(iniTurma!F18-iniTurma!F$1)/iniTurma!F$2,\"\")","v":""},{"$f":"IF(AND(iniTurma!G$2<>\"\",iniTurma!G18<>\"\"),(iniTurma!G18-iniTurma!G$1)/iniTurma!G$2,\"\")","v":""},{"$f":"IF(AND(iniTurma!H$2<>\"\",iniTurma!H18<>\"\"),(iniTurma!H18-iniTurma!H$1)/iniTurma!H$2,\"\")","v":""},{"$f":"IF(AND(iniTurma!I$2<>\"\",iniTurma!I18<>\"\"),(iniTurma!I18-iniTurma!I$1)/iniTurma!I$2,\"\")","v":""},{"$f":"IF(AND(iniTurma!J$2<>\"\",iniTurma!J18<>\"\"),(iniTurma!J18-iniTurma!J$1)/iniTurma!J$2,\"\")","v":""},{"$f":"IF(AND(iniTurma!K$2<>\"\",iniTurma!K18<>\"\"),(iniTurma!K18-iniTurma!K$1)/iniTurma!K$2,\"\")","v":""},{"$f":"IF(AND(iniTurma!L$2<>\"\",iniTurma!L18<>\"\"),(iniTurma!L18-iniTurma!L$1)/iniTurma!L$2,\"\")","v":""},{"$f":"IF(AND(iniTurma!M$2<>\"\",iniTurma!M18<>\"\"),(iniTurma!M18-iniTurma!M$1)/iniTurma!M$2,\"\")","v":""}]
[{"$f":"IF(iniTurma!B19<>\"\",iniTurma!B19,\"\")","v":""},{"$f":"iniTurma!A19","v":16},{"$f":"IF(iniTurma!C19<>\"\",iniTurma!C19,\"\")","v":""},{"$f":"IF(iniTurma!D19<>\"\",iniTurma!D19,\"\")","v":""},{"$f":"IF(AND(iniTurma!F$2<>\"\",iniTurma!F19<>\"\"),(iniTurma!F19-iniTurma!F$1)/iniTurma!F$2,\"\")","v":""},{"$f":"IF(AND(iniTurma!G$2<>\"\",iniTurma!G19<>\"\"),(iniTurma!G19-iniTurma!G$1)/iniTurma!G$2,\"\")","v":""},{"$f":"IF(AND(iniTurma!H$2<>\"\",iniTurma!H19<>\"\"),(iniTurma!H19-iniTurma!H$1)/iniTurma!H$2,\"\")","v":""},{"$f":"IF(AND(iniTurma!I$2<>\"\",iniTurma!I19<>\"\"),(iniTurma!I19-iniTurma!I$1)/iniTurma!I$2,\"\")","v":""},{"$f":"IF(AND(iniTurma!J$2<>\"\",iniTurma!J19<>\"\"),(iniTurma!J19-iniTurma!J$1)/iniTurma!J$2,\"\")","v":""},{"$f":"IF(AND(iniTurma!K$2<>\"\",iniTurma!K19<>\"\"),(iniTurma!K19-iniTurma!K$1)/iniTurma!K$2,\"\")","v":""},{"$f":"IF(AND(iniTurma!L$2<>\"\",iniTurma!L19<>\"\"),(iniTurma!L19-iniTurma!L$1)/iniTurma!L$2,\"\")","v":""},{"$f":"IF(AND(iniTurma!M$2<>\"\",iniTurma!M19<>\"\"),(iniTurma!M19-iniTurma!M$1)/iniTurma!M$2,\"\")","v":""}]
[{"$f":"IF(iniTurma!B20<>\"\",iniTurma!B20,\"\")","v":""},{"$f":"iniTurma!A20","v":17},{"$f":"IF(iniTurma!C20<>\"\",iniTurma!C20,\"\")","v":""},{"$f":"IF(iniTurma!D20<>\"\",iniTurma!D20,\"\")","v":""},{"$f":"IF(AND(iniTurma!F$2<>\"\",iniTurma!F20<>\"\"),(iniTurma!F20-iniTurma!F$1)/iniTurma!F$2,\"\")","v":""},{"$f":"IF(AND(iniTurma!G$2<>\"\",iniTurma!G20<>\"\"),(iniTurma!G20-iniTurma!G$1)/iniTurma!G$2,\"\")","v":""},{"$f":"IF(AND(iniTurma!H$2<>\"\",iniTurma!H20<>\"\"),(iniTurma!H20-iniTurma!H$1)/iniTurma!H$2,\"\")","v":""},{"$f":"IF(AND(iniTurma!I$2<>\"\",iniTurma!I20<>\"\"),(iniTurma!I20-iniTurma!I$1)/iniTurma!I$2,\"\")","v":""},{"$f":"IF(AND(iniTurma!J$2<>\"\",iniTurma!J20<>\"\"),(iniTurma!J20-iniTurma!J$1)/iniTurma!J$2,\"\")","v":""},{"$f":"IF(AND(iniTurma!K$2<>\"\",iniTurma!K20<>\"\"),(iniTurma!K20-iniTurma!K$1)/iniTurma!K$2,\"\")","v":""},{"$f":"IF(AND(iniTurma!L$2<>\"\",iniTurma!L20<>\"\"),(iniTurma!L20-iniTurma!L$1)/iniTurma!L$2,\"\")","v":""},{"$f":"IF(AND(iniTurma!M$2<>\"\",iniTurma!M20<>\"\"),(iniTurma!M20-iniTurma!M$1)/iniTurma!M$2,\"\")","v":""}]
[{"$f":"IF(iniTurma!B21<>\"\",iniTurma!B21,\"\")","v":""},{"$f":"iniTurma!A21","v":18},{"$f":"IF(iniTurma!C21<>\"\",iniTurma!C21,\"\")","v":""},{"$f":"IF(iniTurma!D21<>\"\",iniTurma!D21,\"\")","v":""},{"$f":"IF(AND(iniTurma!F$2<>\"\",iniTurma!F21<>\"\"),(iniTurma!F21-iniTurma!F$1)/iniTurma!F$2,\"\")","v":""},{"$f":"IF(AND(iniTurma!G$2<>\"\",iniTurma!G21<>\"\"),(iniTurma!G21-iniTurma!G$1)/iniTurma!G$2,\"\")","v":""},{"$f":"IF(AND(iniTurma!H$2<>\"\",iniTurma!H21<>\"\"),(iniTurma!H21-iniTurma!H$1)/iniTurma!H$2,\"\")","v":""},{"$f":"IF(AND(iniTurma!I$2<>\"\",iniTurma!I21<>\"\"),(iniTurma!I21-iniTurma!I$1)/iniTurma!I$2,\"\")","v":""},{"$f":"IF(AND(iniTurma!J$2<>\"\",iniTurma!J21<>\"\"),(iniTurma!J21-iniTurma!J$1)/iniTurma!J$2,\"\")","v":""},{"$f":"IF(AND(iniTurma!K$2<>\"\",iniTurma!K21<>\"\"),(iniTurma!K21-iniTurma!K$1)/iniTurma!K$2,\"\")","v":""},{"$f":"IF(AND(iniTurma!L$2<>\"\",iniTurma!L21<>\"\"),(iniTurma!L21-iniTurma!L$1)/iniTurma!L$2,\"\")","v":""},{"$f":"IF(AND(iniTurma!M$2<>\"\",iniTurma!M21<>\"\"),(iniTurma!M21-iniTurma!M$1)/iniTurma!M$2,\"\")","v":""}]
[{"$f":"IF(iniTurma!B22<>\"\",iniTurma!B22,\"\")","v":""},{"$f":"iniTurma!A22","v":19},{"$f":"IF(iniTurma!C22<>\"\",iniTurma!C22,\"\")","v":""},{"$f":"IF(iniTurma!D22<>\"\",iniTurma!D22,\"\")","v":""},{"$f":"IF(AND(iniTurma!F$2<>\"\",iniTurma!F22<>\"\"),(iniTurma!F22-iniTurma!F$1)/iniTurma!F$2,\"\")","v":""},{"$f":"IF(AND(iniTurma!G$2<>\"\",iniTurma!G22<>\"\"),(iniTurma!G22-iniTurma!G$1)/iniTurma!G$2,\"\")","v":""},{"$f":"IF(AND(iniTurma!H$2<>\"\",iniTurma!H22<>\"\"),(iniTurma!H22-iniTurma!H$1)/iniTurma!H$2,\"\")","v":""},{"$f":"IF(AND(iniTurma!I$2<>\"\",iniTurma!I22<>\"\"),(iniTurma!I22-iniTurma!I$1)/iniTurma!I$2,\"\")","v":""},{"$f":"IF(AND(iniTurma!J$2<>\"\",iniTurma!J22<>\"\"),(iniTurma!J22-iniTurma!J$1)/iniTurma!J$2,\"\")","v":""},{"$f":"IF(AND(iniTurma!K$2<>\"\",iniTurma!K22<>\"\"),(iniTurma!K22-iniTurma!K$1)/iniTurma!K$2,\"\")","v":""},{"$f":"IF(AND(iniTurma!L$2<>\"\",iniTurma!L22<>\"\"),(iniTurma!L22-iniTurma!L$1)/iniTurma!L$2,\"\")","v":""},{"$f":"IF(AND(iniTurma!M$2<>\"\",iniTurma!M22<>\"\"),(iniTurma!M22-iniTurma!M$1)/iniTurma!M$2,\"\")","v":""}]
[{"$f":"IF(iniTurma!B23<>\"\",iniTurma!B23,\"\")","v":""},{"$f":"iniTurma!A23","v":20},{"$f":"IF(iniTurma!C23<>\"\",iniTurma!C23,\"\")","v":""},{"$f":"IF(iniTurma!D23<>\"\",iniTurma!D23,\"\")","v":""},{"$f":"IF(AND(iniTurma!F$2<>\"\",iniTurma!F23<>\"\"),(iniTurma!F23-iniTurma!F$1)/iniTurma!F$2,\"\")","v":""},{"$f":"IF(AND(iniTurma!G$2<>\"\",iniTurma!G23<>\"\"),(iniTurma!G23-iniTurma!G$1)/iniTurma!G$2,\"\")","v":""},{"$f":"IF(AND(iniTurma!H$2<>\"\",iniTurma!H23<>\"\"),(iniTurma!H23-iniTurma!H$1)/iniTurma!H$2,\"\")","v":""},{"$f":"IF(AND(iniTurma!I$2<>\"\",iniTurma!I23<>\"\"),(iniTurma!I23-iniTurma!I$1)/iniTurma!I$2,\"\")","v":""},{"$f":"IF(AND(iniTurma!J$2<>\"\",iniTurma!J23<>\"\"),(iniTurma!J23-iniTurma!J$1)/iniTurma!J$2,\"\")","v":""},{"$f":"IF(AND(iniTurma!K$2<>\"\",iniTurma!K23<>\"\"),(iniTurma!K23-iniTurma!K$1)/iniTurma!K$2,\"\")","v":""},{"$f":"IF(AND(iniTurma!L$2<>\"\",iniTurma!L23<>\"\"),(iniTurma!L23-iniTurma!L$1)/iniTurma!L$2,\"\")","v":""},{"$f":"IF(AND(iniTurma!M$2<>\"\",iniTurma!M23<>\"\"),(iniTurma!M23-iniTurma!M$1)/iniTurma!M$2,\"\")","v":""}]
[{"$f":"IF(iniTurma!B24<>\"\",iniTurma!B24,\"\")","v":""},{"$f":"iniTurma!A24","v":21},{"$f":"IF(iniTurma!C24<>\"\",iniTurma!C24,\"\")","v":""},{"$f":"IF(iniTurma!D24<>\"\",iniTurma!D24,\"\")","v":""},{"$f":"IF(AND(iniTurma!F$2<>\"\",iniTurma!F24<>\"\"),(iniTurma!F24-iniTurma!F$1)/iniTurma!F$2,\"\")","v":""},{"$f":"IF(AND(iniTurma!G$2<>\"\",iniTurma!G24<>\"\"),(iniTurma!G24-iniTurma!G$1)/iniTurma!G$2,\"\")","v":""},{"$f":"IF(AND(iniTurma!H$2<>\"\",iniTurma!H24<>\"\"),(iniTurma!H24-iniTurma!H$1)/iniTurma!H$2,\"\")","v":""},{"$f":"IF(AND(iniTurma!I$2<>\"\",iniTurma!I24<>\"\"),(iniTurma!I24-iniTurma!I$1)/iniTurma!I$2,\"\")","v":""},{"$f":"IF(AND(iniTurma!J$2<>\"\",iniTurma!J24<>\"\"),(iniTurma!J24-iniTurma!J$1)/iniTurma!J$2,\"\")","v":""},{"$f":"IF(AND(iniTurma!K$2<>\"\",iniTurma!K24<>\"\"),(iniTurma!K24-iniTurma!K$1)/iniTurma!K$2,\"\")","v":""},{"$f":"IF(AND(iniTurma!L$2<>\"\",iniTurma!L24<>\"\"),(iniTurma!L24-iniTurma!L$1)/iniTurma!L$2,\"\")","v":""},{"$f":"IF(AND(iniTurma!M$2<>\"\",iniTurma!M24<>\"\"),(iniTurma!M24-iniTurma!M$1)/iniTurma!M$2,\"\")","v":""}]
[{"$f":"IF(iniTurma!B25<>\"\",iniTurma!B25,\"\")","v":""},{"$f":"iniTurma!A25","v":22},{"$f":"IF(iniTurma!C25<>\"\",iniTurma!C25,\"\")","v":""},{"$f":"IF(iniTurma!D25<>\"\",iniTurma!D25,\"\")","v":""},{"$f":"IF(AND(iniTurma!F$2<>\"\",iniTurma!F25<>\"\"),(iniTurma!F25-iniTurma!F$1)/iniTurma!F$2,\"\")","v":""},{"$f":"IF(AND(iniTurma!G$2<>\"\",iniTurma!G25<>\"\"),(iniTurma!G25-iniTurma!G$1)/iniTurma!G$2,\"\")","v":""},{"$f":"IF(AND(iniTurma!H$2<>\"\",iniTurma!H25<>\"\"),(iniTurma!H25-iniTurma!H$1)/iniTurma!H$2,\"\")","v":""},{"$f":"IF(AND(iniTurma!I$2<>\"\",iniTurma!I25<>\"\"),(iniTurma!I25-iniTurma!I$1)/iniTurma!I$2,\"\")","v":""},{"$f":"IF(AND(iniTurma!J$2<>\"\",iniTurma!J25<>\"\"),(iniTurma!J25-iniTurma!J$1)/iniTurma!J$2,\"\")","v":""},{"$f":"IF(AND(iniTurma!K$2<>\"\",iniTurma!K25<>\"\"),(iniTurma!K25-iniTurma!K$1)/iniTurma!K$2,\"\")","v":""},{"$f":"IF(AND(iniTurma!L$2<>\"\",iniTurma!L25<>\"\"),(iniTurma!L25-iniTurma!L$1)/iniTurma!L$2,\"\")","v":""},{"$f":"IF(AND(iniTurma!M$2<>\"\",iniTurma!M25<>\"\"),(iniTurma!M25-iniTurma!M$1)/iniTurma!M$2,\"\")","v":""}]
[{"$f":"IF(iniTurma!B26<>\"\",iniTurma!B26,\"\")","v":""},{"$f":"iniTurma!A26","v":23},{"$f":"IF(iniTurma!C26<>\"\",iniTurma!C26,\"\")","v":""},{"$f":"IF(iniTurma!D26<>\"\",iniTurma!D26,\"\")","v":""},{"$f":"IF(AND(iniTurma!F$2<>\"\",iniTurma!F26<>\"\"),(iniTurma!F26-iniTurma!F$1)/iniTurma!F$2,\"\")","v":""},{"$f":"IF(AND(iniTurma!G$2<>\"\",iniTurma!G26<>\"\"),(iniTurma!G26-iniTurma!G$1)/iniTurma!G$2,\"\")","v":""},{"$f":"IF(AND(iniTurma!H$2<>\"\",iniTurma!H26<>\"\"),(iniTurma!H26-iniTurma!H$1)/iniTurma!H$2,\"\")","v":""},{"$f":"IF(AND(iniTurma!I$2<>\"\",iniTurma!I26<>\"\"),(iniTurma!I26-iniTurma!I$1)/iniTurma!I$2,\"\")","v":""},{"$f":"IF(AND(iniTurma!J$2<>\"\",iniTurma!J26<>\"\"),(iniTurma!J26-iniTurma!J$1)/iniTurma!J$2,\"\")","v":""},{"$f":"IF(AND(iniTurma!K$2<>\"\",iniTurma!K26<>\"\"),(iniTurma!K26-iniTurma!K$1)/iniTurma!K$2,\"\")","v":""},{"$f":"IF(AND(iniTurma!L$2<>\"\",iniTurma!L26<>\"\"),(iniTurma!L26-iniTurma!L$1)/iniTurma!L$2,\"\")","v":""},{"$f":"IF(AND(iniTurma!M$2<>\"\",iniTurma!M26<>\"\"),(iniTurma!M26-iniTurma!M$1)/iniTurma!M$2,\"\")","v":""}]
[{"$f":"IF(iniTurma!B27<>\"\",iniTurma!B27,\"\")","v":""},{"$f":"iniTurma!A27","v":24},{"$f":"IF(iniTurma!C27<>\"\",iniTurma!C27,\"\")","v":""},{"$f":"IF(iniTurma!D27<>\"\",iniTurma!D27,\"\")","v":""},{"$f":"IF(AND(iniTurma!F$2<>\"\",iniTurma!F27<>\"\"),(iniTurma!F27-iniTurma!F$1)/iniTurma!F$2,\"\")","v":""},{"$f":"IF(AND(iniTurma!G$2<>\"\",iniTurma!G27<>\"\"),(iniTurma!G27-iniTurma!G$1)/iniTurma!G$2,\"\")","v":""},{"$f":"IF(AND(iniTurma!H$2<>\"\",iniTurma!H27<>\"\"),(iniTurma!H27-iniTurma!H$1)/iniTurma!H$2,\"\")","v":""},{"$f":"IF(AND(iniTurma!I$2<>\"\",iniTurma!I27<>\"\"),(iniTurma!I27-iniTurma!I$1)/iniTurma!I$2,\"\")","v":""},{"$f":"IF(AND(iniTurma!J$2<>\"\",iniTurma!J27<>\"\"),(iniTurma!J27-iniTurma!J$1)/iniTurma!J$2,\"\")","v":""},{"$f":"IF(AND(iniTurma!K$2<>\"\",iniTurma!K27<>\"\"),(iniTurma!K27-iniTurma!K$1)/iniTurma!K$2,\"\")","v":""},{"$f":"IF(AND(iniTurma!L$2<>\"\",iniTurma!L27<>\"\"),(iniTurma!L27-iniTurma!L$1)/iniTurma!L$2,\"\")","v":""},{"$f":"IF(AND(iniTurma!M$2<>\"\",iniTurma!M27<>\"\"),(iniTurma!M27-iniTurma!M$1)/iniTurma!M$2,\"\")","v":""}]
[{"$f":"IF(iniTurma!B28<>\"\",iniTurma!B28,\"\")","v":""},{"$f":"iniTurma!A28","v":25},{"$f":"IF(iniTurma!C28<>\"\",iniTurma!C28,\"\")","v":""},{"$f":"IF(iniTurma!D28<>\"\",iniTurma!D28,\"\")","v":""},{"$f":"IF(AND(iniTurma!F$2<>\"\",iniTurma!F28<>\"\"),(iniTurma!F28-iniTurma!F$1)/iniTurma!F$2,\"\")","v":""},{"$f":"IF(AND(iniTurma!G$2<>\"\",iniTurma!G28<>\"\"),(iniTurma!G28-iniTurma!G$1)/iniTurma!G$2,\"\")","v":""},{"$f":"IF(AND(iniTurma!H$2<>\"\",iniTurma!H28<>\"\"),(iniTurma!H28-iniTurma!H$1)/iniTurma!H$2,\"\")","v":""},{"$f":"IF(AND(iniTurma!I$2<>\"\",iniTurma!I28<>\"\"),(iniTurma!I28-iniTurma!I$1)/iniTurma!I$2,\"\")","v":""},{"$f":"IF(AND(iniTurma!J$2<>\"\",iniTurma!J28<>\"\"),(iniTurma!J28-iniTurma!J$1)/iniTurma!J$2,\"\")","v":""},{"$f":"IF(AND(iniTurma!K$2<>\"\",iniTurma!K28<>\"\"),(iniTurma!K28-iniTurma!K$1)/iniTurma!K$2,\"\")","v":""},{"$f":"IF(AND(iniTurma!L$2<>\"\",iniTurma!L28<>\"\"),(iniTurma!L28-iniTurma!L$1)/iniTurma!L$2,\"\")","v":""},{"$f":"IF(AND(iniTurma!M$2<>\"\",iniTurma!M28<>\"\"),(iniTurma!M28-iniTurma!M$1)/iniTurma!M$2,\"\")","v":""}]
[{"$f":"IF(iniTurma!B29<>\"\",iniTurma!B29,\"\")","v":""},{"$f":"iniTurma!A29","v":26},{"$f":"IF(iniTurma!C29<>\"\",iniTurma!C29,\"\")","v":""},{"$f":"IF(iniTurma!D29<>\"\",iniTurma!D29,\"\")","v":""},{"$f":"IF(AND(iniTurma!F$2<>\"\",iniTurma!F29<>\"\"),(iniTurma!F29-iniTurma!F$1)/iniTurma!F$2,\"\")","v":""},{"$f":"IF(AND(iniTurma!G$2<>\"\",iniTurma!G29<>\"\"),(iniTurma!G29-iniTurma!G$1)/iniTurma!G$2,\"\")","v":""},{"$f":"IF(AND(iniTurma!H$2<>\"\",iniTurma!H29<>\"\"),(iniTurma!H29-iniTurma!H$1)/iniTurma!H$2,\"\")","v":""},{"$f":"IF(AND(iniTurma!I$2<>\"\",iniTurma!I29<>\"\"),(iniTurma!I29-iniTurma!I$1)/iniTurma!I$2,\"\")","v":""},{"$f":"IF(AND(iniTurma!J$2<>\"\",iniTurma!J29<>\"\"),(iniTurma!J29-iniTurma!J$1)/iniTurma!J$2,\"\")","v":""},{"$f":"IF(AND(iniTurma!K$2<>\"\",iniTurma!K29<>\"\"),(iniTurma!K29-iniTurma!K$1)/iniTurma!K$2,\"\")","v":""},{"$f":"IF(AND(iniTurma!L$2<>\"\",iniTurma!L29<>\"\"),(iniTurma!L29-iniTurma!L$1)/iniTurma!L$2,\"\")","v":""},{"$f":"IF(AND(iniTurma!M$2<>\"\",iniTurma!M29<>\"\"),(iniTurma!M29-iniTurma!M$1)/iniTurma!M$2,\"\")","v":""}]
[{"$f":"IF(iniTurma!B30<>\"\",iniTurma!B30,\"\")","v":""},{"$f":"iniTurma!A30","v":27},{"$f":"IF(iniTurma!C30<>\"\",iniTurma!C30,\"\")","v":""},{"$f":"IF(iniTurma!D30<>\"\",iniTurma!D30,\"\")","v":""},{"$f":"IF(AND(iniTurma!F$2<>\"\",iniTurma!F30<>\"\"),(iniTurma!F30-iniTurma!F$1)/iniTurma!F$2,\"\")","v":""},{"$f":"IF(AND(iniTurma!G$2<>\"\",iniTurma!G30<>\"\"),(iniTurma!G30-iniTurma!G$1)/iniTurma!G$2,\"\")","v":""},{"$f":"IF(AND(iniTurma!H$2<>\"\",iniTurma!H30<>\"\"),(iniTurma!H30-iniTurma!H$1)/iniTurma!H$2,\"\")","v":""},{"$f":"IF(AND(iniTurma!I$2<>\"\",iniTurma!I30<>\"\"),(iniTurma!I30-iniTurma!I$1)/iniTurma!I$2,\"\")","v":""},{"$f":"IF(AND(iniTurma!J$2<>\"\",iniTurma!J30<>\"\"),(iniTurma!J30-iniTurma!J$1)/iniTurma!J$2,\"\")","v":""},{"$f":"IF(AND(iniTurma!K$2<>\"\",iniTurma!K30<>\"\"),(iniTurma!K30-iniTurma!K$1)/iniTurma!K$2,\"\")","v":""},{"$f":"IF(AND(iniTurma!L$2<>\"\",iniTurma!L30<>\"\"),(iniTurma!L30-iniTurma!L$1)/iniTurma!L$2,\"\")","v":""},{"$f":"IF(AND(iniTurma!M$2<>\"\",iniTurma!M30<>\"\"),(iniTurma!M30-iniTurma!M$1)/iniTurma!M$2,\"\")","v":""}]
[{"$f":"IF(iniTurma!B31<>\"\",iniTurma!B31,\"\")","v":""},{"$f":"iniTurma!A31","v":28},{"$f":"IF(iniTurma!C31<>\"\",iniTurma!C31,\"\")","v":""},{"$f":"IF(iniTurma!D31<>\"\",iniTurma!D31,\"\")","v":""},{"$f":"IF(AND(iniTurma!F$2<>\"\",iniTurma!F31<>\"\"),(iniTurma!F31-iniTurma!F$1)/iniTurma!F$2,\"\")","v":""},{"$f":"IF(AND(iniTurma!G$2<>\"\",iniTurma!G31<>\"\"),(iniTurma!G31-iniTurma!G$1)/iniTurma!G$2,\"\")","v":""},{"$f":"IF(AND(iniTurma!H$2<>\"\",iniTurma!H31<>\"\"),(iniTurma!H31-iniTurma!H$1)/iniTurma!H$2,\"\")","v":""},{"$f":"IF(AND(iniTurma!I$2<>\"\",iniTurma!I31<>\"\"),(iniTurma!I31-iniTurma!I$1)/iniTurma!I$2,\"\")","v":""},{"$f":"IF(AND(iniTurma!J$2<>\"\",iniTurma!J31<>\"\"),(iniTurma!J31-iniTurma!J$1)/iniTurma!J$2,\"\")","v":""},{"$f":"IF(AND(iniTurma!K$2<>\"\",iniTurma!K31<>\"\"),(iniTurma!K31-iniTurma!K$1)/iniTurma!K$2,\"\")","v":""},{"$f":"IF(AND(iniTurma!L$2<>\"\",iniTurma!L31<>\"\"),(iniTurma!L31-iniTurma!L$1)/iniTurma!L$2,\"\")","v":""},{"$f":"IF(AND(iniTurma!M$2<>\"\",iniTurma!M31<>\"\"),(iniTurma!M31-iniTurma!M$1)/iniTurma!M$2,\"\")","v":""}]
[{"$f":"IF(iniTurma!B32<>\"\",iniTurma!B32,\"\")","v":""},{"$f":"iniTurma!A32","v":29},{"$f":"IF(iniTurma!C32<>\"\",iniTurma!C32,\"\")","v":""},{"$f":"IF(iniTurma!D32<>\"\",iniTurma!D32,\"\")","v":""},{"$f":"IF(AND(iniTurma!F$2<>\"\",iniTurma!F32<>\"\"),(iniTurma!F32-iniTurma!F$1)/iniTurma!F$2,\"\")","v":""},{"$f":"IF(AND(iniTurma!G$2<>\"\",iniTurma!G32<>\"\"),(iniTurma!G32-iniTurma!G$1)/iniTurma!G$2,\"\")","v":""},{"$f":"IF(AND(iniTurma!H$2<>\"\",iniTurma!H32<>\"\"),(iniTurma!H32-iniTurma!H$1)/iniTurma!H$2,\"\")","v":""},{"$f":"IF(AND(iniTurma!I$2<>\"\",iniTurma!I32<>\"\"),(iniTurma!I32-iniTurma!I$1)/iniTurma!I$2,\"\")","v":""},{"$f":"IF(AND(iniTurma!J$2<>\"\",iniTurma!J32<>\"\"),(iniTurma!J32-iniTurma!J$1)/iniTurma!J$2,\"\")","v":""},{"$f":"IF(AND(iniTurma!K$2<>\"\",iniTurma!K32<>\"\"),(iniTurma!K32-iniTurma!K$1)/iniTurma!K$2,\"\")","v":""},{"$f":"IF(AND(iniTurma!L$2<>\"\",iniTurma!L32<>\"\"),(iniTurma!L32-iniTurma!L$1)/iniTurma!L$2,\"\")","v":""},{"$f":"IF(AND(iniTurma!M$2<>\"\",iniTurma!M32<>\"\"),(iniTurma!M32-iniTurma!M$1)/iniTurma!M$2,\"\")","v":""}]
[{"$f":"IF(iniTurma!B33<>\"\",iniTurma!B33,\"\")","v":""},{"$f":"iniTurma!A33","v":30},{"$f":"IF(iniTurma!C33<>\"\",iniTurma!C33,\"\")","v":""},{"$f":"IF(iniTurma!D33<>\"\",iniTurma!D33,\"\")","v":""},{"$f":"IF(AND(iniTurma!F$2<>\"\",iniTurma!F33<>\"\"),(iniTurma!F33-iniTurma!F$1)/iniTurma!F$2,\"\")","v":""},{"$f":"IF(AND(iniTurma!G$2<>\"\",iniTurma!G33<>\"\"),(iniTurma!G33-iniTurma!G$1)/iniTurma!G$2,\"\")","v":""},{"$f":"IF(AND(iniTurma!H$2<>\"\",iniTurma!H33<>\"\"),(iniTurma!H33-iniTurma!H$1)/iniTurma!H$2,\"\")","v":""},{"$f":"IF(AND(iniTurma!I$2<>\"\",iniTurma!I33<>\"\"),(iniTurma!I33-iniTurma!I$1)/iniTurma!I$2,\"\")","v":""},{"$f":"IF(AND(iniTurma!J$2<>\"\",iniTurma!J33<>\"\"),(iniTurma!J33-iniTurma!J$1)/iniTurma!J$2,\"\")","v":""},{"$f":"IF(AND(iniTurma!K$2<>\"\",iniTurma!K33<>\"\"),(iniTurma!K33-iniTurma!K$1)/iniTurma!K$2,\"\")","v":""},{"$f":"IF(AND(iniTurma!L$2<>\"\",iniTurma!L33<>\"\"),(iniTurma!L33-iniTurma!L$1)/iniTurma!L$2,\"\")","v":""},{"$f":"IF(AND(iniTurma!M$2<>\"\",iniTurma!M33<>\"\"),(iniTurma!M33-iniTurma!M$1)/iniTurma!M$2,\"\")","v":""}]
[{"$f":"IF(iniTurma!B34<>\"\",iniTurma!B34,\"\")","v":""},{"$f":"iniTurma!A34","v":31},{"$f":"IF(iniTurma!C34<>\"\",iniTurma!C34,\"\")","v":""},{"$f":"IF(iniTurma!D34<>\"\",iniTurma!D34,\"\")","v":""},{"$f":"IF(AND(iniTurma!F$2<>\"\",iniTurma!F34<>\"\"),(iniTurma!F34-iniTurma!F$1)/iniTurma!F$2,\"\")","v":""},{"$f":"IF(AND(iniTurma!G$2<>\"\",iniTurma!G34<>\"\"),(iniTurma!G34-iniTurma!G$1)/iniTurma!G$2,\"\")","v":""},{"$f":"IF(AND(iniTurma!H$2<>\"\",iniTurma!H34<>\"\"),(iniTurma!H34-iniTurma!H$1)/iniTurma!H$2,\"\")","v":""},{"$f":"IF(AND(iniTurma!I$2<>\"\",iniTurma!I34<>\"\"),(iniTurma!I34-iniTurma!I$1)/iniTurma!I$2,\"\")","v":""},{"$f":"IF(AND(iniTurma!J$2<>\"\",iniTurma!J34<>\"\"),(iniTurma!J34-iniTurma!J$1)/iniTurma!J$2,\"\")","v":""},{"$f":"IF(AND(iniTurma!K$2<>\"\",iniTurma!K34<>\"\"),(iniTurma!K34-iniTurma!K$1)/iniTurma!K$2,\"\")","v":""},{"$f":"IF(AND(iniTurma!L$2<>\"\",iniTurma!L34<>\"\"),(iniTurma!L34-iniTurma!L$1)/iniTurma!L$2,\"\")","v":""},{"$f":"IF(AND(iniTurma!M$2<>\"\",iniTurma!M34<>\"\"),(iniTurma!M34-iniTurma!M$1)/iniTurma!M$2,\"\")","v":""}]
[{"$f":"IF(iniTurma!B35<>\"\",iniTurma!B35,\"\")","v":""},{"$f":"iniTurma!A35","v":32},{"$f":"IF(iniTurma!C35<>\"\",iniTurma!C35,\"\")","v":""},{"$f":"IF(iniTurma!D35<>\"\",iniTurma!D35,\"\")","v":""},{"$f":"IF(AND(iniTurma!F$2<>\"\",iniTurma!F35<>\"\"),(iniTurma!F35-iniTurma!F$1)/iniTurma!F$2,\"\")","v":""},{"$f":"IF(AND(iniTurma!G$2<>\"\",iniTurma!G35<>\"\"),(iniTurma!G35-iniTurma!G$1)/iniTurma!G$2,\"\")","v":""},{"$f":"IF(AND(iniTurma!H$2<>\"\",iniTurma!H35<>\"\"),(iniTurma!H35-iniTurma!H$1)/iniTurma!H$2,\"\")","v":""},{"$f":"IF(AND(iniTurma!I$2<>\"\",iniTurma!I35<>\"\"),(iniTurma!I35-iniTurma!I$1)/iniTurma!I$2,\"\")","v":""},{"$f":"IF(AND(iniTurma!J$2<>\"\",iniTurma!J35<>\"\"),(iniTurma!J35-iniTurma!J$1)/iniTurma!J$2,\"\")","v":""},{"$f":"IF(AND(iniTurma!K$2<>\"\",iniTurma!K35<>\"\"),(iniTurma!K35-iniTurma!K$1)/iniTurma!K$2,\"\")","v":""},{"$f":"IF(AND(iniTurma!L$2<>\"\",iniTurma!L35<>\"\"),(iniTurma!L35-iniTurma!L$1)/iniTurma!L$2,\"\")","v":""},{"$f":"IF(AND(iniTurma!M$2<>\"\",iniTurma!M35<>\"\"),(iniTurma!M35-iniTurma!M$1)/iniTurma!M$2,\"\")","v":""}]
[{"$f":"IF(iniTurma!B36<>\"\",iniTurma!B36,\"\")","v":""},{"$f":"iniTurma!A36","v":33},{"$f":"IF(iniTurma!C36<>\"\",iniTurma!C36,\"\")","v":""},{"$f":"IF(iniTurma!D36<>\"\",iniTurma!D36,\"\")","v":""},{"$f":"IF(AND(iniTurma!F$2<>\"\",iniTurma!F36<>\"\"),(iniTurma!F36-iniTurma!F$1)/iniTurma!F$2,\"\")","v":""},{"$f":"IF(AND(iniTurma!G$2<>\"\",iniTurma!G36<>\"\"),(iniTurma!G36-iniTurma!G$1)/iniTurma!G$2,\"\")","v":""},{"$f":"IF(AND(iniTurma!H$2<>\"\",iniTurma!H36<>\"\"),(iniTurma!H36-iniTurma!H$1)/iniTurma!H$2,\"\")","v":""},{"$f":"IF(AND(iniTurma!I$2<>\"\",iniTurma!I36<>\"\"),(iniTurma!I36-iniTurma!I$1)/iniTurma!I$2,\"\")","v":""},{"$f":"IF(AND(iniTurma!J$2<>\"\",iniTurma!J36<>\"\"),(iniTurma!J36-iniTurma!J$1)/iniTurma!J$2,\"\")","v":""},{"$f":"IF(AND(iniTurma!K$2<>\"\",iniTurma!K36<>\"\"),(iniTurma!K36-iniTurma!K$1)/iniTurma!K$2,\"\")","v":""},{"$f":"IF(AND(iniTurma!L$2<>\"\",iniTurma!L36<>\"\"),(iniTurma!L36-iniTurma!L$1)/iniTurma!L$2,\"\")","v":""},{"$f":"IF(AND(iniTurma!M$2<>\"\",iniTurma!M36<>\"\"),(iniTurma!M36-iniTurma!M$1)/iniTurma!M$2,\"\")","v":""}]
[{"$f":"IF(iniTurma!B37<>\"\",iniTurma!B37,\"\")","v":""},{"$f":"iniTurma!A37","v":34},{"$f":"IF(iniTurma!C37<>\"\",iniTurma!C37,\"\")","v":""},{"$f":"IF(iniTurma!D37<>\"\",iniTurma!D37,\"\")","v":""},{"$f":"IF(AND(iniTurma!F$2<>\"\",iniTurma!F37<>\"\"),(iniTurma!F37-iniTurma!F$1)/iniTurma!F$2,\"\")","v":""},{"$f":"IF(AND(iniTurma!G$2<>\"\",iniTurma!G37<>\"\"),(iniTurma!G37-iniTurma!G$1)/iniTurma!G$2,\"\")","v":""},{"$f":"IF(AND(iniTurma!H$2<>\"\",iniTurma!H37<>\"\"),(iniTurma!H37-iniTurma!H$1)/iniTurma!H$2,\"\")","v":""},{"$f":"IF(AND(iniTurma!I$2<>\"\",iniTurma!I37<>\"\"),(iniTurma!I37-iniTurma!I$1)/iniTurma!I$2,\"\")","v":""},{"$f":"IF(AND(iniTurma!J$2<>\"\",iniTurma!J37<>\"\"),(iniTurma!J37-iniTurma!J$1)/iniTurma!J$2,\"\")","v":""},{"$f":"IF(AND(iniTurma!K$2<>\"\",iniTurma!K37<>\"\"),(iniTurma!K37-iniTurma!K$1)/iniTurma!K$2,\"\")","v":""},{"$f":"IF(AND(iniTurma!L$2<>\"\",iniTurma!L37<>\"\"),(iniTurma!L37-iniTurma!L$1)/iniTurma!L$2,\"\")","v":""},{"$f":"IF(AND(iniTurma!M$2<>\"\",iniTurma!M37<>\"\"),(iniTurma!M37-iniTurma!M$1)/iniTurma!M$2,\"\")","v":""}]
[{"$f":"IF(iniTurma!B38<>\"\",iniTurma!B38,\"\")","v":""},{"$f":"iniTurma!A38","v":35},{"$f":"IF(iniTurma!C38<>\"\",iniTurma!C38,\"\")","v":""},{"$f":"IF(iniTurma!D38<>\"\",iniTurma!D38,\"\")","v":""},{"$f":"IF(AND(iniTurma!F$2<>\"\",iniTurma!F38<>\"\"),(iniTurma!F38-iniTurma!F$1)/iniTurma!F$2,\"\")","v":""},{"$f":"IF(AND(iniTurma!G$2<>\"\",iniTurma!G38<>\"\"),(iniTurma!G38-iniTurma!G$1)/iniTurma!G$2,\"\")","v":""},{"$f":"IF(AND(iniTurma!H$2<>\"\",iniTurma!H38<>\"\"),(iniTurma!H38-iniTurma!H$1)/iniTurma!H$2,\"\")","v":""},{"$f":"IF(AND(iniTurma!I$2<>\"\",iniTurma!I38<>\"\"),(iniTurma!I38-iniTurma!I$1)/iniTurma!I$2,\"\")","v":""},{"$f":"IF(AND(iniTurma!J$2<>\"\",iniTurma!J38<>\"\"),(iniTurma!J38-iniTurma!J$1)/iniTurma!J$2,\"\")","v":""},{"$f":"IF(AND(iniTurma!K$2<>\"\",iniTurma!K38<>\"\"),(iniTurma!K38-iniTurma!K$1)/iniTurma!K$2,\"\")","v":""},{"$f":"IF(AND(iniTurma!L$2<>\"\",iniTurma!L38<>\"\"),(iniTurma!L38-iniTurma!L$1)/iniTurma!L$2,\"\")","v":""},{"$f":"IF(AND(iniTurma!M$2<>\"\",iniTurma!M38<>\"\"),(iniTurma!M38-iniTurma!M$1)/iniTurma!M$2,\"\")","v":""}]
[{"$f":"IF(iniTurma!B39<>\"\",iniTurma!B39,\"\")","v":""},{"$f":"iniTurma!A39","v":36},{"$f":"IF(iniTurma!C39<>\"\",iniTurma!C39,\"\")","v":""},{"$f":"IF(iniTurma!D39<>\"\",iniTurma!D39,\"\")","v":""},{"$f":"IF(AND(iniTurma!F$2<>\"\",iniTurma!F39<>\"\"),(iniTurma!F39-iniTurma!F$1)/iniTurma!F$2,\"\")","v":""},{"$f":"IF(AND(iniTurma!G$2<>\"\",iniTurma!G39<>\"\"),(iniTurma!G39-iniTurma!G$1)/iniTurma!G$2,\"\")","v":""},{"$f":"IF(AND(iniTurma!H$2<>\"\",iniTurma!H39<>\"\"),(iniTurma!H39-iniTurma!H$1)/iniTurma!H$2,\"\")","v":""},{"$f":"IF(AND(iniTurma!I$2<>\"\",iniTurma!I39<>\"\"),(iniTurma!I39-iniTurma!I$1)/iniTurma!I$2,\"\")","v":""},{"$f":"IF(AND(iniTurma!J$2<>\"\",iniTurma!J39<>\"\"),(iniTurma!J39-iniTurma!J$1)/iniTurma!J$2,\"\")","v":""},{"$f":"IF(AND(iniTurma!K$2<>\"\",iniTurma!K39<>\"\"),(iniTurma!K39-iniTurma!K$1)/iniTurma!K$2,\"\")","v":""},{"$f":"IF(AND(iniTurma!L$2<>\"\",iniTurma!L39<>\"\"),(iniTurma!L39-iniTurma!L$1)/iniTurma!L$2,\"\")","v":""},{"$f":"IF(AND(iniTurma!M$2<>\"\",iniTurma!M39<>\"\"),(iniTurma!M39-iniTurma!M$1)/iniTurma!M$2,\"\")","v":""}]
[{"$f":"IF(iniTurma!B40<>\"\",iniTurma!B40,\"\")","v":""},{"$f":"iniTurma!A40","v":37},{"$f":"IF(iniTurma!C40<>\"\",iniTurma!C40,\"\")","v":""},{"$f":"IF(iniTurma!D40<>\"\",iniTurma!D40,\"\")","v":""},{"$f":"IF(AND(iniTurma!F$2<>\"\",iniTurma!F40<>\"\"),(iniTurma!F40-iniTurma!F$1)/iniTurma!F$2,\"\")","v":""},{"$f":"IF(AND(iniTurma!G$2<>\"\",iniTurma!G40<>\"\"),(iniTurma!G40-iniTurma!G$1)/iniTurma!G$2,\"\")","v":""},{"$f":"IF(AND(iniTurma!H$2<>\"\",iniTurma!H40<>\"\"),(iniTurma!H40-iniTurma!H$1)/iniTurma!H$2,\"\")","v":""},{"$f":"IF(AND(iniTurma!I$2<>\"\",iniTurma!I40<>\"\"),(iniTurma!I40-iniTurma!I$1)/iniTurma!I$2,\"\")","v":""},{"$f":"IF(AND(iniTurma!J$2<>\"\",iniTurma!J40<>\"\"),(iniTurma!J40-iniTurma!J$1)/iniTurma!J$2,\"\")","v":""},{"$f":"IF(AND(iniTurma!K$2<>\"\",iniTurma!K40<>\"\"),(iniTurma!K40-iniTurma!K$1)/iniTurma!K$2,\"\")","v":""},{"$f":"IF(AND(iniTurma!L$2<>\"\",iniTurma!L40<>\"\"),(iniTurma!L40-iniTurma!L$1)/iniTurma!L$2,\"\")","v":""},{"$f":"IF(AND(iniTurma!M$2<>\"\",iniTurma!M40<>\"\"),(iniTurma!M40-iniTurma!M$1)/iniTurma!M$2,\"\")","v":""}]
[{"$f":"IF(iniTurma!B41<>\"\",iniTurma!B41,\"\")","v":""},{"$f":"iniTurma!A41","v":38},{"$f":"IF(iniTurma!C41<>\"\",iniTurma!C41,\"\")","v":""},{"$f":"IF(iniTurma!D41<>\"\",iniTurma!D41,\"\")","v":""},{"$f":"IF(AND(iniTurma!F$2<>\"\",iniTurma!F41<>\"\"),(iniTurma!F41-iniTurma!F$1)/iniTurma!F$2,\"\")","v":""},{"$f":"IF(AND(iniTurma!G$2<>\"\",iniTurma!G41<>\"\"),(iniTurma!G41-iniTurma!G$1)/iniTurma!G$2,\"\")","v":""},{"$f":"IF(AND(iniTurma!H$2<>\"\",iniTurma!H41<>\"\"),(iniTurma!H41-iniTurma!H$1)/iniTurma!H$2,\"\")","v":""},{"$f":"IF(AND(iniTurma!I$2<>\"\",iniTurma!I41<>\"\"),(iniTurma!I41-iniTurma!I$1)/iniTurma!I$2,\"\")","v":""},{"$f":"IF(AND(iniTurma!J$2<>\"\",iniTurma!J41<>\"\"),(iniTurma!J41-iniTurma!J$1)/iniTurma!J$2,\"\")","v":""},{"$f":"IF(AND(iniTurma!K$2<>\"\",iniTurma!K41<>\"\"),(iniTurma!K41-iniTurma!K$1)/iniTurma!K$2,\"\")","v":""},{"$f":"IF(AND(iniTurma!L$2<>\"\",iniTurma!L41<>\"\"),(iniTurma!L41-iniTurma!L$1)/iniTurma!L$2,\"\")","v":""},{"$f":"IF(AND(iniTurma!M$2<>\"\",iniTurma!M41<>\"\"),(iniTurma!M41-iniTurma!M$1)/iniTurma!M$2,\"\")","v":""}]
[{"$f":"IF(iniTurma!B42<>\"\",iniTurma!B42,\"\")","v":""},{"$f":"iniTurma!A42","v":39},{"$f":"IF(iniTurma!C42<>\"\",iniTurma!C42,\"\")","v":""},{"$f":"IF(iniTurma!D42<>\"\",iniTurma!D42,\"\")","v":""},{"$f":"IF(AND(iniTurma!F$2<>\"\",iniTurma!F42<>\"\"),(iniTurma!F42-iniTurma!F$1)/iniTurma!F$2,\"\")","v":""},{"$f":"IF(AND(iniTurma!G$2<>\"\",iniTurma!G42<>\"\"),(iniTurma!G42-iniTurma!G$1)/iniTurma!G$2,\"\")","v":""},{"$f":"IF(AND(iniTurma!H$2<>\"\",iniTurma!H42<>\"\"),(iniTurma!H42-iniTurma!H$1)/iniTurma!H$2,\"\")","v":""},{"$f":"IF(AND(iniTurma!I$2<>\"\",iniTurma!I42<>\"\"),(iniTurma!I42-iniTurma!I$1)/iniTurma!I$2,\"\")","v":""},{"$f":"IF(AND(iniTurma!J$2<>\"\",iniTurma!J42<>\"\"),(iniTurma!J42-iniTurma!J$1)/iniTurma!J$2,\"\")","v":""},{"$f":"IF(AND(iniTurma!K$2<>\"\",iniTurma!K42<>\"\"),(iniTurma!K42-iniTurma!K$1)/iniTurma!K$2,\"\")","v":""},{"$f":"IF(AND(iniTurma!L$2<>\"\",iniTurma!L42<>\"\"),(iniTurma!L42-iniTurma!L$1)/iniTurma!L$2,\"\")","v":""},{"$f":"IF(AND(iniTurma!M$2<>\"\",iniTurma!M42<>\"\"),(iniTurma!M42-iniTurma!M$1)/iniTurma!M$2,\"\")","v":""}]
[{"$f":"IF(iniTurma!B43<>\"\",iniTurma!B43,\"\")","v":""},{"$f":"iniTurma!A43","v":40},{"$f":"IF(iniTurma!C43<>\"\",iniTurma!C43,\"\")","v":""},{"$f":"IF(iniTurma!D43<>\"\",iniTurma!D43,\"\")","v":""},{"$f":"IF(AND(iniTurma!F$2<>\"\",iniTurma!F43<>\"\"),(iniTurma!F43-iniTurma!F$1)/iniTurma!F$2,\"\")","v":""},{"$f":"IF(AND(iniTurma!G$2<>\"\",iniTurma!G43<>\"\"),(iniTurma!G43-iniTurma!G$1)/iniTurma!G$2,\"\")","v":""},{"$f":"IF(AND(iniTurma!H$2<>\"\",iniTurma!H43<>\"\"),(iniTurma!H43-iniTurma!H$1)/iniTurma!H$2,\"\")","v":""},{"$f":"IF(AND(iniTurma!I$2<>\"\",iniTurma!I43<>\"\"),(iniTurma!I43-iniTurma!I$1)/iniTurma!I$2,\"\")","v":""},{"$f":"IF(AND(iniTurma!J$2<>\"\",iniTurma!J43<>\"\"),(iniTurma!J43-iniTurma!J$1)/iniTurma!J$2,\"\")","v":""},{"$f":"IF(AND(iniTurma!K$2<>\"\",iniTurma!K43<>\"\"),(iniTurma!K43-iniTurma!K$1)/iniTurma!K$2,\"\")","v":""},{"$f":"IF(AND(iniTurma!L$2<>\"\",iniTurma!L43<>\"\"),(iniTurma!L43-iniTurma!L$1)/iniTurma!L$2,\"\")","v":""},{"$f":"IF(AND(iniTurma!M$2<>\"\",iniTurma!M43<>\"\"),(iniTurma!M43-iniTurma!M$1)/iniTurma!M$2,\"\")","v":""}]
[{"$f":"IF(iniTurma!B44<>\"\",iniTurma!B44,\"\")","v":""},{"$f":"iniTurma!A44","v":41},{"$f":"IF(iniTurma!C44<>\"\",iniTurma!C44,\"\")","v":""},{"$f":"IF(iniTurma!D44<>\"\",iniTurma!D44,\"\")","v":""},{"$f":"IF(AND(iniTurma!F$2<>\"\",iniTurma!F44<>\"\"),(iniTurma!F44-iniTurma!F$1)/iniTurma!F$2,\"\")","v":""},{"$f":"IF(AND(iniTurma!G$2<>\"\",iniTurma!G44<>\"\"),(iniTurma!G44-iniTurma!G$1)/iniTurma!G$2,\"\")","v":""},{"$f":"IF(AND(iniTurma!H$2<>\"\",iniTurma!H44<>\"\"),(iniTurma!H44-iniTurma!H$1)/iniTurma!H$2,\"\")","v":""},{"$f":"IF(AND(iniTurma!I$2<>\"\",iniTurma!I44<>\"\"),(iniTurma!I44-iniTurma!I$1)/iniTurma!I$2,\"\")","v":""},{"$f":"IF(AND(iniTurma!J$2<>\"\",iniTurma!J44<>\"\"),(iniTurma!J44-iniTurma!J$1)/iniTurma!J$2,\"\")","v":""},{"$f":"IF(AND(iniTurma!K$2<>\"\",iniTurma!K44<>\"\"),(iniTurma!K44-iniTurma!K$1)/iniTurma!K$2,\"\")","v":""},{"$f":"IF(AND(iniTurma!L$2<>\"\",iniTurma!L44<>\"\"),(iniTurma!L44-iniTurma!L$1)/iniTurma!L$2,\"\")","v":""},{"$f":"IF(AND(iniTurma!M$2<>\"\",iniTurma!M44<>\"\"),(iniTurma!M44-iniTurma!M$1)/iniTurma!M$2,\"\")","v":""}]
[{"$f":"IF(iniTurma!B45<>\"\",iniTurma!B45,\"\")","v":""},{"$f":"iniTurma!A45","v":42},{"$f":"IF(iniTurma!C45<>\"\",iniTurma!C45,\"\")","v":""},{"$f":"IF(iniTurma!D45<>\"\",iniTurma!D45,\"\")","v":""},{"$f":"IF(AND(iniTurma!F$2<>\"\",iniTurma!F45<>\"\"),(iniTurma!F45-iniTurma!F$1)/iniTurma!F$2,\"\")","v":""},{"$f":"IF(AND(iniTurma!G$2<>\"\",iniTurma!G45<>\"\"),(iniTurma!G45-iniTurma!G$1)/iniTurma!G$2,\"\")","v":""},{"$f":"IF(AND(iniTurma!H$2<>\"\",iniTurma!H45<>\"\"),(iniTurma!H45-iniTurma!H$1)/iniTurma!H$2,\"\")","v":""},{"$f":"IF(AND(iniTurma!I$2<>\"\",iniTurma!I45<>\"\"),(iniTurma!I45-iniTurma!I$1)/iniTurma!I$2,\"\")","v":""},{"$f":"IF(AND(iniTurma!J$2<>\"\",iniTurma!J45<>\"\"),(iniTurma!J45-iniTurma!J$1)/iniTurma!J$2,\"\")","v":""},{"$f":"IF(AND(iniTurma!K$2<>\"\",iniTurma!K45<>\"\"),(iniTurma!K45-iniTurma!K$1)/iniTurma!K$2,\"\")","v":""},{"$f":"IF(AND(iniTurma!L$2<>\"\",iniTurma!L45<>\"\"),(iniTurma!L45-iniTurma!L$1)/iniTurma!L$2,\"\")","v":""},{"$f":"IF(AND(iniTurma!M$2<>\"\",iniTurma!M45<>\"\"),(iniTurma!M45-iniTurma!M$1)/iniTurma!M$2,\"\")","v":""}]
[{"$f":"IF(iniTurma!B46<>\"\",iniTurma!B46,\"\")","v":""},{"$f":"iniTurma!A46","v":43},{"$f":"IF(iniTurma!C46<>\"\",iniTurma!C46,\"\")","v":""},{"$f":"IF(iniTurma!D46<>\"\",iniTurma!D46,\"\")","v":""},{"$f":"IF(AND(iniTurma!F$2<>\"\",iniTurma!F46<>\"\"),(iniTurma!F46-iniTurma!F$1)/iniTurma!F$2,\"\")","v":""},{"$f":"IF(AND(iniTurma!G$2<>\"\",iniTurma!G46<>\"\"),(iniTurma!G46-iniTurma!G$1)/iniTurma!G$2,\"\")","v":""},{"$f":"IF(AND(iniTurma!H$2<>\"\",iniTurma!H46<>\"\"),(iniTurma!H46-iniTurma!H$1)/iniTurma!H$2,\"\")","v":""},{"$f":"IF(AND(iniTurma!I$2<>\"\",iniTurma!I46<>\"\"),(iniTurma!I46-iniTurma!I$1)/iniTurma!I$2,\"\")","v":""},{"$f":"IF(AND(iniTurma!J$2<>\"\",iniTurma!J46<>\"\"),(iniTurma!J46-iniTurma!J$1)/iniTurma!J$2,\"\")","v":""},{"$f":"IF(AND(iniTurma!K$2<>\"\",iniTurma!K46<>\"\"),(iniTurma!K46-iniTurma!K$1)/iniTurma!K$2,\"\")","v":""},{"$f":"IF(AND(iniTurma!L$2<>\"\",iniTurma!L46<>\"\"),(iniTurma!L46-iniTurma!L$1)/iniTurma!L$2,\"\")","v":""},{"$f":"IF(AND(iniTurma!M$2<>\"\",iniTurma!M46<>\"\"),(iniTurma!M46-iniTurma!M$1)/iniTurma!M$2,\"\")","v":""}]
[{"$f":"IF(iniTurma!B47<>\"\",iniTurma!B47,\"\")","v":""},{"$f":"iniTurma!A47","v":44},{"$f":"IF(iniTurma!C47<>\"\",iniTurma!C47,\"\")","v":""},{"$f":"IF(iniTurma!D47<>\"\",iniTurma!D47,\"\")","v":""},{"$f":"IF(AND(iniTurma!F$2<>\"\",iniTurma!F47<>\"\"),(iniTurma!F47-iniTurma!F$1)/iniTurma!F$2,\"\")","v":""},{"$f":"IF(AND(iniTurma!G$2<>\"\",iniTurma!G47<>\"\"),(iniTurma!G47-iniTurma!G$1)/iniTurma!G$2,\"\")","v":""},{"$f":"IF(AND(iniTurma!H$2<>\"\",iniTurma!H47<>\"\"),(iniTurma!H47-iniTurma!H$1)/iniTurma!H$2,\"\")","v":""},{"$f":"IF(AND(iniTurma!I$2<>\"\",iniTurma!I47<>\"\"),(iniTurma!I47-iniTurma!I$1)/iniTurma!I$2,\"\")","v":""},{"$f":"IF(AND(iniTurma!J$2<>\"\",iniTurma!J47<>\"\"),(iniTurma!J47-iniTurma!J$1)/iniTurma!J$2,\"\")","v":""},{"$f":"IF(AND(iniTurma!K$2<>\"\",iniTurma!K47<>\"\"),(iniTurma!K47-iniTurma!K$1)/iniTurma!K$2,\"\")","v":""},{"$f":"IF(AND(iniTurma!L$2<>\"\",iniTurma!L47<>\"\"),(iniTurma!L47-iniTurma!L$1)/iniTurma!L$2,\"\")","v":""},{"$f":"IF(AND(iniTurma!M$2<>\"\",iniTurma!M47<>\"\"),(iniTurma!M47-iniTurma!M$1)/iniTurma!M$2,\"\")","v":""}]
[{"$f":"IF(iniTurma!B48<>\"\",iniTurma!B48,\"\")","v":""},{"$f":"iniTurma!A48","v":45},{"$f":"IF(iniTurma!C48<>\"\",iniTurma!C48,\"\")","v":""},{"$f":"IF(iniTurma!D48<>\"\",iniTurma!D48,\"\")","v":""},{"$f":"IF(AND(iniTurma!F$2<>\"\",iniTurma!F48<>\"\"),(iniTurma!F48-iniTurma!F$1)/iniTurma!F$2,\"\")","v":""},{"$f":"IF(AND(iniTurma!G$2<>\"\",iniTurma!G48<>\"\"),(iniTurma!G48-iniTurma!G$1)/iniTurma!G$2,\"\")","v":""},{"$f":"IF(AND(iniTurma!H$2<>\"\",iniTurma!H48<>\"\"),(iniTurma!H48-iniTurma!H$1)/iniTurma!H$2,\"\")","v":""},{"$f":"IF(AND(iniTurma!I$2<>\"\",iniTurma!I48<>\"\"),(iniTurma!I48-iniTurma!I$1)/iniTurma!I$2,\"\")","v":""},{"$f":"IF(AND(iniTurma!J$2<>\"\",iniTurma!J48<>\"\"),(iniTurma!J48-iniTurma!J$1)/iniTurma!J$2,\"\")","v":""},{"$f":"IF(AND(iniTurma!K$2<>\"\",iniTurma!K48<>\"\"),(iniTurma!K48-iniTurma!K$1)/iniTurma!K$2,\"\")","v":""},{"$f":"IF(AND(iniTurma!L$2<>\"\",iniTurma!L48<>\"\"),(iniTurma!L48-iniTurma!L$1)/iniTurma!L$2,\"\")","v":""},{"$f":"IF(AND(iniTurma!M$2<>\"\",iniTurma!M48<>\"\"),(iniTurma!M48-iniTurma!M$1)/iniTurma!M$2,\"\")","v":""}]
[{"$f":"IF(iniTurma!B49<>\"\",iniTurma!B49,\"\")","v":""},{"$f":"iniTurma!A49","v":46},{"$f":"IF(iniTurma!C49<>\"\",iniTurma!C49,\"\")","v":""},{"$f":"IF(iniTurma!D49<>\"\",iniTurma!D49,\"\")","v":""},{"$f":"IF(AND(iniTurma!F$2<>\"\",iniTurma!F49<>\"\"),(iniTurma!F49-iniTurma!F$1)/iniTurma!F$2,\"\")","v":""},{"$f":"IF(AND(iniTurma!G$2<>\"\",iniTurma!G49<>\"\"),(iniTurma!G49-iniTurma!G$1)/iniTurma!G$2,\"\")","v":""},{"$f":"IF(AND(iniTurma!H$2<>\"\",iniTurma!H49<>\"\"),(iniTurma!H49-iniTurma!H$1)/iniTurma!H$2,\"\")","v":""},{"$f":"IF(AND(iniTurma!I$2<>\"\",iniTurma!I49<>\"\"),(iniTurma!I49-iniTurma!I$1)/iniTurma!I$2,\"\")","v":""},{"$f":"IF(AND(iniTurma!J$2<>\"\",iniTurma!J49<>\"\"),(iniTurma!J49-iniTurma!J$1)/iniTurma!J$2,\"\")","v":""},{"$f":"IF(AND(iniTurma!K$2<>\"\",iniTurma!K49<>\"\"),(iniTurma!K49-iniTurma!K$1)/iniTurma!K$2,\"\")","v":""},{"$f":"IF(AND(iniTurma!L$2<>\"\",iniTurma!L49<>\"\"),(iniTurma!L49-iniTurma!L$1)/iniTurma!L$2,\"\")","v":""},{"$f":"IF(AND(iniTurma!M$2<>\"\",iniTurma!M49<>\"\"),(iniTurma!M49-iniTurma!M$1)/iniTurma!M$2,\"\")","v":""}]
[{"$f":"IF(iniTurma!B50<>\"\",iniTurma!B50,\"\")","v":""},{"$f":"iniTurma!A50","v":47},{"$f":"IF(iniTurma!C50<>\"\",iniTurma!C50,\"\")","v":""},{"$f":"IF(iniTurma!D50<>\"\",iniTurma!D50,\"\")","v":""},{"$f":"IF(AND(iniTurma!F$2<>\"\",iniTurma!F50<>\"\"),(iniTurma!F50-iniTurma!F$1)/iniTurma!F$2,\"\")","v":""},{"$f":"IF(AND(iniTurma!G$2<>\"\",iniTurma!G50<>\"\"),(iniTurma!G50-iniTurma!G$1)/iniTurma!G$2,\"\")","v":""},{"$f":"IF(AND(iniTurma!H$2<>\"\",iniTurma!H50<>\"\"),(iniTurma!H50-iniTurma!H$1)/iniTurma!H$2,\"\")","v":""},{"$f":"IF(AND(iniTurma!I$2<>\"\",iniTurma!I50<>\"\"),(iniTurma!I50-iniTurma!I$1)/iniTurma!I$2,\"\")","v":""},{"$f":"IF(AND(iniTurma!J$2<>\"\",iniTurma!J50<>\"\"),(iniTurma!J50-iniTurma!J$1)/iniTurma!J$2,\"\")","v":""},{"$f":"IF(AND(iniTurma!K$2<>\"\",iniTurma!K50<>\"\"),(iniTurma!K50-iniTurma!K$1)/iniTurma!K$2,\"\")","v":""},{"$f":"IF(AND(iniTurma!L$2<>\"\",iniTurma!L50<>\"\"),(iniTurma!L50-iniTurma!L$1)/iniTurma!L$2,\"\")","v":""},{"$f":"IF(AND(iniTurma!M$2<>\"\",iniTurma!M50<>\"\"),(iniTurma!M50-iniTurma!M$1)/iniTurma!M$2,\"\")","v":""}]
[{"$f":"IF(iniTurma!B51<>\"\",iniTurma!B51,\"\")","v":""},{"$f":"iniTurma!A51","v":48},{"$f":"IF(iniTurma!C51<>\"\",iniTurma!C51,\"\")","v":""},{"$f":"IF(iniTurma!D51<>\"\",iniTurma!D51,\"\")","v":""},{"$f":"IF(AND(iniTurma!F$2<>\"\",iniTurma!F51<>\"\"),(iniTurma!F51-iniTurma!F$1)/iniTurma!F$2,\"\")","v":""},{"$f":"IF(AND(iniTurma!G$2<>\"\",iniTurma!G51<>\"\"),(iniTurma!G51-iniTurma!G$1)/iniTurma!G$2,\"\")","v":""},{"$f":"IF(AND(iniTurma!H$2<>\"\",iniTurma!H51<>\"\"),(iniTurma!H51-iniTurma!H$1)/iniTurma!H$2,\"\")","v":""},{"$f":"IF(AND(iniTurma!I$2<>\"\",iniTurma!I51<>\"\"),(iniTurma!I51-iniTurma!I$1)/iniTurma!I$2,\"\")","v":""},{"$f":"IF(AND(iniTurma!J$2<>\"\",iniTurma!J51<>\"\"),(iniTurma!J51-iniTurma!J$1)/iniTurma!J$2,\"\")","v":""},{"$f":"IF(AND(iniTurma!K$2<>\"\",iniTurma!K51<>\"\"),(iniTurma!K51-iniTurma!K$1)/iniTurma!K$2,\"\")","v":""},{"$f":"IF(AND(iniTurma!L$2<>\"\",iniTurma!L51<>\"\"),(iniTurma!L51-iniTurma!L$1)/iniTurma!L$2,\"\")","v":""},{"$f":"IF(AND(iniTurma!M$2<>\"\",iniTurma!M51<>\"\"),(iniTurma!M51-iniTurma!M$1)/iniTurma!M$2,\"\")","v":""}]
[{"$f":"IF(iniTurma!B52<>\"\",iniTurma!B52,\"\")","v":""},{"$f":"iniTurma!A52","v":49},{"$f":"IF(iniTurma!C52<>\"\",iniTurma!C52,\"\")","v":""},{"$f":"IF(iniTurma!D52<>\"\",iniTurma!D52,\"\")","v":""},{"$f":"IF(AND(iniTurma!F$2<>\"\",iniTurma!F52<>\"\"),(iniTurma!F52-iniTurma!F$1)/iniTurma!F$2,\"\")","v":""},{"$f":"IF(AND(iniTurma!G$2<>\"\",iniTurma!G52<>\"\"),(iniTurma!G52-iniTurma!G$1)/iniTurma!G$2,\"\")","v":""},{"$f":"IF(AND(iniTurma!H$2<>\"\",iniTurma!H52<>\"\"),(iniTurma!H52-iniTurma!H$1)/iniTurma!H$2,\"\")","v":""},{"$f":"IF(AND(iniTurma!I$2<>\"\",iniTurma!I52<>\"\"),(iniTurma!I52-iniTurma!I$1)/iniTurma!I$2,\"\")","v":""},{"$f":"IF(AND(iniTurma!J$2<>\"\",iniTurma!J52<>\"\"),(iniTurma!J52-iniTurma!J$1)/iniTurma!J$2,\"\")","v":""},{"$f":"IF(AND(iniTurma!K$2<>\"\",iniTurma!K52<>\"\"),(iniTurma!K52-iniTurma!K$1)/iniTurma!K$2,\"\")","v":""},{"$f":"IF(AND(iniTurma!L$2<>\"\",iniTurma!L52<>\"\"),(iniTurma!L52-iniTurma!L$1)/iniTurma!L$2,\"\")","v":""},{"$f":"IF(AND(iniTurma!M$2<>\"\",iniTurma!M52<>\"\"),(iniTurma!M52-iniTurma!M$1)/iniTurma!M$2,\"\")","v":""}]
[{"$f":"IF(iniTurma!B53<>\"\",iniTurma!B53,\"\")","v":""},{"$f":"iniTurma!A53","v":50},{"$f":"IF(iniTurma!C53<>\"\",iniTurma!C53,\"\")","v":""},{"$f":"IF(iniTurma!D53<>\"\",iniTurma!D53,\"\")","v":""},{"$f":"IF(AND(iniTurma!F$2<>\"\",iniTurma!F53<>\"\"),(iniTurma!F53-iniTurma!F$1)/iniTurma!F$2,\"\")","v":""},{"$f":"IF(AND(iniTurma!G$2<>\"\",iniTurma!G53<>\"\"),(iniTurma!G53-iniTurma!G$1)/iniTurma!G$2,\"\")","v":""},{"$f":"IF(AND(iniTurma!H$2<>\"\",iniTurma!H53<>\"\"),(iniTurma!H53-iniTurma!H$1)/iniTurma!H$2,\"\")","v":""},{"$f":"IF(AND(iniTurma!I$2<>\"\",iniTurma!I53<>\"\"),(iniTurma!I53-iniTurma!I$1)/iniTurma!I$2,\"\")","v":""},{"$f":"IF(AND(iniTurma!J$2<>\"\",iniTurma!J53<>\"\"),(iniTurma!J53-iniTurma!J$1)/iniTurma!J$2,\"\")","v":""},{"$f":"IF(AND(iniTurma!K$2<>\"\",iniTurma!K53<>\"\"),(iniTurma!K53-iniTurma!K$1)/iniTurma!K$2,\"\")","v":""},{"$f":"IF(AND(iniTurma!L$2<>\"\",iniTurma!L53<>\"\"),(iniTurma!L53-iniTurma!L$1)/iniTurma!L$2,\"\")","v":""},{"$f":"IF(AND(iniTurma!M$2<>\"\",iniTurma!M53<>\"\"),(iniTurma!M53-iniTurma!M$1)/iniTurma!M$2,\"\")","v":""}]

{"sheet":"fimTurma","index":3,"n_rows":53,"n_cols":11,"rows_kept":53,"cut":false,"hidden":false,"merged":[]}
[null,"Ano:",{"$f":"IF(iniTurma!C1<>\"\",iniTurma!C1,\"\")","v":2},null,"Média:",{"$f":"IF(COUNTA(F4:F53)>0,AVERAGE(F4:F53),\"\")","v":15.374999999999998},{"$f":"IF(COUNTA(G4:G53)>0,AVERAGE(G4:G53),\"\")","v":11.75},7.7636363636363646,34.527272727272731,15.5,9.7416666666666654]
[{"$f":"COUNTIF(B4:B53,\"x\")","v":1},"Turma:",{"$f":"IF(iniTurma!C2<>\"\",iniTurma!C2,\"\")","v":"A"},null,"Desvio-padrão:",{"$f":"IF(COUNTA(F4:F53)>0,_xlfn.STDEV.P(F4:F53),\"\")","v":0.5068283733178327},{"$f":"IF(COUNTA(G4:G53)>0,_xlfn.STDEV.P(G4:G53),\"\")","v":1.299038105676658},0.96603475118437687,3.0766247471394266,3.4520525295346629,1.1161379345264175]
["ID Aluno",{"$f":"_xlfn.CONCAT(\"Ver: \",COUNTIF(B4:B53,\"x\"))","v":"Ver: 1"},"Nome","Idade","Data","Corrida vaivém","Corrida velocidade","Salto horizontal","Receber","Lançar","Equilíbrio"]
[1,null,{"$f":"IF(iniTurma!C4<>\"\",iniTurma!C4,\"\")","v":"Micas"},13,"2025-06-08",15,12,6.5,35,10,10.199999999999999]
[{"$f":"A4+1","v":2},"x",{"$f":"IF(iniTurma!C5<>\"\",iniTurma!C5,\"\")","v":"Tecas"},12,"2025-06-08",15.5,12,7,null,11,10.199999999999999]
[{"$f":"A5+1","v":3},null,{"$f":"IF(iniTurma!C6<>\"\",iniTurma!C6,\"\")","v":"Lecas"},15,"2025-06-08",16,13,8,34,12,9.9]
[4,null,{"$f":"IF(iniTurma!C7<>\"\",iniTurma!C7,\"\")","v":"Becas"},8,"2025-06-08",14.9,11,null,39,13,8.6999999999999993]
[5,null,{"$f":"IF(iniTurma!C8<>\"\",iniTurma!C8,\"\")","v":"Nocas"},11,"2025-06-08",15.4,14,7.2,41,14,7.6]
[6,null,{"$f":"IF(iniTurma!C9<>\"\",iniTurma!C9,\"\")","v":"Françoise Hardy"},13,"2025-06-08",15,12,8.4,36,15,11]
[7,null,{"$f":"IF(iniTurma!C10<>\"\",iniTurma!C10,\"\")","v":"Asterix"},16,"2025-06-09",14.6,10,8.1,32,16,7.9]
[8,null,{"$f":"IF(iniTurma!C11<>\"\",iniTurma!C11,\"\")","v":"Obelix"},14,"2025-06-09",16.3,9,7,30,17,10.1]
[9,null,{"$f":"IF(iniTurma!C12<>\"\",iniTurma!C12,\"\")","v":"Ideiafix"},14,"2025-06-09",15,11,7.2,32.200000000000003,18,9.5]
[10,null,{"$f":"IF(iniTurma!C13<>\"\",iniTurma!C13,\"\")","v":"Sylvie Vartan"},14,"2025-06-09",15.5,12,8.3000000000000007,35.1,19,10.5]
[11,null,{"$f":"IF(iniTurma!C14<>\"\",iniTurma!C14,\"\")","v":"Carlos Lopes"},14,"2025-06-09",16.100000000000001,12,10.199999999999999,33.299999999999997,20,11.5]
[12,null,{"$f":"IF(iniTurma!C15<>\"\",iniTurma!C15,\"\")","v":"Rosa Mota"},14,"2025-06-09",15.2,13,7.5,32.200000000000003,21,9.8000000000000007]
[13,null,{"$f":"IF(iniTurma!C16<>\"\",iniTurma!C16,\"\")","v":""}]
[14,null,{"$f":"IF(iniTurma!C17<>\"\",iniTurma!C17,\"\")","v":""}]
[15,null,{"$f":"IF(iniTurma!C18<>\"\",iniTurma!C18,\"\")","v":""}]
[16,null,{"$f":"IF(iniTurma!C19<>\"\",iniTurma!C19,\"\")","v":""}]
[17,null,{"$f":"IF(iniTurma!C20<>\"\",iniTurma!C20,\"\")","v":""}]
[18,null,{"$f":"IF(iniTurma!C21<>\"\",iniTurma!C21,\"\")","v":""}]
[19,null,{"$f":"IF(iniTurma!C22<>\"\",iniTurma!C22,\"\")","v":""}]
[20,null,{"$f":"IF(iniTurma!C23<>\"\",iniTurma!C23,\"\")","v":""}]
[21,null,{"$f":"IF(iniTurma!C24<>\"\",iniTurma!C24,\"\")","v":""}]
[22,null,{"$f":"IF(iniTurma!C25<>\"\",iniTurma!C25,\"\")","v":""}]
[23,null,{"$f":"IF(iniTurma!C26<>\"\",iniTurma!C26,\"\")","v":""}]
[24,null,{"$f":"IF(iniTurma!C27<>\"\",iniTurma!C27,\"\")","v":""}]
[25,null,{"$f":"IF(iniTurma!C28<>\"\",iniTurma!C28,\"\")","v":""}]
[26,null,{"$f":"IF(iniTurma!C29<>\"\",iniTurma!C29,\"\")","v":""}]
[27,null,{"$f":"IF(iniTurma!C30<>\"\",iniTurma!C30,\"\")","v":""}]
[28,null,{"$f":"IF(iniTurma!C31<>\"\",iniTurma!C31,\"\")","v":""}]
[29,null,{"$f":"IF(iniTurma!C32<>\"\",iniTurma!C32,\"\")","v":""}]
[30,null,{"$f":"IF(iniTurma!C33<>\"\",iniTurma!C33,\"\")","v":""}]
[31,null,{"$f":"IF(iniTurma!C34<>\"\",iniTurma!C34,\"\")","v":""}]
[32,null,{"$f":"IF(iniTurma!C35<>\"\",iniTurma!C35,\"\")","v":""}]
[33,null,{"$f":"IF(iniTurma!C36<>\"\",iniTurma!C36,\"\")","v":""}]
[34,null,{"$f":"IF(iniTurma!C37<>\"\",iniTurma!C37,\"\")","v":""}]
[35,null,{"$f":"IF(iniTurma!C38<>\"\",iniTurma!C38,\"\")","v":""}]
[36,null,{"$f":"IF(iniTurma!C39<>\"\",iniTurma!C39,\"\")","v":""}]
[37,null,{"$f":"IF(iniTurma!C40<>\"\",iniTurma!C40,\"\")","v":""}]
[38,null,{"$f":"IF(iniTurma!C41<>\"\",iniTurma!C41,\"\")","v":""}]
[39,null,{"$f":"IF(iniTurma!C42<>\"\",iniTurma!C42,\"\")","v":""}]
[40,null,{"$f":"IF(iniTurma!C43<>\"\",iniTurma!C43,\"\")","v":""}]
[41,null,{"$f":"IF(iniTurma!C44<>\"\",iniTurma!C44,\"\")","v":""}]
[42,null,{"$f":"IF(iniTurma!C45<>\"\",iniTurma!C45,\"\")","v":""}]
[43,null,{"$f":"IF(iniTurma!C46<>\"\",iniTurma!C46,\"\")","v":""}]
[44,null,{"$f":"IF(iniTurma!C47<>\"\",iniTurma!C47,\"\")","v":""}]
[45,null,{"$f":"IF(iniTurma!C48<>\"\",iniTurma!C48,\"\")","v":""}]
[46,null,{"$f":"IF(iniTurma!C49<>\"\",iniTurma!C49,\"\")","v":""}]
[47,null,{"$f":"IF(iniTurma!C50<>\"\",iniTurma!C50,\"\")","v":""}]
[48,null,{"$f":"IF(iniTurma!C51<>\"\",iniTurma!C51,\"\")","v":""}]
[49,null,{"$f":"IF(iniTurma!C52<>\"\",iniTurma!C52,\"\")","v":""}]
[50,null,{"$f":"IF(iniTurma!C53<>\"\",iniTurma!C53,\"\")","v":""}]

{"sheet":"fimRelatório","index":4,"n_rows":23,"n_cols":8,"rows_kept":23,"cut":false,"hidden":false,"merged":[]}
["RELATÓRIO INDIVIDUAL PRESCHOOL TEST BATTERY"]
[{"$f":"IF(fimTurma!A2=1,VLOOKUP(\"x\",fimTurma!B$4:M$53,2,0),\"\")","v":"Tecas"}]
[{"$f":"IF(fimTurma!A2=1,_xlfn.CONCAT(TEXT(VLOOKUP(\"x\",fimTurma!B$4:M$53,4,0),\"dd-mm-aaaa\"),\" | \",fimTurma!C1,\"º ano\",\" | \",fimTurma!C2),\"\")","v":"08-06-2025 | 2º ano | A"}]
[]
[null,"Resultado",null,"Média ",null,"Mínimo",null,"Máximo"]
[null,"da criança",null,"da turma",null,"da turma",null,"da turma"]
["HABILIDADES DE LOCOMOÇÃO"]
[{"$f":"IF(fimTurma!A2=1,IFERROR(VLOOKUP(1,fimAuxiliar!L3:Q5,2,0),\"\"),\"\")","v":"Corrida vaivém"},{"$f":"IF(fimTurma!A2=1,IFERROR(VLOOKUP(1,fimAuxiliar!L3:Q5,3,0),0),0)","v":15.5},null,{"$f":"IF(fimTurma!A2=1,IFERROR(VLOOKUP(1,fimAuxiliar!L3:Q5,4,0),0),0)","v":15.374999999999998},null,{"$f":"IF(fimTurma!A2=1,IFERROR(VLOOKUP(1,fimAuxiliar!L3:Q5,5,0),0),0)","v":14.6},null,{"$f":"IF(fimTurma!A2=1,IFERROR(VLOOKUP(1,fimAuxiliar!L3:Q5,6,0),0),0)","v":16.3}]
[]
[{"$f":"IF(fimTurma!A2=1,IFERROR(VLOOKUP(2,fimAuxiliar!L3:Q5,2,0),\"\"),\"\")","v":"Corrida velocidade"},{"$f":"IF(fimTurma!A2=1,IFERROR(VLOOKUP(2,fimAuxiliar!L3:Q5,3,0),0),0)","v":12},null,{"$f":"IF(fimTurma!A2=1,IFERROR(VLOOKUP(2,fimAuxiliar!L3:Q5,4,0),0),0)","v":11.75},null,{"$f":"IF(fimTurma!A2=1,IFERROR(VLOOKUP(2,fimAuxiliar!L3:Q5,5,0),0),0)","v":9},null,{"$f":"IF(fimTurma!A2=1,IFERROR(VLOOKUP(2,fimAuxiliar!L3:Q5,6,0),\"\"),\"\")","v":14}]
[]
[{"$f":"IF(fimTurma!A2=1,IFERROR(VLOOKUP(3,fimAuxiliar!L3:Q5,2,0),\"\"),\"\")","v":"Salto horizontal"},{"$f":"IF(fimTurma!A2=1,IFERROR(VLOOKUP(3,fimAuxiliar!L3:Q5,3,0),0),0)","v":7},null,{"$f":"IF(fimTurma!A2=1,IFERROR(VLOOKUP(3,fimAuxiliar!L3:Q5,4,0),0),0)","v":7.7636363636363646},null,{"$f":"IF(fimTurma!A2=1,IFERROR(VLOOKUP(3,fimAuxiliar!L3:Q5,5,0),0),0)","v":6.5},null,{"$f":"IF(fimTurma!A2=1,IFERROR(VLOOKUP(3,fimAuxiliar!L3:Q5,6,0),0),0)","v":10.199999999999999}]
[]
["HABILIDADES DE CONTROLO DE OBJETOS"]
[{"$f":"IF(fimTurma!A2=1,IFERROR(VLOOKUP(1,fimAuxiliar!L6:Q7,2,0),\"\"),\"\")","v":"Receber"},{"$f":"IF(fimTurma!A2=1,IFERROR(VLOOKUP(1,fimAuxiliar!L6:Q7,3,0),0),0)","v":0},null,{"$f":"IF(fimTurma!A2=1,IFERROR(VLOOKUP(1,fimAuxiliar!L6:Q7,4,0),0),0)","v":34.527272727272731},null,{"$f":"IF(fimTurma!A2=1,IFERROR(VLOOKUP(1,fimAuxiliar!L6:Q7,5,0),0),0)","v":30},null,{"$f":"IF(fimTurma!A2=1,IFERROR(VLOOKUP(1,fimAuxiliar!L6:Q7,6,0),0),0)","v":41}]
[]
[{"$f":"IF(fimTurma!A2=1,IFERROR(VLOOKUP(2,fimAuxiliar!L6:Q7,2,0),\"\"),\"\")","v":"Lançar"},{"$f":"IF(fimTurma!A2=1,IFERROR(VLOOKUP(2,fimAuxiliar!L6:Q7,3,0),0),0)","v":11},null,{"$f":"IF(fimTurma!A2=1,IFERROR(VLOOKUP(2,fimAuxiliar!L6:Q7,4,0),0),0)","v":15.5},null,{"$f":"IF(fimTurma!A2=1,IFERROR(VLOOKUP(2,fimAuxiliar!L6:Q7,5,0),0),0)","v":10},null,{"$f":"IF(fimTurma!A2=1,IFERROR(VLOOKUP(2,fimAuxiliar!L6:Q7,6,0),0),0)","v":21}]
[]
["HABILIDADE DE ESTABILIZAÇÃO"]
[{"$f":"IF(fimTurma!A2=1,IFERROR(VLOOKUP(1,fimAuxiliar!L8:Q8,2,0),\"\"),\"\")","v":"Equilíbrio"},{"$f":"IF(fimTurma!A2=1,IFERROR(VLOOKUP(1,fimAuxiliar!L8:Q8,3,0),0),0)","v":10.199999999999999},null,{"$f":"IF(fimTurma!A2=1,IFERROR(VLOOKUP(1,fimAuxiliar!L8:Q8,4,0),0),0)","v":9.7416666666666654},null,{"$f":"IF(fimTurma!A2=1,IFERROR(VLOOKUP(1,fimAuxiliar!L8:Q8,5,0),0),0)","v":7.6},null,{"$f":"IF(fimTurma!A2=1,IFERROR(VLOOKUP(1,fimAuxiliar!L8:Q8,6,0),0),0)","v":11.5}]
[]
[]
["Perfil multivariado"]

{"sheet":"fimScore Z","index":5,"n_rows":53,"n_cols":12,"rows_kept":53,"cut":false,"hidden":false,"merged":[]}
[]
[]
[{"$f":"fimTurma!B3","v":"Ver: 1"},{"$f":"fimTurma!A3","v":"ID Aluno"},{"$f":"fimTurma!C3","v":"Nome"},{"$f":"fimTurma!D3","v":"Idade"},{"$f":"fimTurma!F3","v":"Corrida vaivém"},{"$f":"fimTurma!G3","v":"Corrida velocidade"},{"$f":"fimTurma!H3","v":"Salto horizontal"},{"$f":"fimTurma!I3","v":"Receber"},{"$f":"fimTurma!J3","v":"Lançar"},{"$f":"fimTurma!K3","v":"Equilíbrio"}]
[{"$f":"IF(fimTurma!B4<>\"\",fimTurma!B4,\"\")","v":""},{"$f":"fimTurma!A4","v":1},{"$f":"IF(fimTurma!C4<>\"\",fimTurma!C4,\"\")","v":"Micas"},{"$f":"IF(fimTurma!D4<>\"\",fimTurma!D4,\"\")","v":13},{"$f":"IF(AND(fimTurma!F$2<>\"\",fimTurma!F4<>\"\"),(fimTurma!F4-fimTurma!F$1)/fimTurma!F$2,\"\")","v":-0.73989543550048109},{"$f":"IF(AND(fimTurma!G$2<>\"\",fimTurma!G4<>\"\"),(fimTurma!G4-fimTurma!G$1)/fimTurma!G$2,\"\")","v":0.19245008972987526},{"$f":"IF(AND(fimTurma!H$2<>\"\",fimTurma!H4<>\"\"),(fimTurma!H4-fimTurma!H$1)/fimTurma!H$2,\"\")","v":-1.3080651209359937},{"$f":"IF(AND(fimTurma!I$2<>\"\",fimTurma!I4<>\"\"),(fimTurma!I4-fimTurma!I$1)/fimTurma!I$2,\"\")","v":0.1536512612293065},{"$f":"IF(AND(fimTurma!J$2<>\"\",fimTurma!J4<>\"\"),(fimTurma!J4-fimTurma!J$1)/fimTurma!J$2,\"\")","v":-1.5932550136313832},{"$f":"IF(AND(fimTurma!K$2<>\"\",fimTurma!K4<>\"\"),(fimTurma!K4-fimTurma!K$1)/fimTurma!K$2,\"\")","v":0.41064219677096353},{"$f":"IF(AND(fimTurma!L$2<>\"\",fimTurma!L4<>\"\"),(fimTurma!L4-fimTurma!L$1)/fimTurma!L$2,\"\")","v":""},{"$f":"IF(AND(fimTurma!M$2<>\"\",fimTurma!M4<>\"\"),(fimTurma!M4-fimTurma!M$1)/fimTurma!M$2,\"\")","v":""}]
[{"$f":"IF(fimTurma!B5<>\"\",fimTurma!B5,\"\")","v":"x"},{"$f":"fimTurma!A5","v":2},{"$f":"IF(fimTurma!C5<>\"\",fimTurma!C5,\"\")","v":"Tecas"},{"$f":"IF(fimTurma!D5<>\"\",fimTurma!D5,\"\")","v":12},{"$f":"IF(AND(fimTurma!F$2<>\"\",fimTurma!F5<>\"\"),(fimTurma!F5-fimTurma!F$1)/fimTurma!F$2,\"\")","v":0.24663181183349836},{"$f":"IF(AND(fimTurma!G$2<>\"\",fimTurma!G5<>\"\"),(fimTurma!G5-fimTurma!G$1)/fimTurma!G$2,\"\")","v":0.19245008972987526},{"$f":"IF(AND(fimTurma!H$2<>\"\",fimTurma!H5<>\"\"),(fimTurma!H5-fimTurma!H$1)/fimTurma!H$2,\"\")","v":-0.7904853968246297},{"$f":"IF(AND(fimTurma!I$2<>\"\",fimTurma!I5<>\"\"),(fimTurma!I5-fimTurma!I$1)/fimTurma!I$2,\"\")","v":""},{"$f":"IF(AND(fimTurma!J$2<>\"\",fimTurma!J5<>\"\"),(fimTurma!J5-fimTurma!J$1)/fimTurma!J$2,\"\")","v":-1.3035722838802226},{"$f":"IF(AND(fimTurma!K$2<>\"\",fimTurma!K5<>\"\"),(fimTurma!K5-fimTurma!K$1)/fimTurma!K$2,\"\")","v":0.41064219677096353},{"$f":"IF(AND(fimTurma!L$2<>\"\",fimTurma!L5<>\"\"),(fimTurma!L5-fimTurma!L$1)/fimTurma!L$2,\"\")","v":""},{"$f":"IF(AND(fimTurma!M$2<>\"\",fimTurma!M5<>\"\"),(fimTurma!M5-fimTurma!M$1)/fimTurma!M$2,\"\")","v":""}]
[{"$f":"IF(fimTurma!B6<>\"\",fimTurma!B6,\"\")","v":""},{"$f":"fimTurma!A6","v":3},{"$f":"IF(fimTurma!C6<>\"\",fimTurma!C6,\"\")","v":"Lecas"},{"$f":"IF(fimTurma!D6<>\"\",fimTurma!D6,\"\")","v":15},{"$f":"IF(AND(fimTurma!F$2<>\"\",fimTurma!F6<>\"\"),(fimTurma!F6-fimTurma!F$1)/fimTurma!F$2,\"\")","v":1.2331590591674777},{"$f":"IF(AND(fimTurma!G$2<>\"\",fimTurma!G6<>\"\"),(fimTurma!G6-fimTurma!G$1)/fimTurma!G$2,\"\")","v":0.96225044864937626},{"$f":"IF(AND(fimTurma!H$2<>\"\",fimTurma!H6<>\"\"),(fimTurma!H6-fimTurma!H$1)/fimTurma!H$2,\"\")","v":0.24467405139809842},{"$f":"IF(AND(fimTurma!I$2<>\"\",fimTurma!I6<>\"\"),(fimTurma!I6-fimTurma!I$1)/fimTurma!I$2,\"\")","v":-0.17138025290961359},{"$f":"IF(AND(fimTurma!J$2<>\"\",fimTurma!J6<>\"\"),(fimTurma!J6-fimTurma!J$1)/fimTurma!J$2,\"\")","v":-1.013889554129062},{"$f":"IF(AND(fimTurma!K$2<>\"\",fimTurma!K6<>\"\"),(fimTurma!K6-fimTurma!K$1)/fimTurma!K$2,\"\")","v":0.14185821342997051},{"$f":"IF(AND(fimTurma!L$2<>\"\",fimTurma!L6<>\"\"),(fimTurma!L6-fimTurma!L$1)/fimTurma!L$2,\"\")","v":""},{"$f":"IF(AND(fimTurma!M$2<>\"\",fimTurma!M6<>\"\"),(fimTurma!M6-fimTurma!M$1)/fimTurma!M$2,\"\")","v":""}]
[{"$f":"IF(fimTurma!B7<>\"\",fimTurma!B7,\"\")","v":""},{"$f":"fimTurma!A7","v":4},{"$f":"IF(fimTurma!C7<>\"\",fimTurma!C7,\"\")","v":"Becas"},{"$f":"IF(fimTurma!D7<>\"\",fimTurma!D7,\"\")","v":8},{"$f":"IF(AND(fimTurma!F$2<>\"\",fimTurma!F7<>\"\"),(fimTurma!F7-fimTurma!F$1)/fimTurma!F$2,\"\")","v":-0.93720088496727627},{"$f":"IF(AND(fimTurma!G$2<>\"\",fimTurma!G7<>\"\"),(fimTurma!G7-fimTurma!G$1)/fimTurma!G$2,\"\")","v":-0.57735026918962573},{"$f":"IF(AND(fimTurma!H$2<>\"\",fimTurma!H7<>\"\"),(fimTurma!H7-fimTurma!H$1)/fimTurma!H$2,\"\")","v":""},{"$f":"IF(AND(fimTurma!I$2<>\"\",fimTurma!I7<>\"\"),(fimTurma!I7-fimTurma!I$1)/fimTurma!I$2,\"\")","v":1.4537773177849869},{"$f":"IF(AND(fimTurma!J$2<>\"\",fimTurma!J7<>\"\"),(fimTurma!J7-fimTurma!J$1)/fimTurma!J$2,\"\")","v":-0.7242068243779014},{"$f":"IF(AND(fimTurma!K$2<>\"\",fimTurma!K7<>\"\"),(fimTurma!K7-fimTurma!K$1)/fimTurma!K$2,\"\")","v":-0.93327771993400621},{"$f":"IF(AND(fimTurma!L$2<>\"\",fimTurma!L7<>\"\"),(fimTurma!L7-fimTurma!L$1)/fimTurma!L$2,\"\")","v":""},{"$f":"IF(AND(fimTurma!M$2<>\"\",fimTurma!M7<>\"\"),(fimTurma!M7-fimTurma!M$1)/fimTurma!M$2,\"\")","v":""}]
[{"$f":"IF(fimTurma!B8<>\"\",fimTurma!B8,\"\")","v":""},{"$f":"fimTurma!A8","v":5},{"$f":"IF(fimTurma!C8<>\"\",fimTurma!C8,\"\")","v":"Nocas"},{"$f":"IF(fimTurma!D8<>\"\",fimTurma!D8,\"\")","v":11},{"$f":"IF(AND(fimTurma!F$2<>\"\",fimTurma!F8<>\"\"),(fimTurma!F8-fimTurma!F$1)/fimTurma!F$2,\"\")","v":4.932636236670318E-2},{"$f":"IF(AND(fimTurma!G$2<>\"\",fimTurma!G8<>\"\"),(fimTurma!G8-fimTurma!G$1)/fimTurma!G$2,\"\")","v":1.7320508075688772},{"$f":"IF(AND(fimTurma!H$2<>\"\",fimTurma!H8<>\"\"),(fimTurma!H8-fimTurma!H$1)/fimTurma!H$2,\"\")","v":-0.58345350718008393},{"$f":"IF(AND(fimTurma!I$2<>\"\",fimTurma!I8<>\"\"),(fimTurma!I8-fimTurma!I$1)/fimTurma!I$2,\"\")","v":2.1038403460628272},{"$f":"IF(AND(fimTurma!J$2<>\"\",fimTurma!J8<>\"\"),(fimTurma!J8-fimTurma!J$1)/fimTurma!J$2,\"\")","v":-0.43452409462674085},{"$f":"IF(AND(fimTurma!K$2<>\"\",fimTurma!K8<>\"\"),(fimTurma!K8-fimTurma!K$1)/fimTurma!K$2,\"\")","v":-1.9188189921843171},{"$f":"IF(AND(fimTurma!L$2<>\"\",fimTurma!L8<>\"\"),(fimTurma!L8-fimTurma!L$1)/fimTurma!L$2,\"\")","v":""},{"$f":"IF(AND(fimTurma!M$2<>\"\",fimTurma!M8<>\"\"),(fimTurma!M8-fimTurma!M$1)/fimTurma!M$2,\"\")","v":""}]
[{"$f":"IF(fimTurma!B9<>\"\",fimTurma!B9,\"\")","v":""},{"$f":"fimTurma!A9","v":6},{"$f":"IF(fimTurma!C9<>\"\",fimTurma!C9,\"\")","v":"Françoise Hardy"},{"$f":"IF(fimTurma!D9<>\"\",fimTurma!D9,\"\")","v":13},{"$f":"IF(AND(fimTurma!F$2<>\"\",fimTurma!F9<>\"\"),(fimTurma!F9-fimTurma!F$1)/fimTurma!F$2,\"\")","v":-0.73989543550048109},{"$f":"IF(AND(fimTurma!G$2<>\"\",fimTurma!G9<>\"\"),(fimTurma!G9-fimTurma!G$1)/fimTurma!G$2,\"\")","v":0.19245008972987526},{"$f":"IF(AND(fimTurma!H$2<>\"\",fimTurma!H9<>\"\"),(fimTurma!H9-fimTurma!H$1)/fimTurma!H$2,\"\")","v":0.65873783068719005},{"$f":"IF(AND(fimTurma!I$2<>\"\",fimTurma!I9<>\"\"),(fimTurma!I9-fimTurma!I$1)/fimTurma!I$2,\"\")","v":0.47868277536822662},{"$f":"IF(AND(fimTurma!J$2<>\"\",fimTurma!J9<>\"\"),(fimTurma!J9-fimTurma!J$1)/fimTurma!J$2,\"\")","v":-0.14484136487558028},{"$f":"IF(AND(fimTurma!K$2<>\"\",fimTurma!K9<>\"\"),(fimTurma!K9-fimTurma!K$1)/fimTurma!K$2,\"\")","v":1.1273994856802814},{"$f":"IF(AND(fimTurma!L$2<>\"\",fimTurma!L9<>\"\"),(fimTurma!L9-fimTurma!L$1)/fimTurma!L$2,\"\")","v":""},{"$f":"IF(AND(fimTurma!M$2<>\"\",fimTurma!M9<>\"\"),(fimTurma!M9-fimTurma!M$1)/fimTurma!M$2,\"\")","v":""}]
[{"$f":"IF(fimTurma!B10<>\"\",fimTurma!B10,\"\")","v":""},{"$f":"fimTurma!A10","v":7},{"$f":"IF(fimTurma!C10<>\"\",fimTurma!C10,\"\")","v":"Asterix"},{"$f":"IF(fimTurma!D10<>\"\",fimTurma!D10,\"\")","v":16},{"$f":"IF(AND(fimTurma!F$2<>\"\",fimTurma!F10<>\"\"),(fimTurma!F10-fimTurma!F$1)/fimTurma!F$2,\"\")","v":-1.5291172333676653},{"$f":"IF(AND(fimTurma!G$2<>\"\",fimTurma!G10<>\"\"),(fimTurma!G10-fimTurma!G$1)/fimTurma!G$2,\"\")","v":-1.3471506281091268},{"$f":"IF(AND(fimTurma!H$2<>\"\",fimTurma!H10<>\"\"),(fimTurma!H10-fimTurma!H$1)/fimTurma!H$2,\"\")","v":0.34818999622037083},{"$f":"IF(AND(fimTurma!I$2<>\"\",fimTurma!I10<>\"\"),(fimTurma!I10-fimTurma!I$1)/fimTurma!I$2,\"\")","v":-0.8214432811874538},{"$f":"IF(AND(fimTurma!J$2<>\"\",fimTurma!J10<>\"\"),(fimTurma!J10-fimTurma!J$1)/fimTurma!J$2,\"\")","v":0.14484136487558028},{"$f":"IF(AND(fimTurma!K$2<>\"\",fimTurma!K10<>\"\"),(fimTurma!K10-fimTurma!K$1)/fimTurma!K$2,\"\")","v":-1.6500350088433224},{"$f":"IF(AND(fimTurma!L$2<>\"\",fimTurma!L10<>\"\"),(fimTurma!L10-fimTurma!L$1)/fimTurma!L$2,\"\")","v":""},{"$f":"IF(AND(fimTurma!M$2<>\"\",fimTurma!M10<>\"\"),(fimTurma!M10-fimTurma!M$1)/fimTurma!M$2,\"\")","v":""}]
[{"$f":"IF(fimTurma!B11<>\"\",fimTurma!B11,\"\")","v":""},{"$f":"fimTurma!A11","v":8},{"$f":"IF(fimTurma!C11<>\"\",fimTurma!C11,\"\")","v":"Obelix"},{"$f":"IF(fimTurma!D11<>\"\",fimTurma!D11,\"\")","v":14},{"$f":"IF(AND(fimTurma!F$2<>\"\",fimTurma!F11<>\"\"),(fimTurma!F11-fimTurma!F$1)/fimTurma!F$2,\"\")","v":1.8250754075678668},{"$f":"IF(AND(fimTurma!G$2<>\"\",fimTurma!G11<>\"\"),(fimTurma!G11-fimTurma!G$1)/fimTurma!G$2,\"\")","v":-2.1169509870286278},{"$f":"IF(AND(fimTurma!H$2<>\"\",fimTurma!H11<>\"\"),(fimTurma!H11-fimTurma!H$1)/fimTurma!H$2,\"\")","v":-0.7904853968246297},{"$f":"IF(AND(fimTurma!I$2<>\"\",fimTurma!I11<>\"\"),(fimTurma!I11-fimTurma!I$1)/fimTurma!I$2,\"\")","v":-1.471506309465294},{"$f":"IF(AND(fimTurma!J$2<>\"\",fimTurma!J11<>\"\"),(fimTurma!J11-fimTurma!J$1)/fimTurma!J$2,\"\")","v":0.43452409462674085},{"$f":"IF(AND(fimTurma!K$2<>\"\",fimTurma!K11<>\"\"),(fimTurma!K11-fimTurma!K$1)/fimTurma!K$2,\"\")","v":0.32104753565729915},{"$f":"IF(AND(fimTurma!L$2<>\"\",fimTurma!L11<>\"\"),(fimTurma!L11-fimTurma!L$1)/fimTurma!L$2,\"\")","v":""},{"$f":"IF(AND(fimTurma!M$2<>\"\",fimTurma!M11<>\"\"),(fimTurma!M11-fimTurma!M$1)/fimTurma!M$2,\"\")","v":""}]
[{"$f":"IF(fimTurma!B12<>\"\",fimTurma!B12,\"\")","v":""},{"$f":"fimTurma!A12","v":9},{"$f":"IF(fimTurma!C12<>\"\",fimTurma!C12,\"\")","v":"Ideiafix"},{"$f":"IF(fimTurma!D12<>\"\",fimTurma!D12,\"\")","v":14},{"$f":"IF(AND(fimTurma!F$2<>\"\",fimTurma!F12<>\"\"),(fimTurma!F12-fimTurma!F$1)/fimTurma!F$2,\"\")","v":-0.73989543550048109},{"$f":"IF(AND(fimTurma!G$2<>\"\",fimTurma!G12<>\"\"),(fimTurma!G12-fimTurma!G$1)/fimTurma!G$2,\"\")","v":-0.57735026918962573},{"$f":"IF(AND(fimTurma!H$2<>\"\",fimTurma!H12<>\"\"),(fimTurma!H12-fimTurma!H$1)/fimTurma!H$2,\"\")","v":-0.58345350718008393},{"$f":"IF(AND(fimTurma!I$2<>\"\",fimTurma!I12<>\"\"),(fimTurma!I12-fimTurma!I$1)/fimTurma!I$2,\"\")","v":-0.75643697835966883},{"$f":"IF(AND(fimTurma!J$2<>\"\",fimTurma!J12<>\"\"),(fimTurma!J12-fimTurma!J$1)/fimTurma!J$2,\"\")","v":0.7242068243779014},{"$f":"IF(AND(fimTurma!K$2<>\"\",fimTurma!K12<>\"\"),(fimTurma!K12-fimTurma!K$1)/fimTurma!K$2,\"\")","v":-0.2165204310246884},{"$f":"IF(AND(fimTurma!L$2<>\"\",fimTurma!L12<>\"\"),(fimTurma!L12-fimTurma!L$1)/fimTurma!L$2,\"\")","v":""},{"$f":"IF(AND(fimTurma!M$2<>\"\",fimTurma!M12<>\"\"),(fimTurma!M12-fimTurma!M$1)/fimTurma!M$2,\"\")","v":""}]
[{"$f":"IF(fimTurma!B13<>\"\",fimTurma!B13,\"\")","v":""},{"$f":"fimTurma!A13","v":10},{"$f":"IF(fimTurma!C13<>\"\",fimTurma!C13,\"\")","v":"Sylvie Vartan"},{"$f":"IF(fimTurma!D13<>\"\",fimTurma!D13,\"\")","v":14},{"$f":"IF(AND(fimTurma!F$2<>\"\",fimTurma!F13<>\"\"),(fimTurma!F13-fimTurma!F$1)/fimTurma!F$2,\"\")","v":0.24663181183349836},{"$f":"IF(AND(fimTurma!G$2<>\"\",fimTurma!G13<>\"\"),(fimTurma!G13-fimTurma!G$1)/fimTurma!G$2,\"\")","v":0.19245008972987526},{"$f":"IF(AND(fimTurma!H$2<>\"\",fimTurma!H13<>\"\"),(fimTurma!H13-fimTurma!H$1)/fimTurma!H$2,\"\")","v":0.55522188586491761},{"$f":"IF(AND(fimTurma!I$2<>\"\",fimTurma!I13<>\"\"),(fimTurma!I13-fimTurma!I$1)/fimTurma!I$2,\"\")","v":0.18615441264319899},{"$f":"IF(AND(fimTurma!J$2<>\"\",fimTurma!J13<>\"\"),(fimTurma!J13-fimTurma!J$1)/fimTurma!J$2,\"\")","v":1.013889554129062},{"$f":"IF(AND(fimTurma!K$2<>\"\",fimTurma!K13<>\"\"),(fimTurma!K13-fimTurma!K$1)/fimTurma!K$2,\"\")","v":0.6794261801119581},{"$f":"IF(AND(fimTurma!L$2<>\"\",fimTurma!L13<>\"\"),(fimTurma!L13-fimTurma!L$1)/fimTurma!L$2,\"\")","v":""},{"$f":"IF(AND(fimTurma!M$2<>\"\",fimTurma!M13<>\"\"),(fimTurma!M13-fimTurma!M$1)/fimTurma!M$2,\"\")","v":""}]
[{"$f":"IF(fimTurma!B14<>\"\",fimTurma!B14,\"\")","v":""},{"$f":"fimTurma!A14","v":11},{"$f":"IF(fimTurma!C14<>\"\",fimTurma!C14,\"\")","v":"Carlos Lopes"},{"$f":"IF(fimTurma!D14<>\"\",fimTurma!D14,\"\")","v":14},{"$f":"IF(AND(fimTurma!F$2<>\"\",fimTurma!F14<>\"\"),(fimTurma!F14-fimTurma!F$1)/fimTurma!F$2,\"\")","v":1.4304645086342764},{"$f":"IF(AND(fimTurma!G$2<>\"\",fimTurma!G14<>\"\"),(fimTurma!G14-fimTurma!G$1)/fimTurma!G$2,\"\")","v":0.19245008972987526},{"$f":"IF(AND(fimTurma!H$2<>\"\",fimTurma!H14<>\"\"),(fimTurma!H14-fimTurma!H$1)/fimTurma!H$2,\"\")","v":2.5220248374880994},{"$f":"IF(AND(fimTurma!I$2<>\"\",fimTurma!I14<>\"\"),(fimTurma!I14-fimTurma!I$1)/fimTurma!I$2,\"\")","v":-0.39890231280685856},{"$f":"IF(AND(fimTurma!J$2<>\"\",fimTurma!J14<>\"\"),(fimTurma!J14-fimTurma!J$1)/fimTurma!J$2,\"\")","v":1.3035722838802226},{"$f":"IF(AND(fimTurma!K$2<>\"\",fimTurma!K14<>\"\"),(fimTurma!K14-fimTurma!K$1)/fimTurma!K$2,\"\")","v":1.5753727912486046},{"$f":"IF(AND(fimTurma!L$2<>\"\",fimTurma!L14<>\"\"),(fimTurma!L14-fimTurma!L$1)/fimTurma!L$2,\"\")","v":""},{"$f":"IF(AND(fimTurma!M$2<>\"\",fimTurma!M14<>\"\"),(fimTurma!M14-fimTurma!M$1)/fimTurma!M$2,\"\")","v":""}]
[{"$f":"IF(fimTurma!B15<>\"\",fimTurma!B15,\"\")","v":""},{"$f":"fimTurma!A15","v":12},{"$f":"IF(fimTurma!C15<>\"\",fimTurma!C15,\"\")","v":"Rosa Mota"},{"$f":"IF(fimTurma!D15<>\"\",fimTurma!D15,\"\")","v":14},{"$f":"IF(AND(fimTurma!F$2<>\"\",fimTurma!F15<>\"\"),(fimTurma!F15-fimTurma!F$1)/fimTurma!F$2,\"\")","v":-0.34528453656689068},{"$f":"IF(AND(fimTurma!G$2<>\"\",fimTurma!G15<>\"\"),(fimTurma!G15-fimTurma!G$1)/fimTurma!G$2,\"\")","v":0.96225044864937626},{"$f":"IF(AND(fimTurma!H$2<>\"\",fimTurma!H15<>\"\"),(fimTurma!H15-fimTurma!H$1)/fimTurma!H$2,\"\")","v":-0.27290567271326566},{"$f":"IF(AND(fimTurma!I$2<>\"\",fimTurma!I15<>\"\"),(fimTurma!I15-fimTurma!I$1)/fimTurma!I$2,\"\")","v":-0.75643697835966883},{"$f":"IF(AND(fimTurma!J$2<>\"\",fimTurma!J15<>\"\"),(fimTurma!J15-fimTurma!J$1)/fimTurma!J$2,\"\")","v":1.5932550136313832},{"$f":"IF(AND(fimTurma!K$2<>\"\",fimTurma!K15<>\"\"),(fimTurma!K15-fimTurma!K$1)/fimTurma!K$2,\"\")","v":5.226355231630618E-2},{"$f":"IF(AND(fimTurma!L$2<>\"\",fimTurma!L15<>\"\"),(fimTurma!L15-fimTurma!L$1)/fimTurma!L$2,\"\")","v":""},{"$f":"IF(AND(fimTurma!M$2<>\"\",fimTurma!M15<>\"\"),(fimTurma!M15-fimTurma!M$1)/fimTurma!M$2,\"\")","v":""}]
[{"$f":"IF(fimTurma!B16<>\"\",fimTurma!B16,\"\")","v":""},{"$f":"fimTurma!A16","v":13},{"$f":"IF(fimTurma!C16<>\"\",fimTurma!C16,\"\")","v":""},{"$f":"IF(fimTurma!D16<>\"\",fimTurma!D16,\"\")","v":""},{"$f":"IF(AND(fimTurma!F$2<>\"\",fimTurma!F16<>\"\"),(fimTurma!F16-fimTurma!F$1)/fimTurma!F$2,\"\")","v":""},{"$f":"IF(AND(fimTurma!G$2<>\"\",fimTurma!G16<>\"\"),(fimTurma!G16-fimTurma!G$1)/fimTurma!G$2,\"\")","v":""},{"$f":"IF(AND(fimTurma!H$2<>\"\",fimTurma!H16<>\"\"),(fimTurma!H16-fimTurma!H$1)/fimTurma!H$2,\"\")","v":""},{"$f":"IF(AND(fimTurma!I$2<>\"\",fimTurma!I16<>\"\"),(fimTurma!I16-fimTurma!I$1)/fimTurma!I$2,\"\")","v":""},{"$f":"IF(AND(fimTurma!J$2<>\"\",fimTurma!J16<>\"\"),(fimTurma!J16-fimTurma!J$1)/fimTurma!J$2,\"\")","v":""},{"$f":"IF(AND(fimTurma!K$2<>\"\",fimTurma!K16<>\"\"),(fimTurma!K16-fimTurma!K$1)/fimTurma!K$2,\"\")","v":""},{"$f":"IF(AND(fimTurma!L$2<>\"\",fimTurma!L16<>\"\"),(fimTurma!L16-fimTurma!L$1)/fimTurma!L$2,\"\")","v":""},{"$f":"IF(AND(fimTurma!M$2<>\"\",fimTurma!M16<>\"\"),(fimTurma!M16-fimTurma!M$1)/fimTurma!M$2,\"\")","v":""}]
[{"$f":"IF(fimTurma!B17<>\"\",fimTurma!B17,\"\")","v":""},{"$f":"fimTurma!A17","v":14},{"$f":"IF(fimTurma!C17<>\"\",fimTurma!C17,\"\")","v":""},{"$f":"IF(fimTurma!D17<>\"\",fimTurma!D17,\"\")","v":""},{"$f":"IF(AND(fimTurma!F$2<>\"\",fimTurma!F17<>\"\"),(fimTurma!F17-fimTurma!F$1)/fimTurma!F$2,\"\")","v":""},{"$f":"IF(AND(fimTurma!G$2<>\"\",fimTurma!G17<>\"\"),(fimTurma!G17-fimTurma!G$1)/fimTurma!G$2,\"\")","v":""},{"$f":"IF(AND(fimTurma!H$2<>\"\",fimTurma!H17<>\"\"),(fimTurma!H17-fimTurma!H$1)/fimTurma!H$2,\"\")","v":""},{"$f":"IF(AND(fimTurma!I$2<>\"\",fimTurma!I17<>\"\"),(fimTurma!I17-fimTurma!I$1)/fimTurma!I$2,\"\")","v":""},{"$f":"IF(AND(fimTurma!J$2<>\"\",fimTurma!J17<>\"\"),(fimTurma!J17-fimTurma!J$1)/fimTurma!J$2,\"\")","v":""},{"$f":"IF(AND(fimTurma!K$2<>\"\",fimTurma!K17<>\"\"),(fimTurma!K17-fimTurma!K$1)/fimTurma!K$2,\"\")","v":""},{"$f":"IF(AND(fimTurma!L$2<>\"\",fimTurma!L17<>\"\"),(fimTurma!L17-fimTurma!L$1)/fimTurma!L$2,\"\")","v":""},{"$f":"IF(AND(fimTurma!M$2<>\"\",fimTurma!M17<>\"\"),(fimTurma!M17-fimTurma!M$1)/fimTurma!M$2,\"\")","v":""}]
[{"$f":"IF(fimTurma!B18<>\"\",fimTurma!B18,\"\")","v":""},{"$f":"fimTurma!A18","v":15},{"$f":"IF(fimTurma!C18<>\"\",fimTurma!C18,\"\")","v":""},{"$f":"IF(fimTurma!D18<>\"\",fimTurma!D18,\"\")","v":""},{"$f":"IF(AND(fimTurma!F$2<>\"\",fimTurma!F18<>\"\"),(fimTurma!F18-fimTurma!F$1)/fimTurma!F$2,\"\")","v":""},{"$f":"IF(AND(fimTurma!G$2<>\"\",fimTurma!G18<>\"\"),(fimTurma!G18-fimTurma!G$1)/fimTurma!G$2,\"\")","v":""},{"$f":"IF(AND(fimTurma!H$2<>\"\",fimTurma!H18<>\"\"),(fimTurma!H18-fimTurma!H$1)/fimTurma!H$2,\"\")","v":""},{"$f":"IF(AND(fimTurma!I$2<>\"\",fimTurma!I18<>\"\"),(fimTurma!I18-fimTurma!I$1)/fimTurma!I$2,\"\")","v":""},{"$f":"IF(AND(fimTurma!J$2<>\"\",fimTurma!J18<>\"\"),(fimTurma!J18-fimTurma!J$1)/fimTurma!J$2,\"\")","v":""},{"$f":"IF(AND(fimTurma!K$2<>\"\",fimTurma!K18<>\"\"),(fimTurma!K18-fimTurma!K$1)/fimTurma!K$2,\"\")","v":""},{"$f":"IF(AND(fimTurma!L$2<>\"\",fimTurma!L18<>\"\"),(fimTurma!L18-fimTurma!L$1)/fimTurma!L$2,\"\")","v":""},{"$f":"IF(AND(fimTurma!M$2<>\"\",fimTurma!M18<>\"\"),(fimTurma!M18-fimTurma!M$1)/fimTurma!M$2,\"\")","v":""}]
[{"$f":"IF(fimTurma!B19<>\"\",fimTurma!B19,\"\")","v":""},{"$f":"fimTurma!A19","v":16},{"$f":"IF(fimTurma!C19<>\"\",fimTurma!C19,\"\")","v":""},{"$f":"IF(fimTurma!D19<>\"\",fimTurma!D19,\"\")","v":""},{"$f":"IF(AND(fimTurma!F$2<>\"\",fimTurma!F19<>\"\"),(fimTurma!F19-fimTurma!F$1)/fimTurma!F$2,\"\")","v":""},{"$f":"IF(AND(fimTurma!G$2<>\"\",fimTurma!G19<>\"\"),(fimTurma!G19-fimTurma!G$1)/fimTurma!G$2,\"\")","v":""},{"$f":"IF(AND(fimTurma!H$2<>\"\",fimTurma!H19<>\"\"),(fimTurma!H19-fimTurma!H$1)/fimTurma!H$2,\"\")","v":""},{"$f":"IF(AND(fimTurma!I$2<>\"\",fimTurma!I19<>\"\"),(fimTurma!I19-fimTurma!I$1)/fimTurma!I$2,\"\")","v":""},{"$f":"IF(AND(fimTurma!J$2<>\"\",fimTurma!J19<>\"\"),(fimTurma!J19-fimTurma!J$1)/fimTurma!J$2,\"\")","v":""},{"$f":"IF(AND(fimTurma!K$2<>\"\",fimTurma!K19<>\"\"),(fimTurma!K19-fimTurma!K$1)/fimTurma!K$2,\"\")","v":""},{"$f":"IF(AND(fimTurma!L$2<>\"\",fimTurma!L19<>\"\"),(fimTurma!L19-fimTurma!L$1)/fimTurma!L$2,\"\")","v":""},{"$f":"IF(AND(fimTurma!M$2<>\"\",fimTurma!M19<>\"\"),(fimTurma!M19-fimTurma!M$1)/fimTurma!M$2,\"\")","v":""}]
[{"$f":"IF(fimTurma!B20<>\"\",fimTurma!B20,\"\")","v":""},{"$f":"fimTurma!A20","v":17},{"$f":"IF(fimTurma!C20<>\"\",fimTurma!C20,\"\")","v":""},{"$f":"IF(fimTurma!D20<>\"\",fimTurma!D20,\"\")","v":""},{"$f":"IF(AND(fimTurma!F$2<>\"\",fimTurma!F20<>\"\"),(fimTurma!F20-fimTurma!F$1)/fimTurma!F$2,\"\")","v":""},{"$f":"IF(AND(fimTurma!G$2<>\"\",fimTurma!G20<>\"\"),(fimTurma!G20-fimTurma!G$1)/fimTurma!G$2,\"\")","v":""},{"$f":"IF(AND(fimTurma!H$2<>\"\",fimTurma!H20<>\"\"),(fimTurma!H20-fimTurma!H$1)/fimTurma!H$2,\"\")","v":""},{"$f":"IF(AND(fimTurma!I$2<>\"\",fimTurma!I20<>\"\"),(fimTurma!I20-fimTurma!I$1)/fimTurma!I$2,\"\")","v":""},{"$f":"IF(AND(fimTurma!J$2<>\"\",fimTurma!J20<>\"\"),(fimTurma!J20-fimTurma!J$1)/fimTurma!J$2,\"\")","v":""},{"$f":"IF(AND(fimTurma!K$2<>\"\",fimTurma!K20<>\"\"),(fimTurma!K20-fimTurma!K$1)/fimTurma!K$2,\"\")","v":""},{"$f":"IF(AND(fimTurma!L$2<>\"\",fimTurma!L20<>\"\"),(fimTurma!L20-fimTurma!L$1)/fimTurma!L$2,\"\")","v":""},{"$f":"IF(AND(fimTurma!M$2<>\"\",fimTurma!M20<>\"\"),(fimTurma!M20-fimTurma!M$1)/fimTurma!M$2,\"\")","v":""}]
[{"$f":"IF(fimTurma!B21<>\"\",fimTurma!B21,\"\")","v":""},{"$f":"fimTurma!A21","v":18},{"$f":"IF(fimTurma!C21<>\"\",fimTurma!C21,\"\")","v":""},{"$f":"IF(fimTurma!D21<>\"\",fimTurma!D21,\"\")","v":""},{"$f":"IF(AND(fimTurma!F$2<>\"\",fimTurma!F21<>\"\"),(fimTurma!F21-fimTurma!F$1)/fimTurma!F$2,\"\")","v":""},{"$f":"IF(AND(fimTurma!G$2<>\"\",fimTurma!G21<>\"\"),(fimTurma!G21-fimTurma!G$1)/fimTurma!G$2,\"\")","v":""},{"$f":"IF(AND(fimTurma!H$2<>\"\",fimTurma!H21<>\"\"),(fimTurma!H21-fimTurma!H$1)/fimTurma!H$2,\"\")","v":""},{"$f":"IF(AND(fimTurma!I$2<>\"\",fimTurma!I21<>\"\"),(fimTurma!I21-fimTurma!I$1)/fimTurma!I$2,\"\")","v":""},{"$f":"IF(AND(fimTurma!J$2<>\"\",fimTurma!J21<>\"\"),(fimTurma!J21-fimTurma!J$1)/fimTurma!J$2,\"\")","v":""},{"$f":"IF(AND(fimTurma!K$2<>\"\",fimTurma!K21<>\"\"),(fimTurma!K21-fimTurma!K$1)/fimTurma!K$2,\"\")","v":""},{"$f":"IF(AND(fimTurma!L$2<>\"\",fimTurma!L21<>\"\"),(fimTurma!L21-fimTurma!L$1)/fimTurma!L$2,\"\")","v":""},{"$f":"IF(AND(fimTurma!M$2<>\"\",fimTurma!M21<>\"\"),(fimTurma!M21-fimTurma!M$1)/fimTurma!M$2,\"\")","v":""}]
[{"$f":"IF(fimTurma!B22<>\"\",fimTurma!B22,\"\")","v":""},{"$f":"fimTurma!A22","v":19},{"$f":"IF(fimTurma!C22<>\"\",fimTurma!C22,\"\")","v":""},{"$f":"IF(fimTurma!D22<>\"\",fimTurma!D22,\"\")","v":""},{"$f":"IF(AND(fimTurma!F$2<>\"\",fimTurma!F22<>\"\"),(fimTurma!F22-fimTurma!F$1)/fimTurma!F$2,\"\")","v":""},{"$f":"IF(AND(fimTurma!G$2<>\"\",fimTurma!G22<>\"\"),(fimTurma!G22-fimTurma!G$1)/fimTurma!G$2,\"\")","v":""},{"$f":"IF(AND(fimTurma!H$2<>\"\",fimTurma!H22<>\"\"),(fimTurma!H22-fimTurma!H$1)/fimTurma!H$2,\"\")","v":""},{"$f":"IF(AND(fimTurma!I$2<>\"\",fimTurma!I22<>\"\"),(fimTurma!I22-fimTurma!I$1)/fimTurma!I$2,\"\")","v":""},{"$f":"IF(AND(fimTurma!J$2<>\"\",fimTurma!J22<>\"\"),(fimTurma!J22-fimTurma!J$1)/fimTurma!J$2,\"\")","v":""},{"$f":"IF(AND(fimTurma!K$2<>\"\",fimTurma!K22<>\"\"),(fimTurma!K22-fimTurma!K$1)/fimTurma!K$2,\"\")","v":""},{"$f":"IF(AND(fimTurma!L$2<>\"\",fimTurma!L22<>\"\"),(fimTurma!L22-fimTurma!L$1)/fimTurma!L$2,\"\")","v":""},{"$f":"IF(AND(fimTurma!M$2<>\"\",fimTurma!M22<>\"\"),(fimTurma!M22-fimTurma!M$1)/fimTurma!M$2,\"\")","v":""}]
[{"$f":"IF(fimTurma!B23<>\"\",fimTurma!B23,\"\")","v":""},{"$f":"fimTurma!A23","v":20},{"$f":"IF(fimTurma!C23<>\"\",fimTurma!C23,\"\")","v":""},{"$f":"IF(fimTurma!D23<>\"\",fimTurma!D23,\"\")","v":""},{"$f":"IF(AND(fimTurma!F$2<>\"\",fimTurma!F23<>\"\"),(fimTurma!F23-fimTurma!F$1)/fimTurma!F$2,\"\")","v":""},{"$f":"IF(AND(fimTurma!G$2<>\"\",fimTurma!G23<>\"\"),(fimTurma!G23-fimTurma!G$1)/fimTurma!G$2,\"\")","v":""},{"$f":"IF(AND(fimTurma!H$2<>\"\",fimTurma!H23<>\"\"),(fimTurma!H23-fimTurma!H$1)/fimTurma!H$2,\"\")","v":""},{"$f":"IF(AND(fimTurma!I$2<>\"\",fimTurma!I23<>\"\"),(fimTurma!I23-fimTurma!I$1)/fimTurma!I$2,\"\")","v":""},{"$f":"IF(AND(fimTurma!J$2<>\"\",fimTurma!J23<>\"\"),(fimTurma!J23-fimTurma!J$1)/fimTurma!J$2,\"\")","v":""},{"$f":"IF(AND(fimTurma!K$2<>\"\",fimTurma!K23<>\"\"),(fimTurma!K23-fimTurma!K$1)/fimTurma!K$2,\"\")","v":""},{"$f":"IF(AND(fimTurma!L$2<>\"\",fimTurma!L23<>\"\"),(fimTurma!L23-fimTurma!L$1)/fimTurma!L$2,\"\")","v":""},{"$f":"IF(AND(fimTurma!M$2<>\"\",fimTurma!M23<>\"\"),(fimTurma!M23-fimTurma!M$1)/fimTurma!M$2,\"\")","v":""}]
[{"$f":"IF(fimTurma!B24<>\"\",fimTurma!B24,\"\")","v":""},{"$f":"fimTurma!A24","v":21},{"$f":"IF(fimTurma!C24<>\"\",fimTurma!C24,\"\")","v":""},{"$f":"IF(fimTurma!D24<>\"\",fimTurma!D24,\"\")","v":""},{"$f":"IF(AND(fimTurma!F$2<>\"\",fimTurma!F24<>\"\"),(fimTurma!F24-fimTurma!F$1)/fimTurma!F$2,\"\")","v":""},{"$f":"IF(AND(fimTurma!G$2<>\"\",fimTurma!G24<>\"\"),(fimTurma!G24-fimTurma!G$1)/fimTurma!G$2,\"\")","v":""},{"$f":"IF(AND(fimTurma!H$2<>\"\",fimTurma!H24<>\"\"),(fimTurma!H24-fimTurma!H$1)/fimTurma!H$2,\"\")","v":""},{"$f":"IF(AND(fimTurma!I$2<>\"\",fimTurma!I24<>\"\"),(fimTurma!I24-fimTurma!I$1)/fimTurma!I$2,\"\")","v":""},{"$f":"IF(AND(fimTurma!J$2<>\"\",fimTurma!J24<>\"\"),(fimTurma!J24-fimTurma!J$1)/fimTurma!J$2,\"\")","v":""},{"$f":"IF(AND(fimTurma!K$2<>\"\",fimTurma!K24<>\"\"),(fimTurma!K24-fimTurma!K$1)/fimTurma!K$2,\"\")","v":""},{"$f":"IF(AND(fimTurma!L$2<>\"\",fimTurma!L24<>\"\"),(fimTurma!L24-fimTurma!L$1)/fimTurma!L$2,\"\")","v":""},{"$f":"IF(AND(fimTurma!M$2<>\"\",fimTurma!M24<>\"\"),(fimTurma!M24-fimTurma!M$1)/fimTurma!M$2,\"\")","v":""}]
[{"$f":"IF(fimTurma!B25<>\"\",fimTurma!B25,\"\")","v":""},{"$f":"fimTurma!A25","v":22},{"$f":"IF(fimTurma!C25<>\"\",fimTurma!C25,\"\")","v":""},{"$f":"IF(fimTurma!D25<>\"\",fimTurma!D25,\"\")","v":""},{"$f":"IF(AND(fimTurma!F$2<>\"\",fimTurma!F25<>\"\"),(fimTurma!F25-fimTurma!F$1)/fimTurma!F$2,\"\")","v":""},{"$f":"IF(AND(fimTurma!G$2<>\"\",fimTurma!G25<>\"\"),(fimTurma!G25-fimTurma!G$1)/fimTurma!G$2,\"\")","v":""},{"$f":"IF(AND(fimTurma!H$2<>\"\",fimTurma!H25<>\"\"),(fimTurma!H25-fimTurma!H$1)/fimTurma!H$2,\"\")","v":""},{"$f":"IF(AND(fimTurma!I$2<>\"\",fimTurma!I25<>\"\"),(fimTurma!I25-fimTurma!I$1)/fimTurma!I$2,\"\")","v":""},{"$f":"IF(AND(fimTurma!J$2<>\"\",fimTurma!J25<>\"\"),(fimTurma!J25-fimTurma!J$1)/fimTurma!J$2,\"\")","v":""},{"$f":"IF(AND(fimTurma!K$2<>\"\",fimTurma!K25<>\"\"),(fimTurma!K25-fimTurma!K$1)/fimTurma!K$2,\"\")","v":""},{"$f":"IF(AND(fimTurma!L$2<>\"\",fimTurma!L25<>\"\"),(fimTurma!L25-fimTurma!L$1)/fimTurma!L$2,\"\")","v":""},{"$f":"IF(AND(fimTurma!M$2<>\"\",fimTurma!M25<>\"\"),(fimTurma!M25-fimTurma!M$1)/fimTurma!M$2,\"\")","v":""}]
[{"$f":"IF(fimTurma!B26<>\"\",fimTurma!B26,\"\")","v":""},{"$f":"fimTurma!A26","v":23},{"$f":"IF(fimTurma!C26<>\"\",fimTurma!C26,\"\")","v":""},{"$f":"IF(fimTurma!D26<>\"\",fimTurma!D26,\"\")","v":""},{"$f":"IF(AND(fimTurma!F$2<>\"\",fimTurma!F26<>\"\"),(fimTurma!F26-fimTurma!F$1)/fimTurma!F$2,\"\")","v":""},{"$f":"IF(AND(fimTurma!G$2<>\"\",fimTurma!G26<>\"\"),(fimTurma!G26-fimTurma!G$1)/fimTurma!G$2,\"\")","v":""},{"$f":"IF(AND(fimTurma!H$2<>\"\",fimTurma!H26<>\"\"),(fimTurma!H26-fimTurma!H$1)/fimTurma!H$2,\"\")","v":""},{"$f":"IF(AND(fimTurma!I$2<>\"\",fimTurma!I26<>\"\"),(fimTurma!I26-fimTurma!I$1)/fimTurma!I$2,\"\")","v":""},{"$f":"IF(AND(fimTurma!J$2<>\"\",fimTurma!J26<>\"\"),(fimTurma!J26-fimTurma!J$1)/fimTurma!J$2,\"\")","v":""},{"$f":"IF(AND(fimTurma!K$2<>\"\",fimTurma!K26<>\"\"),(fimTurma!K26-fimTurma!K$1)/fimTurma!K$2,\"\")","v":""},{"$f":"IF(AND(fimTurma!L$2<>\"\",fimTurma!L26<>\"\"),(fimTurma!L26-fimTurma!L$1)/fimTurma!L$2,\"\")","v":""},{"$f":"IF(AND(fimTurma!M$2<>\"\",fimTurma!M26<>\"\"),(fimTurma!M26-fimTurma!M$1)/fimTurma!M$2,\"\")","v":""}]
[{"$f":"IF(fimTurma!B27<>\"\",fimTurma!B27,\"\")","v":""},{"$f":"fimTurma!A27","v":24},{"$f":"IF(fimTurma!C27<>\"\",fimTurma!C27,\"\")","v":""},{"$f":"IF(fimTurma!D27<>\"\",fimTurma!D27,\"\")","v":""},{"$f":"IF(AND(fimTurma!F$2<>\"\",fimTurma!F27<>\"\"),(fimTurma!F27-fimTurma!F$1)/fimTurma!F$2,\"\")","v":""},{"$f":"IF(AND(fimTurma!G$2<>\"\",fimTurma!G27<>\"\"),(fimTurma!G27-fimTurma!G$1)/fimTurma!G$2,\"\")","v":""},{"$f":"IF(AND(fimTurma!H$2<>\"\",fimTurma!H27<>\"\"),(fimTurma!H27-fimTurma!H$1)/fimTurma!H$2,\"\")","v":""},{"$f":"IF(AND(fimTurma!I$2<>\"\",fimTurma!I27<>\"\"),(fimTurma!I27-fimTurma!I$1)/fimTurma!I$2,\"\")","v":""},{"$f":"IF(AND(fimTurma!J$2<>\"\",fimTurma!J27<>\"\"),(fimTurma!J27-fimTurma!J$1)/fimTurma!J$2,\"\")","v":""},{"$f":"IF(AND(fimTurma!K$2<>\"\",fimTurma!K27<>\"\"),(fimTurma!K27-fimTurma!K$1)/fimTurma!K$2,\"\")","v":""},{"$f":"IF(AND(fimTurma!L$2<>\"\",fimTurma!L27<>\"\"),(fimTurma!L27-fimTurma!L$1)/fimTurma!L$2,\"\")","v":""},{"$f":"IF(AND(fimTurma!M$2<>\"\",fimTurma!M27<>\"\"),(fimTurma!M27-fimTurma!M$1)/fimTurma!M$2,\"\")","v":""}]
[{"$f":"IF(fimTurma!B28<>\"\",fimTurma!B28,\"\")","v":""},{"$f":"fimTurma!A28","v":25},{"$f":"IF(fimTurma!C28<>\"\",fimTurma!C28,\"\")","v":""},{"$f":"IF(fimTurma!D28<>\"\",fimTurma!D28,\"\")","v":""},{"$f":"IF(AND(fimTurma!F$2<>\"\",fimTurma!F28<>\"\"),(fimTurma!F28-fimTurma!F$1)/fimTurma!F$2,\"\")","v":""},{"$f":"IF(AND(fimTurma!G$2<>\"\",fimTurma!G28<>\"\"),(fimTurma!G28-fimTurma!G$1)/fimTurma!G$2,\"\")","v":""},{"$f":"IF(AND(fimTurma!H$2<>\"\",fimTurma!H28<>\"\"),(fimTurma!H28-fimTurma!H$1)/fimTurma!H$2,\"\")","v":""},{"$f":"IF(AND(fimTurma!I$2<>\"\",fimTurma!I28<>\"\"),(fimTurma!I28-fimTurma!I$1)/fimTurma!I$2,\"\")","v":""},{"$f":"IF(AND(fimTurma!J$2<>\"\",fimTurma!J28<>\"\"),(fimTurma!J28-fimTurma!J$1)/fimTurma!J$2,\"\")","v":""},{"$f":"IF(AND(fimTurma!K$2<>\"\",fimTurma!K28<>\"\"),(fimTurma!K28-fimTurma!K$1)/fimTurma!K$2,\"\")","v":""},{"$f":"IF(AND(fimTurma!L$2<>\"\",fimTurma!L28<>\"\"),(fimTurma!L28-fimTurma!L$1)/fimTurma!L$2,\"\")","v":""},{"$f":"IF(AND(fimTurma!M$2<>\"\",fimTurma!M28<>\"\"),(fimTurma!M28-fimTurma!M$1)/fimTurma!M$2,\"\")","v":""}]
[{"$f":"IF(fimTurma!B29<>\"\",fimTurma!B29,\"\")","v":""},{"$f":"fimTurma!A29","v":26},{"$f":"IF(fimTurma!C29<>\"\",fimTurma!C29,\"\")","v":""},{"$f":"IF(fimTurma!D29<>\"\",fimTurma!D29,\"\")","v":""},{"$f":"IF(AND(fimTurma!F$2<>\"\",fimTurma!F29<>\"\"),(fimTurma!F29-fimTurma!F$1)/fimTurma!F$2,\"\")","v":""},{"$f":"IF(AND(fimTurma!G$2<>\"\",fimTurma!G29<>\"\"),(fimTurma!G29-fimTurma!G$1)/fimTurma!G$2,\"\")","v":""},{"$f":"IF(AND(fimTurma!H$2<>\"\",fimTurma!H29<>\"\"),(fimTurma!H29-fimTurma!H$1)/fimTurma!H$2,\"\")","v":""},{"$f":"IF(AND(fimTurma!I$2<>\"\",fimTurma!I29<>\"\"),(fimTurma!I29-fimTurma!I$1)/fimTurma!I$2,\"\")","v":""},{"$f":"IF(AND(fimTurma!J$2<>\"\",fimTurma!J29<>\"\"),(fimTurma!J29-fimTurma!J$1)/fimTurma!J$2,\"\")","v":""},{"$f":"IF(AND(fimTurma!K$2<>\"\",fimTurma!K29<>\"\"),(fimTurma!K29-fimTurma!K$1)/fimTurma!K$2,\"\")","v":""},{"$f":"IF(AND(fimTurma!L$2<>\"\",fimTurma!L29<>\"\"),(fimTurma!L29-fimTurma!L$1)/fimTurma!L$2,\"\")","v":""},{"$f":"IF(AND(fimTurma!M$2<>\"\",fimTurma!M29<>\"\"),(fimTurma!M29-fimTurma!M$1)/fimTurma!M$2,\"\")","v":""}]
[{"$f":"IF(fimTurma!B30<>\"\",fimTurma!B30,\"\")","v":""},{"$f":"fimTurma!A30","v":27},{"$f":"IF(fimTurma!C30<>\"\",fimTurma!C30,\"\")","v":""},{"$f":"IF(fimTurma!D30<>\"\",fimTurma!D30,\"\")","v":""},{"$f":"IF(AND(fimTurma!F$2<>\"\",fimTurma!F30<>\"\"),(fimTurma!F30-fimTurma!F$1)/fimTurma!F$2,\"\")","v":""},{"$f":"IF(AND(fimTurma!G$2<>\"\",fimTurma!G30<>\"\"),(fimTurma!G30-fimTurma!G$1)/fimTurma!G$2,\"\")","v":""},{"$f":"IF(AND(fimTurma!H$2<>\"\",fimTurma!H30<>\"\"),(fimTurma!H30-fimTurma!H$1)/fimTurma!H$2,\"\")","v":""},{"$f":"IF(AND(fimTurma!I$2<>\"\",fimTurma!I30<>\"\"),(fimTurma!I30-fimTurma!I$1)/fimTurma!I$2,\"\")","v":""},{"$f":"IF(AND(fimTurma!J$2<>\"\",fimTurma!J30<>\"\"),(fimTurma!J30-fimTurma!J$1)/fimTurma!J$2,\"\")","v":""},{"$f":"IF(AND(fimTurma!K$2<>\"\",fimTurma!K30<>\"\"),(fimTurma!K30-fimTurma!K$1)/fimTurma!K$2,\"\")","v":""},{"$f":"IF(AND(fimTurma!L$2<>\"\",fimTurma!L30<>\"\"),(fimTurma!L30-fimTurma!L$1)/fimTurma!L$2,\"\")","v":""},{"$f":"IF(AND(fimTurma!M$2<>\"\",fimTurma!M30<>\"\"),(fimTurma!M30-fimTurma!M$1)/fimTurma!M$2,\"\")","v":""}]
[{"$f":"IF(fimTurma!B31<>\"\",fimTurma!B31,\"\")","v":""},{"$f":"fimTurma!A31","v":28},{"$f":"IF(fimTurma!C31<>\"\",fimTurma!C31,\"\")","v":""},{"$f":"IF(fimTurma!D31<>\"\",fimTurma!D31,\"\")","v":""},{"$f":"IF(AND(fimTurma!F$2<>\"\",fimTurma!F31<>\"\"),(fimTurma!F31-fimTurma!F$1)/fimTurma!F$2,\"\")","v":""},{"$f":"IF(AND(fimTurma!G$2<>\"\",fimTurma!G31<>\"\"),(fimTurma!G31-fimTurma!G$1)/fimTurma!G$2,\"\")","v":""},{"$f":"IF(AND(fimTurma!H$2<>\"\",fimTurma!H31<>\"\"),(fimTurma!H31-fimTurma!H$1)/fimTurma!H$2,\"\")","v":""},{"$f":"IF(AND(fimTurma!I$2<>\"\",fimTurma!I31<>\"\"),(fimTurma!I31-fimTurma!I$1)/fimTurma!I$2,\"\")","v":""},{"$f":"IF(AND(fimTurma!J$2<>\"\",fimTurma!J31<>\"\"),(fimTurma!J31-fimTurma!J$1)/fimTurma!J$2,\"\")","v":""},{"$f":"IF(AND(fimTurma!K$2<>\"\",fimTurma!K31<>\"\"),(fimTurma!K31-fimTurma!K$1)/fimTurma!K$2,\"\")","v":""},{"$f":"IF(AND(fimTurma!L$2<>\"\",fimTurma!L31<>\"\"),(fimTurma!L31-fimTurma!L$1)/fimTurma!L$2,\"\")","v":""},{"$f":"IF(AND(fimTurma!M$2<>\"\",fimTurma!M31<>\"\"),(fimTurma!M31-fimTurma!M$1)/fimTurma!M$2,\"\")","v":""}]
[{"$f":"IF(fimTurma!B32<>\"\",fimTurma!B32,\"\")","v":""},{"$f":"fimTurma!A32","v":29},{"$f":"IF(fimTurma!C32<>\"\",fimTurma!C32,\"\")","v":""},{"$f":"IF(fimTurma!D32<>\"\",fimTurma!D32,\"\")","v":""},{"$f":"IF(AND(fimTurma!F$2<>\"\",fimTurma!F32<>\"\"),(fimTurma!F32-fimTurma!F$1)/fimTurma!F$2,\"\")","v":""},{"$f":"IF(AND(fimTurma!G$2<>\"\",fimTurma!G32<>\"\"),(fimTurma!G32-fimTurma!G$1)/fimTurma!G$2,\"\")","v":""},{"$f":"IF(AND(fimTurma!H$2<>\"\",fimTurma!H32<>\"\"),(fimTurma!H32-fimTurma!H$1)/fimTurma!H$2,\"\")","v":""},{"$f":"IF(AND(fimTurma!I$2<>\"\",fimTurma!I32<>\"\"),(fimTurma!I32-fimTurma!I$1)/fimTurma!I$2,\"\")","v":""},{"$f":"IF(AND(fimTurma!J$2<>\"\",fimTurma!J32<>\"\"),(fimTurma!J32-fimTurma!J$1)/fimTurma!J$2,\"\")","v":""},{"$f":"IF(AND(fimTurma!K$2<>\"\",fimTurma!K32<>\"\"),(fimTurma!K32-fimTurma!K$1)/fimTurma!K$2,\"\")","v":""},{"$f":"IF(AND(fimTurma!L$2<>\"\",fimTurma!L32<>\"\"),(fimTurma!L32-fimTurma!L$1)/fimTurma!L$2,\"\")","v":""},{"$f":"IF(AND(fimTurma!M$2<>\"\",fimTurma!M32<>\"\"),(fimTurma!M32-fimTurma!M$1)/fimTurma!M$2,\"\")","v":""}]
[{"$f":"IF(fimTurma!B33<>\"\",fimTurma!B33,\"\")","v":""},{"$f":"fimTurma!A33","v":30},{"$f":"IF(fimTurma!C33<>\"\",fimTurma!C33,\"\")","v":""},{"$f":"IF(fimTurma!D33<>\"\",fimTurma!D33,\"\")","v":""},{"$f":"IF(AND(fimTurma!F$2<>\"\",fimTurma!F33<>\"\"),(fimTurma!F33-fimTurma!F$1)/fimTurma!F$2,\"\")","v":""},{"$f":"IF(AND(fimTurma!G$2<>\"\",fimTurma!G33<>\"\"),(fimTurma!G33-fimTurma!G$1)/fimTurma!G$2,\"\")","v":""},{"$f":"IF(AND(fimTurma!H$2<>\"\",fimTurma!H33<>\"\"),(fimTurma!H33-fimTurma!H$1)/fimTurma!H$2,\"\")","v":""},{"$f":"IF(AND(fimTurma!I$2<>\"\",fimTurma!I33<>\"\"),(fimTurma!I33-fimTurma!I$1)/fimTurma!I$2,\"\")","v":""},{"$f":"IF(AND(fimTurma!J$2<>\"\",fimTurma!J33<>\"\"),(fimTurma!J33-fimTurma!J$1)/fimTurma!J$2,\"\")","v":""},{"$f":"IF(AND(fimTurma!K$2<>\"\",fimTurma!K33<>\"\"),(fimTurma!K33-fimTurma!K$1)/fimTurma!K$2,\"\")","v":""},{"$f":"IF(AND(fimTurma!L$2<>\"\",fimTurma!L33<>\"\"),(fimTurma!L33-fimTurma!L$1)/fimTurma!L$2,\"\")","v":""},{"$f":"IF(AND(fimTurma!M$2<>\"\",fimTurma!M33<>\"\"),(fimTurma!M33-fimTurma!M$1)/fimTurma!M$2,\"\")","v":""}]
[{"$f":"IF(fimTurma!B34<>\"\",fimTurma!B34,\"\")","v":""},{"$f":"fimTurma!A34","v":31},{"$f":"IF(fimTurma!C34<>\"\",fimTurma!C34,\"\")","v":""},{"$f":"IF(fimTurma!D34<>\"\",fimTurma!D34,\"\")","v":""},{"$f":"IF(AND(fimTurma!F$2<>\"\",fimTurma!F34<>\"\"),(fimTurma!F34-fimTurma!F$1)/fimTurma!F$2,\"\")","v":""},{"$f":"IF(AND(fimTurma!G$2<>\"\",fimTurma!G34<>\"\"),(fimTurma!G34-fimTurma!G$1)/fimTurma!G$2,\"\")","v":""},{"$f":"IF(AND(fimTurma!H$2<>\"\",fimTurma!H34<>\"\"),(fimTurma!H34-fimTurma!H$1)/fimTurma!H$2,\"\")","v":""},{"$f":"IF(AND(fimTurma!I$2<>\"\",fimTurma!I34<>\"\"),(fimTurma!I34-fimTurma!I$1)/fimTurma!I$2,\"\")","v":""},{"$f":"IF(AND(fimTurma!J$2<>\"\",fimTurma!J34<>\"\"),(fimTurma!J34-fimTurma!J$1)/fimTurma!J$2,\"\")","v":""},{"$f":"IF(AND(fimTurma!K$2<>\"\",fimTurma!K34<>\"\"),(fimTurma!K34-fimTurma!K$1)/fimTurma!K$2,\"\")","v":""},{"$f":"IF(AND(fimTurma!L$2<>\"\",fimTurma!L34<>\"\"),(fimTurma!L34-fimTurma!L$1)/fimTurma!L$2,\"\")","v":""},{"$f":"IF(AND(fimTurma!M$2<>\"\",fimTurma!M34<>\"\"),(fimTurma!M34-fimTurma!M$1)/fimTurma!M$2,\"\")","v":""}]
[{"$f":"IF(fimTurma!B35<>\"\",fimTurma!B35,\"\")","v":""},{"$f":"fimTurma!A35","v":32},{"$f":"IF(fimTurma!C35<>\"\",fimTurma!C35,\"\")","v":""},{"$f":"IF(fimTurma!D35<>\"\",fimTurma!D35,\"\")","v":""},{"$f":"IF(AND(fimTurma!F$2<>\"\",fimTurma!F35<>\"\"),(fimTurma!F35-fimTurma!F$1)/fimTurma!F$2,\"\")","v":""},{"$f":"IF(AND(fimTurma!G$2<>\"\",fimTurma!G35<>\"\"),(fimTurma!G35-fimTurma!G$1)/fimTurma!G$2,\"\")","v":""},{"$f":"IF(AND(fimTurma!H$2<>\"\",fimTurma!H35<>\"\"),(fimTurma!H35-fimTurma!H$1)/fimTurma!H$2,\"\")","v":""},{"$f":"IF(AND(fimTurma!I$2<>\"\",fimTurma!I35<>\"\"),(fimTurma!I35-fimTurma!I$1)/fimTurma!I$2,\"\")","v":""},{"$f":"IF(AND(fimTurma!J$2<>\"\",fimTurma!J35<>\"\"),(fimTurma!J35-fimTurma!J$1)/fimTurma!J$2,\"\")","v":""},{"$f":"IF(AND(fimTurma!K$2<>\"\",fimTurma!K35<>\"\"),(fimTurma!K35-fimTurma!K$1)/fimTurma!K$2,\"\")","v":""},{"$f":"IF(AND(fimTurma!L$2<>\"\",fimTurma!L35<>\"\"),(fimTurma!L35-fimTurma!L$1)/fimTurma!L$2,\"\")","v":""},{"$f":"IF(AND(fimTurma!M$2<>\"\",fimTurma!M35<>\"\"),(fimTurma!M35-fimTurma!M$1)/fimTurma!M$2,\"\")","v":""}]
[{"$f":"IF(fimTurma!B36<>\"\",fimTurma!B36,\"\")","v":""},{"$f":"fimTurma!A36","v":33},{"$f":"IF(fimTurma!C36<>\"\",fimTurma!C36,\"\")","v":""},{"$f":"IF(fimTurma!D36<>\"\",fimTurma!D36,\"\")","v":""},{"$f":"IF(AND(fimTurma!F$2<>\"\",fimTurma!F36<>\"\"),(fimTurma!F36-fimTurma!F$1)/fimTurma!F$2,\"\")","v":""},{"$f":"IF(AND(fimTurma!G$2<>\"\",fimTurma!G36<>\"\"),(fimTurma!G36-fimTurma!G$1)/fimTurma!G$2,\"\")","v":""},{"$f":"IF(AND(fimTurma!H$2<>\"\",fimTurma!H36<>\"\"),(fimTurma!H36-fimTurma!H$1)/fimTurma!H$2,\"\")","v":""},{"$f":"IF(AND(fimTurma!I$2<>\"\",fimTurma!I36<>\"\"),(fimTurma!I36-fimTurma!I$1)/fimTurma!I$2,\"\")","v":""},{"$f":"IF(AND(fimTurma!J$2<>\"\",fimTurma!J36<>\"\"),(fimTurma!J36-fimTurma!J$1)/fimTurma!J$2,\"\")","v":""},{"$f":"IF(AND(fimTurma!K$2<>\"\",fimTurma!K36<>\"\"),(fimTurma!K36-fimTurma!K$1)/fimTurma!K$2,\"\")","v":""},{"$f":"IF(AND(fimTurma!L$2<>\"\",fimTurma!L36<>\"\"),(fimTurma!L36-fimTurma!L$1)/fimTurma!L$2,\"\")","v":""},{"$f":"IF(AND(fimTurma!M$2<>\"\",fimTurma!M36<>\"\"),(fimTurma!M36-fimTurma!M$1)/fimTurma!M$2,\"\")","v":""}]
[{"$f":"IF(fimTurma!B37<>\"\",fimTurma!B37,\"\")","v":""},{"$f":"fimTurma!A37","v":34},{"$f":"IF(fimTurma!C37<>\"\",fimTurma!C37,\"\")","v":""},{"$f":"IF(fimTurma!D37<>\"\",fimTurma!D37,\"\")","v":""},{"$f":"IF(AND(fimTurma!F$2<>\"\",fimTurma!F37<>\"\"),(fimTurma!F37-fimTurma!F$1)/fimTurma!F$2,\"\")","v":""},{"$f":"IF(AND(fimTurma!G$2<>\"\",fimTurma!G37<>\"\"),(fimTurma!G37-fimTurma!G$1)/fimTurma!G$2,\"\")","v":""},{"$f":"IF(AND(fimTurma!H$2<>\"\",fimTurma!H37<>\"\"),(fimTurma!H37-fimTurma!H$1)/fimTurma!H$2,\"\")","v":""},{"$f":"IF(AND(fimTurma!I$2<>\"\",fimTurma!I37<>\"\"),(fimTurma!I37-fimTurma!I$1)/fimTurma!I$2,\"\")","v":""},{"$f":"IF(AND(fimTurma!J$2<>\"\",fimTurma!J37<>\"\"),(fimTurma!J37-fimTurma!J$1)/fimTurma!J$2,\"\")","v":""},{"$f":"IF(AND(fimTurma!K$2<>\"\",fimTurma!K37<>\"\"),(fimTurma!K37-fimTurma!K$1)/fimTurma!K$2,\"\")","v":""},{"$f":"IF(AND(fimTurma!L$2<>\"\",fimTurma!L37<>\"\"),(fimTurma!L37-fimTurma!L$1)/fimTurma!L$2,\"\")","v":""},{"$f":"IF(AND(fimTurma!M$2<>\"\",fimTurma!M37<>\"\"),(fimTurma!M37-fimTurma!M$1)/fimTurma!M$2,\"\")","v":""}]
[{"$f":"IF(fimTurma!B38<>\"\",fimTurma!B38,\"\")","v":""},{"$f":"fimTurma!A38","v":35},{"$f":"IF(fimTurma!C38<>\"\",fimTurma!C38,\"\")","v":""},{"$f":"IF(fimTurma!D38<>\"\",fimTurma!D38,\"\")","v":""},{"$f":"IF(AND(fimTurma!F$2<>\"\",fimTurma!F38<>\"\"),(fimTurma!F38-fimTurma!F$1)/fimTurma!F$2,\"\")","v":""},{"$f":"IF(AND(fimTurma!G$2<>\"\",fimTurma!G38<>\"\"),(fimTurma!G38-fimTurma!G$1)/fimTurma!G$2,\"\")","v":""},{"$f":"IF(AND(fimTurma!H$2<>\"\",fimTurma!H38<>\"\"),(fimTurma!H38-fimTurma!H$1)/fimTurma!H$2,\"\")","v":""},{"$f":"IF(AND(fimTurma!I$2<>\"\",fimTurma!I38<>\"\"),(fimTurma!I38-fimTurma!I$1)/fimTurma!I$2,\"\")","v":""},{"$f":"IF(AND(fimTurma!J$2<>\"\",fimTurma!J38<>\"\"),(fimTurma!J38-fimTurma!J$1)/fimTurma!J$2,\"\")","v":""},{"$f":"IF(AND(fimTurma!K$2<>\"\",fimTurma!K38<>\"\"),(fimTurma!K38-fimTurma!K$1)/fimTurma!K$2,\"\")","v":""},{"$f":"IF(AND(fimTurma!L$2<>\"\",fimTurma!L38<>\"\"),(fimTurma!L38-fimTurma!L$1)/fimTurma!L$2,\"\")","v":""},{"$f":"IF(AND(fimTurma!M$2<>\"\",fimTurma!M38<>\"\"),(fimTurma!M38-fimTurma!M$1)/fimTurma!M$2,\"\")","v":""}]
[{"$f":"IF(fimTurma!B39<>\"\",fimTurma!B39,\"\")","v":""},{"$f":"fimTurma!A39","v":36},{"$f":"IF(fimTurma!C39<>\"\",fimTurma!C39,\"\")","v":""},{"$f":"IF(fimTurma!D39<>\"\",fimTurma!D39,\"\")","v":""},{"$f":"IF(AND(fimTurma!F$2<>\"\",fimTurma!F39<>\"\"),(fimTurma!F39-fimTurma!F$1)/fimTurma!F$2,\"\")","v":""},{"$f":"IF(AND(fimTurma!G$2<>\"\",fimTurma!G39<>\"\"),(fimTurma!G39-fimTurma!G$1)/fimTurma!G$2,\"\")","v":""},{"$f":"IF(AND(fimTurma!H$2<>\"\",fimTurma!H39<>\"\"),(fimTurma!H39-fimTurma!H$1)/fimTurma!H$2,\"\")","v":""},{"$f":"IF(AND(fimTurma!I$2<>\"\",fimTurma!I39<>\"\"),(fimTurma!I39-fimTurma!I$1)/fimTurma!I$2,\"\")","v":""},{"$f":"IF(AND(fimTurma!J$2<>\"\",fimTurma!J39<>\"\"),(fimTurma!J39-fimTurma!J$1)/fimTurma!J$2,\"\")","v":""},{"$f":"IF(AND(fimTurma!K$2<>\"\",fimTurma!K39<>\"\"),(fimTurma!K39-fimTurma!K$1)/fimTurma!K$2,\"\")","v":""},{"$f":"IF(AND(fimTurma!L$2<>\"\",fimTurma!L39<>\"\"),(fimTurma!L39-fimTurma!L$1)/fimTurma!L$2,\"\")","v":""},{"$f":"IF(AND(fimTurma!M$2<>\"\",fimTurma!M39<>\"\"),(fimTurma!M39-fimTurma!M$1)/fimTurma!M$2,\"\")","v":""}]
[{"$f":"IF(fimTurma!B40<>\"\",fimTurma!B40,\"\")","v":""},{"$f":"fimTurma!A40","v":37},{"$f":"IF(fimTurma!C40<>\"\",fimTurma!C40,\"\")","v":""},{"$f":"IF(fimTurma!D40<>\"\",fimTurma!D40,\"\")","v":""},{"$f":"IF(AND(fimTurma!F$2<>\"\",fimTurma!F40<>\"\"),(fimTurma!F40-fimTurma!F$1)/fimTurma!F$2,\"\")","v":""},{"$f":"IF(AND(fimTurma!G$2<>\"\",fimTurma!G40<>\"\"),(fimTurma!G40-fimTurma!G$1)/fimTurma!G$2,\"\")","v":""},{"$f":"IF(AND(fimTurma!H$2<>\"\",fimTurma!H40<>\"\"),(fimTurma!H40-fimTurma!H$1)/fimTurma!H$2,\"\")","v":""},{"$f":"IF(AND(fimTurma!I$2<>\"\",fimTurma!I40<>\"\"),(fimTurma!I40-fimTurma!I$1)/fimTurma!I$2,\"\")","v":""},{"$f":"IF(AND(fimTurma!J$2<>\"\",fimTurma!J40<>\"\"),(fimTurma!J40-fimTurma!J$1)/fimTurma!J$2,\"\")","v":""},{"$f":"IF(AND(fimTurma!K$2<>\"\",fimTurma!K40<>\"\"),(fimTurma!K40-fimTurma!K$1)/fimTurma!K$2,\"\")","v":""},{"$f":"IF(AND(fimTurma!L$2<>\"\",fimTurma!L40<>\"\"),(fimTurma!L40-fimTurma!L$1)/fimTurma!L$2,\"\")","v":""},{"$f":"IF(AND(fimTurma!M$2<>\"\",fimTurma!M40<>\"\"),(fimTurma!M40-fimTurma!M$1)/fimTurma!M$2,\"\")","v":""}]
[{"$f":"IF(fimTurma!B41<>\"\",fimTurma!B41,\"\")","v":""},{"$f":"fimTurma!A41","v":38},{"$f":"IF(fimTurma!C41<>\"\",fimTurma!C41,\"\")","v":""},{"$f":"IF(fimTurma!D41<>\"\",fimTurma!D41,\"\")","v":""},{"$f":"IF(AND(fimTurma!F$2<>\"\",fimTurma!F41<>\"\"),(fimTurma!F41-fimTurma!F$1)/fimTurma!F$2,\"\")","v":""},{"$f":"IF(AND(fimTurma!G$2<>\"\",fimTurma!G41<>\"\"),(fimTurma!G41-fimTurma!G$1)/fimTurma!G$2,\"\")","v":""},{"$f":"IF(AND(fimTurma!H$2<>\"\",fimTurma!H41<>\"\"),(fimTurma!H41-fimTurma!H$1)/fimTurma!H$2,\"\")","v":""},{"$f":"IF(AND(fimTurma!I$2<>\"\",fimTurma!I41<>\"\"),(fimTurma!I41-fimTurma!I$1)/fimTurma!I$2,\"\")","v":""},{"$f":"IF(AND(fimTurma!J$2<>\"\",fimTurma!J41<>\"\"),(fimTurma!J41-fimTurma!J$1)/fimTurma!J$2,\"\")","v":""},{"$f":"IF(AND(fimTurma!K$2<>\"\",fimTurma!K41<>\"\"),(fimTurma!K41-fimTurma!K$1)/fimTurma!K$2,\"\")","v":""},{"$f":"IF(AND(fimTurma!L$2<>\"\",fimTurma!L41<>\"\"),(fimTurma!L41-fimTurma!L$1)/fimTurma!L$2,\"\")","v":""},{"$f":"IF(AND(fimTurma!M$2<>\"\",fimTurma!M41<>\"\"),(fimTurma!M41-fimTurma!M$1)/fimTurma!M$2,\"\")","v":""}]
[{"$f":"IF(fimTurma!B42<>\"\",fimTurma!B42,\"\")","v":""},{"$f":"fimTurma!A42","v":39},{"$f":"IF(fimTurma!C42<>\"\",fimTurma!C42,\"\")","v":""},{"$f":"IF(fimTurma!D42<>\"\",fimTurma!D42,\"\")","v":""},{"$f":"IF(AND(fimTurma!F$2<>\"\",fimTurma!F42<>\"\"),(fimTurma!F42-fimTurma!F$1)/fimTurma!F$2,\"\")","v":""},{"$f":"IF(AND(fimTurma!G$2<>\"\",fimTurma!G42<>\"\"),(fimTurma!G42-fimTurma!G$1)/fimTurma!G$2,\"\")","v":""},{"$f":"IF(AND(fimTurma!H$2<>\"\",fimTurma!H42<>\"\"),(fimTurma!H42-fimTurma!H$1)/fimTurma!H$2,\"\")","v":""},{"$f":"IF(AND(fimTurma!I$2<>\"\",fimTurma!I42<>\"\"),(fimTurma!I42-fimTurma!I$1)/fimTurma!I$2,\"\")","v":""},{"$f":"IF(AND(fimTurma!J$2<>\"\",fimTurma!J42<>\"\"),(fimTurma!J42-fimTurma!J$1)/fimTurma!J$2,\"\")","v":""},{"$f":"IF(AND(fimTurma!K$2<>\"\",fimTurma!K42<>\"\"),(fimTurma!K42-fimTurma!K$1)/fimTurma!K$2,\"\")","v":""},{"$f":"IF(AND(fimTurma!L$2<>\"\",fimTurma!L42<>\"\"),(fimTurma!L42-fimTurma!L$1)/fimTurma!L$2,\"\")","v":""},{"$f":"IF(AND(fimTurma!M$2<>\"\",fimTurma!M42<>\"\"),(fimTurma!M42-fimTurma!M$1)/fimTurma!M$2,\"\")","v":""}]
[{"$f":"IF(fimTurma!B43<>\"\",fimTurma!B43,\"\")","v":""},{"$f":"fimTurma!A43","v":40},{"$f":"IF(fimTurma!C43<>\"\",fimTurma!C43,\"\")","v":""},{"$f":"IF(fimTurma!D43<>\"\",fimTurma!D43,\"\")","v":""},{"$f":"IF(AND(fimTurma!F$2<>\"\",fimTurma!F43<>\"\"),(fimTurma!F43-fimTurma!F$1)/fimTurma!F$2,\"\")","v":""},{"$f":"IF(AND(fimTurma!G$2<>\"\",fimTurma!G43<>\"\"),(fimTurma!G43-fimTurma!G$1)/fimTurma!G$2,\"\")","v":""},{"$f":"IF(AND(fimTurma!H$2<>\"\",fimTurma!H43<>\"\"),(fimTurma!H43-fimTurma!H$1)/fimTurma!H$2,\"\")","v":""},{"$f":"IF(AND(fimTurma!I$2<>\"\",fimTurma!I43<>\"\"),(fimTurma!I43-fimTurma!I$1)/fimTurma!I$2,\"\")","v":""},{"$f":"IF(AND(fimTurma!J$2<>\"\",fimTurma!J43<>\"\"),(fimTurma!J43-fimTurma!J$1)/fimTurma!J$2,\"\")","v":""},{"$f":"IF(AND(fimTurma!K$2<>\"\",fimTurma!K43<>\"\"),(fimTurma!K43-fimTurma!K$1)/fimTurma!K$2,\"\")","v":""},{"$f":"IF(AND(fimTurma!L$2<>\"\",fimTurma!L43<>\"\"),(fimTurma!L43-fimTurma!L$1)/fimTurma!L$2,\"\")","v":""},{"$f":"IF(AND(fimTurma!M$2<>\"\",fimTurma!M43<>\"\"),(fimTurma!M43-fimTurma!M$1)/fimTurma!M$2,\"\")","v":""}]
[{"$f":"IF(fimTurma!B44<>\"\",fimTurma!B44,\"\")","v":""},{"$f":"fimTurma!A44","v":41},{"$f":"IF(fimTurma!C44<>\"\",fimTurma!C44,\"\")","v":""},{"$f":"IF(fimTurma!D44<>\"\",fimTurma!D44,\"\")","v":""},{"$f":"IF(AND(fimTurma!F$2<>\"\",fimTurma!F44<>\"\"),(fimTurma!F44-fimTurma!F$1)/fimTurma!F$2,\"\")","v":""},{"$f":"IF(AND(fimTurma!G$2<>\"\",fimTurma!G44<>\"\"),(fimTurma!G44-fimTurma!G$1)/fimTurma!G$2,\"\")","v":""},{"$f":"IF(AND(fimTurma!H$2<>\"\",fimTurma!H44<>\"\"),(fimTurma!H44-fimTurma!H$1)/fimTurma!H$2,\"\")","v":""},{"$f":"IF(AND(fimTurma!I$2<>\"\",fimTurma!I44<>\"\"),(fimTurma!I44-fimTurma!I$1)/fimTurma!I$2,\"\")","v":""},{"$f":"IF(AND(fimTurma!J$2<>\"\",fimTurma!J44<>\"\"),(fimTurma!J44-fimTurma!J$1)/fimTurma!J$2,\"\")","v":""},{"$f":"IF(AND(fimTurma!K$2<>\"\",fimTurma!K44<>\"\"),(fimTurma!K44-fimTurma!K$1)/fimTurma!K$2,\"\")","v":""},{"$f":"IF(AND(fimTurma!L$2<>\"\",fimTurma!L44<>\"\"),(fimTurma!L44-fimTurma!L$1)/fimTurma!L$2,\"\")","v":""},{"$f":"IF(AND(fimTurma!M$2<>\"\",fimTurma!M44<>\"\"),(fimTurma!M44-fimTurma!M$1)/fimTurma!M$2,\"\")","v":""}]
[{"$f":"IF(fimTurma!B45<>\"\",fimTurma!B45,\"\")","v":""},{"$f":"fimTurma!A45","v":42},{"$f":"IF(fimTurma!C45<>\"\",fimTurma!C45,\"\")","v":""},{"$f":"IF(fimTurma!D45<>\"\",fimTurma!D45,\"\")","v":""},{"$f":"IF(AND(fimTurma!F$2<>\"\",fimTurma!F45<>\"\"),(fimTurma!F45-fimTurma!F$1)/fimTurma!F$2,\"\")","v":""},{"$f":"IF(AND(fimTurma!G$2<>\"\",fimTurma!G45<>\"\"),(fimTurma!G45-fimTurma!G$1)/fimTurma!G$2,\"\")","v":""},{"$f":"IF(AND(fimTurma!H$2<>\"\",fimTurma!H45<>\"\"),(fimTurma!H45-fimTurma!H$1)/fimTurma!H$2,\"\")","v":""},{"$f":"IF(AND(fimTurma!I$2<>\"\",fimTurma!I45<>\"\"),(fimTurma!I45-fimTurma!I$1)/fimTurma!I$2,\"\")","v":""},{"$f":"IF(AND(fimTurma!J$2<>\"\",fimTurma!J45<>\"\"),(fimTurma!J45-fimTurma!J$1)/fimTurma!J$2,\"\")","v":""},{"$f":"IF(AND(fimTurma!K$2<>\"\",fimTurma!K45<>\"\"),(fimTurma!K45-fimTurma!K$1)/fimTurma!K$2,\"\")","v":""},{"$f":"IF(AND(fimTurma!L$2<>\"\",fimTurma!L45<>\"\"),(fimTurma!L45-fimTurma!L$1)/fimTurma!L$2,\"\")","v":""},{"$f":"IF(AND(fimTurma!M$2<>\"\",fimTurma!M45<>\"\"),(fimTurma!M45-fimTurma!M$1)/fimTurma!M$2,\"\")","v":""}]
[{"$f":"IF(fimTurma!B46<>\"\",fimTurma!B46,\"\")","v":""},{"$f":"fimTurma!A46","v":43},{"$f":"IF(fimTurma!C46<>\"\",fimTurma!C46,\"\")","v":""},{"$f":"IF(fimTurma!D46<>\"\",fimTurma!D46,\"\")","v":""},{"$f":"IF(AND(fimTurma!F$2<>\"\",fimTurma!F46<>\"\"),(fimTurma!F46-fimTurma!F$1)/fimTurma!F$2,\"\")","v":""},{"$f":"IF(AND(fimTurma!G$2<>\"\",fimTurma!G46<>\"\"),(fimTurma!G46-fimTurma!G$1)/fimTurma!G$2,\"\")","v":""},{"$f":"IF(AND(fimTurma!H$2<>\"\",fimTurma!H46<>\"\"),(fimTurma!H46-fimTurma!H$1)/fimTurma!H$2,\"\")","v":""},{"$f":"IF(AND(fimTurma!I$2<>\"\",fimTurma!I46<>\"\"),(fimTurma!I46-fimTurma!I$1)/fimTurma!I$2,\"\")","v":""},{"$f":"IF(AND(fimTurma!J$2<>\"\",fimTurma!J46<>\"\"),(fimTurma!J46-fimTurma!J$1)/fimTurma!J$2,\"\")","v":""},{"$f":"IF(AND(fimTurma!K$2<>\"\",fimTurma!K46<>\"\"),(fimTurma!K46-fimTurma!K$1)/fimTurma!K$2,\"\")","v":""},{"$f":"IF(AND(fimTurma!L$2<>\"\",fimTurma!L46<>\"\"),(fimTurma!L46-fimTurma!L$1)/fimTurma!L$2,\"\")","v":""},{"$f":"IF(AND(fimTurma!M$2<>\"\",fimTurma!M46<>\"\"),(fimTurma!M46-fimTurma!M$1)/fimTurma!M$2,\"\")","v":""}]
[{"$f":"IF(fimTurma!B47<>\"\",fimTurma!B47,\"\")","v":""},{"$f":"fimTurma!A47","v":44},{"$f":"IF(fimTurma!C47<>\"\",fimTurma!C47,\"\")","v":""},{"$f":"IF(fimTurma!D47<>\"\",fimTurma!D47,\"\")","v":""},{"$f":"IF(AND(fimTurma!F$2<>\"\",fimTurma!F47<>\"\"),(fimTurma!F47-fimTurma!F$1)/fimTurma!F$2,\"\")","v":""},{"$f":"IF(AND(fimTurma!G$2<>\"\",fimTurma!G47<>\"\"),(fimTurma!G47-fimTurma!G$1)/fimTurma!G$2,\"\")","v":""},{"$f":"IF(AND(fimTurma!H$2<>\"\",fimTurma!H47<>\"\"),(fimTurma!H47-fimTurma!H$1)/fimTurma!H$2,\"\")","v":""},{"$f":"IF(AND(fimTurma!I$2<>\"\",fimTurma!I47<>\"\"),(fimTurma!I47-fimTurma!I$1)/fimTurma!I$2,\"\")","v":""},{"$f":"IF(AND(fimTurma!J$2<>\"\",fimTurma!J47<>\"\"),(fimTurma!J47-fimTurma!J$1)/fimTurma!J$2,\"\")","v":""},{"$f":"IF(AND(fimTurma!K$2<>\"\",fimTurma!K47<>\"\"),(fimTurma!K47-fimTurma!K$1)/fimTurma!K$2,\"\")","v":""},{"$f":"IF(AND(fimTurma!L$2<>\"\",fimTurma!L47<>\"\"),(fimTurma!L47-fimTurma!L$1)/fimTurma!L$2,\"\")","v":""},{"$f":"IF(AND(fimTurma!M$2<>\"\",fimTurma!M47<>\"\"),(fimTurma!M47-fimTurma!M$1)/fimTurma!M$2,\"\")","v":""}]
[{"$f":"IF(fimTurma!B48<>\"\",fimTurma!B48,\"\")","v":""},{"$f":"fimTurma!A48","v":45},{"$f":"IF(fimTurma!C48<>\"\",fimTurma!C48,\"\")","v":""},{"$f":"IF(fimTurma!D48<>\"\",fimTurma!D48,\"\")","v":""},{"$f":"IF(AND(fimTurma!F$2<>\"\",fimTurma!F48<>\"\"),(fimTurma!F48-fimTurma!F$1)/fimTurma!F$2,\"\")","v":""},{"$f":"IF(AND(fimTurma!G$2<>\"\",fimTurma!G48<>\"\"),(fimTurma!G48-fimTurma!G$1)/fimTurma!G$2,\"\")","v":""},{"$f":"IF(AND(fimTurma!H$2<>\"\",fimTurma!H48<>\"\"),(fimTurma!H48-fimTurma!H$1)/fimTurma!H$2,\"\")","v":""},{"$f":"IF(AND(fimTurma!I$2<>\"\",fimTurma!I48<>\"\"),(fimTurma!I48-fimTurma!I$1)/fimTurma!I$2,\"\")","v":""},{"$f":"IF(AND(fimTurma!J$2<>\"\",fimTurma!J48<>\"\"),(fimTurma!J48-fimTurma!J$1)/fimTurma!J$2,\"\")","v":""},{"$f":"IF(AND(fimTurma!K$2<>\"\",fimTurma!K48<>\"\"),(fimTurma!K48-fimTurma!K$1)/fimTurma!K$2,\"\")","v":""},{"$f":"IF(AND(fimTurma!L$2<>\"\",fimTurma!L48<>\"\"),(fimTurma!L48-fimTurma!L$1)/fimTurma!L$2,\"\")","v":""},{"$f":"IF(AND(fimTurma!M$2<>\"\",fimTurma!M48<>\"\"),(fimTurma!M48-fimTurma!M$1)/fimTurma!M$2,\"\")","v":""}]
[{"$f":"IF(fimTurma!B49<>\"\",fimTurma!B49,\"\")","v":""},{"$f":"fimTurma!A49","v":46},{"$f":"IF(fimTurma!C49<>\"\",fimTurma!C49,\"\")","v":""},{"$f":"IF(fimTurma!D49<>\"\",fimTurma!D49,\"\")","v":""},{"$f":"IF(AND(fimTurma!F$2<>\"\",fimTurma!F49<>\"\"),(fimTurma!F49-fimTurma!F$1)/fimTurma!F$2,\"\")","v":""},{"$f":"IF(AND(fimTurma!G$2<>\"\",fimTurma!G49<>\"\"),(fimTurma!G49-fimTurma!G$1)/fimTurma!G$2,\"\")","v":""},{"$f":"IF(AND(fimTurma!H$2<>\"\",fimTurma!H49<>\"\"),(fimTurma!H49-fimTurma!H$1)/fimTurma!H$2,\"\")","v":""},{"$f":"IF(AND(fimTurma!I$2<>\"\",fimTurma!I49<>\"\"),(fimTurma!I49-fimTurma!I$1)/fimTurma!I$2,\"\")","v":""},{"$f":"IF(AND(fimTurma!J$2<>\"\",fimTurma!J49<>\"\"),(fimTurma!J49-fimTurma!J$1)/fimTurma!J$2,\"\")","v":""},{"$f":"IF(AND(fimTurma!K$2<>\"\",fimTurma!K49<>\"\"),(fimTurma!K49-fimTurma!K$1)/fimTurma!K$2,\"\")","v":""},{"$f":"IF(AND(fimTurma!L$2<>\"\",fimTurma!L49<>\"\"),(fimTurma!L49-fimTurma!L$1)/fimTurma!L$2,\"\")","v":""},{"$f":"IF(AND(fimTurma!M$2<>\"\",fimTurma!M49<>\"\"),(fimTurma!M49-fimTurma!M$1)/fimTurma!M$2,\"\")","v":""}]
[{"$f":"IF(fimTurma!B50<>\"\",fimTurma!B50,\"\")","v":""},{"$f":"fimTurma!A50","v":47},{"$f":"IF(fimTurma!C50<>\"\",fimTurma!C50,\"\")","v":""},{"$f":"IF(fimTurma!D50<>\"\",fimTurma!D50,\"\")","v":""},{"$f":"IF(AND(fimTurma!F$2<>\"\",fimTurma!F50<>\"\"),(fimTurma!F50-fimTurma!F$1)/fimTurma!F$2,\"\")","v":""},{"$f":"IF(AND(fimTurma!G$2<>\"\",fimTurma!G50<>\"\"),(fimTurma!G50-fimTurma!G$1)/fimTurma!G$2,\"\")","v":""},{"$f":"IF(AND(fimTurma!H$2<>\"\",fimTurma!H50<>\"\"),(fimTurma!H50-fimTurma!H$1)/fimTurma!H$2,\"\")","v":""},{"$f":"IF(AND(fimTurma!I$2<>\"\",fimTurma!I50<>\"\"),(fimTurma!I50-fimTurma!I$1)/fimTurma!I$2,\"\")","v":""},{"$f":"IF(AND(fimTurma!J$2<>\"\",fimTurma!J50<>\"\"),(fimTurma!J50-fimTurma!J$1)/fimTurma!J$2,\"\")","v":""},{"$f":"IF(AND(fimTurma!K$2<>\"\",fimTurma!K50<>\"\"),(fimTurma!K50-fimTurma!K$1)/fimTurma!K$2,\"\")","v":""},{"$f":"IF(AND(fimTurma!L$2<>\"\",fimTurma!L50<>\"\"),(fimTurma!L50-fimTurma!L$1)/fimTurma!L$2,\"\")","v":""},{"$f":"IF(AND(fimTurma!M$2<>\"\",fimTurma!M50<>\"\"),(fimTurma!M50-fimTurma!M$1)/fimTurma!M$2,\"\")","v":""}]
[{"$f":"IF(fimTurma!B51<>\"\",fimTurma!B51,\"\")","v":""},{"$f":"fimTurma!A51","v":48},{"$f":"IF(fimTurma!C51<>\"\",fimTurma!C51,\"\")","v":""},{"$f":"IF(fimTurma!D51<>\"\",fimTurma!D51,\"\")","v":""},{"$f":"IF(AND(fimTurma!F$2<>\"\",fimTurma!F51<>\"\"),(fimTurma!F51-fimTurma!F$1)/fimTurma!F$2,\"\")","v":""},{"$f":"IF(AND(fimTurma!G$2<>\"\",fimTurma!G51<>\"\"),(fimTurma!G51-fimTurma!G$1)/fimTurma!G$2,\"\")","v":""},{"$f":"IF(AND(fimTurma!H$2<>\"\",fimTurma!H51<>\"\"),(fimTurma!H51-fimTurma!H$1)/fimTurma!H$2,\"\")","v":""},{"$f":"IF(AND(fimTurma!I$2<>\"\",fimTurma!I51<>\"\"),(fimTurma!I51-fimTurma!I$1)/fimTurma!I$2,\"\")","v":""},{"$f":"IF(AND(fimTurma!J$2<>\"\",fimTurma!J51<>\"\"),(fimTurma!J51-fimTurma!J$1)/fimTurma!J$2,\"\")","v":""},{"$f":"IF(AND(fimTurma!K$2<>\"\",fimTurma!K51<>\"\"),(fimTurma!K51-fimTurma!K$1)/fimTurma!K$2,\"\")","v":""},{"$f":"IF(AND(fimTurma!L$2<>\"\",fimTurma!L51<>\"\"),(fimTurma!L51-fimTurma!L$1)/fimTurma!L$2,\"\")","v":""},{"$f":"IF(AND(fimTurma!M$2<>\"\",fimTurma!M51<>\"\"),(fimTurma!M51-fimTurma!M$1)/fimTurma!M$2,\"\")","v":""}]
[{"$f":"IF(fimTurma!B52<>\"\",fimTurma!B52,\"\")","v":""},{"$f":"fimTurma!A52","v":49},{"$f":"IF(fimTurma!C52<>\"\",fimTurma!C52,\"\")","v":""},{"$f":"IF(fimTurma!D52<>\"\",fimTurma!D52,\"\")","v":""},{"$f":"IF(AND(fimTurma!F$2<>\"\",fimTurma!F52<>\"\"),(fimTurma!F52-fimTurma!F$1)/fimTurma!F$2,\"\")","v":""},{"$f":"IF(AND(fimTurma!G$2<>\"\",fimTurma!G52<>\"\"),(fimTurma!G52-fimTurma!G$1)/fimTurma!G$2,\"\")","v":""},{"$f":"IF(AND(fimTurma!H$2<>\"\",fimTurma!H52<>\"\"),(fimTurma!H52-fimTurma!H$1)/fimTurma!H$2,\"\")","v":""},{"$f":"IF(AND(fimTurma!I$2<>\"\",fimTurma!I52<>\"\"),(fimTurma!I52-fimTurma!I$1)/fimTurma!I$2,\"\")","v":""},{"$f":"IF(AND(fimTurma!J$2<>\"\",fimTurma!J52<>\"\"),(fimTurma!J52-fimTurma!J$1)/fimTurma!J$2,\"\")","v":""},{"$f":"IF(AND(fimTurma!K$2<>\"\",fimTurma!K52<>\"\"),(fimTurma!K52-fimTurma!K$1)/fimTurma!K$2,\"\")","v":""},{"$f":"IF(AND(fimTurma!L$2<>\"\",fimTurma!L52<>\"\"),(fimTurma!L52-fimTurma!L$1)/fimTurma!L$2,\"\")","v":""},{"$f":"IF(AND(fimTurma!M$2<>\"\",fimTurma!M52<>\"\"),(fimTurma!M52-fimTurma!M$1)/fimTurma!M$2,\"\")","v":""}]
[{"$f":"IF(fimTurma!B53<>\"\",fimTurma!B53,\"\")","v":""},{"$f":"fimTurma!A53","v":50},{"$f":"IF(fimTurma!C53<>\"\",fimTurma!C53,\"\")","v":""},{"$f":"IF(fimTurma!D53<>\"\",fimTurma!D53,\"\")","v":""},{"$f":"IF(AND(fimTurma!F$2<>\"\",fimTurma!F53<>\"\"),(fimTurma!F53-fimTurma!F$1)/fimTurma!F$2,\"\")","v":""},{"$f":"IF(AND(fimTurma!G$2<>\"\",fimTurma!G53<>\"\"),(fimTurma!G53-fimTurma!G$1)/fimTurma!G$2,\"\")","v":""},{"$f":"IF(AND(fimTurma!H$2<>\"\",fimTurma!H53<>\"\"),(fimTurma!H53-fimTurma!H$1)/fimTurma!H$2,\"\")","v":""},{"$f":"IF(AND(fimTurma!I$2<>\"\",fimTurma!I53<>\"\"),(fimTurma!I53-fimTurma!I$1)/fimTurma!I$2,\"\")","v":""},{"$f":"IF(AND(fimTurma!J$2<>\"\",fimTurma!J53<>\"\"),(fimTurma!J53-fimTurma!J$1)/fimTurma!J$2,\"\")","v":""},{"$f":"IF(AND(fimTurma!K$2<>\"\",fimTurma!K53<>\"\"),(fimTurma!K53-fimTurma!K$1)/fimTurma!K$2,\"\")","v":""},{"$f":"IF(AND(fimTurma!L$2<>\"\",fimTurma!L53<>\"\"),(fimTurma!L53-fimTurma!L$1)/fimTurma!L$2,\"\")","v":""},{"$f":"IF(AND(fimTurma!M$2<>\"\",fimTurma!M53<>\"\"),(fimTurma!M53-fimTurma!M$1)/fimTurma!M$2,\"\")","v":""}]

{"sheet":"profRelatório","index":6,"n_rows":24,"n_cols":11,"rows_kept":24,"cut":false,"hidden":false,"merged":[[3,2,3,4],[3,6,3,8]]}
["RELATÓRIO RESUMO PARA O PROFESSOR/TREINADOR"]
[{"$f":"_xlfn.CONCAT(fimTurma!C1,\"º ano\",\" | \",fimTurma!C2)","v":"2º ano | A"}]
[]
[null,null,"Início do Ano",null,null,null,"Fim do Ano",null,null,null,"Melhoria"]
[null,null,"Média",null,"Desvio",null,"Média",null,"Desvio",null,"Com"]
[null,null,null,null,"Padrão",null,null,null,"Padrão",null,"Significado?"]
["HABILIDADES DE LOCOMOÇÃO"]
[{"$f":"IF(fimTurma!A2=1,IFERROR(VLOOKUP(1,fimAuxiliar!L3:Q5,2,0),\"\"),\"\")","v":"Corrida vaivém"},null,{"$f":"IF(fimTurma!A2=1,IFERROR(VLOOKUP(1,fimAuxiliar!L3:X5,11,0),0),0)","v":12.3575},null,{"$f":"IF(fimTurma!A2=1,IFERROR(VLOOKUP(1,fimAuxiliar!L3:X5,12,0),0),0)","v":1.1577717463587831},null,{"$f":"IF(fimTurma!A2=1,IFERROR(VLOOKUP(1,fimAuxiliar!L3:X5,4,0),0),0)","v":15.374999999999998},null,{"$f":"IF(fimTurma!A2=1,IFERROR(VLOOKUP(1,fimAuxiliar!L3:X5,13,0),0),0)","v":0.5068283733178327},null,{"$f":"IF(fimTurma!A2=1,IFERROR(VLOOKUP(1,fimAuxiliar!L3:X5,9,0),0),0)","v":"Não"}]
[]
[{"$f":"IF(fimTurma!A2=1,IFERROR(VLOOKUP(2,fimAuxiliar!L3:Q5,2,0),\"\"),\"\")","v":"Corrida velocidade"},null,{"$f":"IF(fimTurma!A2=1,IFERROR(VLOOKUP(2,fimAuxiliar!L3:X5,11,0),0),0)","v":13.333333333333334},null,{"$f":"IF(fimTurma!A2=1,IFERROR(VLOOKUP(2,fimAuxiliar!L3:X5,12,0),0),0)","v":1.5986105077709065},null,{"$f":"IF(fimTurma!A2=1,IFERROR(VLOOKUP(2,fimAuxiliar!L3:X5,4,0),0),0)","v":11.75},null,{"$f":"IF(fimTurma!A2=1,IFERROR(VLOOKUP(2,fimAuxiliar!L3:X5,13,0),0),0)","v":1.299038105676658},null,{"$f":"IF(fimTurma!A2=1,IFERROR(VLOOKUP(2,fimAuxiliar!L3:X5,9,0),0),0)","v":"Não"}]
[]
[{"$f":"IF(fimTurma!A2=1,IFERROR(VLOOKUP(3,fimAuxiliar!L3:Q5,2,0),\"\"),\"\")","v":"Salto horizontal"},null,{"$f":"IF(fimTurma!A2=1,IFERROR(VLOOKUP(3,fimAuxiliar!L3:X5,11,0),0),0)","v":9.0333333333333332},null,{"$f":"IF(fimTurma!A2=1,IFERROR(VLOOKUP(3,fimAuxiliar!L3:X5,12,0),0),0)","v":2.3396343493992631},null,{"$f":"IF(fimTurma!A2=1,IFERROR(VLOOKUP(3,fimAuxiliar!L3:X5,4,0),0),0)","v":7.7636363636363646},null,{"$f":"IF(fimTurma!A2=1,IFERROR(VLOOKUP(3,fimAuxiliar!L3:X5,13,0),0),0)","v":0.96603475118437687},null,{"$f":"IF(fimTurma!A2=1,IFERROR(VLOOKUP(3,fimAuxiliar!L3:X5,9,0),0),0)","v":"Não"}]
[]
["HABILIDADES DE CONTROLO DE OBJETOS"]
[{"$f":"IF(fimTurma!A2=1,IFERROR(VLOOKUP(1,fimAuxiliar!L6:Q7,2,0),\"\"),\"\")","v":"Receber"},null,{"$f":"IF(fimTurma!A2=1,IFERROR(VLOOKUP(1,fimAuxiliar!L6:X7,11,0),0),0)","v":29.866666666666664},null,{"$f":"IF(fimTurma!A2=1,IFERROR(VLOOKUP(1,fimAuxiliar!L6:X7,12,0),0),0)","v":4.0778534658431482},null,{"$f":"IF(fimTurma!A2=1,IFERROR(VLOOKUP(1,fimAuxiliar!L6:X7,4,0),0),0)","v":34.527272727272731},null,{"$f":"IF(fimTurma!A2=1,IFERROR(VLOOKUP(1,fimAuxiliar!L6:X7,13,0),0),0)","v":3.0766247471394266},null,{"$f":"IF(fimTurma!A2=1,IFERROR(VLOOKUP(1,fimAuxiliar!L6:X7,9,0),0),0)","v":"Sim"}]
[]
[{"$f":"IF(fimTurma!A2=1,IFERROR(VLOOKUP(2,fimAuxiliar!L6:Q7,2,0),\"\"),\"\")","v":"Lançar"},null,{"$f":"IF(fimTurma!A2=1,IFERROR(VLOOKUP(2,fimAuxiliar!L6:X7,11,0),0),0)","v":12.363636363636363},null,{"$f":"IF(fimTurma!A2=1,IFERROR(VLOOKUP(2,fimAuxiliar!L6:X7,12,0),0),0)","v":4.3332273773865397},null,{"$f":"IF(fimTurma!A2=1,IFERROR(VLOOKUP(2,fimAuxiliar!L6:X7,4,0),0),0)","v":15.5},null,{"$f":"IF(fimTurma!A2=1,IFERROR(VLOOKUP(2,fimAuxiliar!L6:X7,13,0),0),0)","v":3.4520525295346629},null,{"$f":"IF(fimTurma!A2=1,IFERROR(VLOOKUP(2,fimAuxiliar!L6:X7,9,0),0),0)","v":"Sim"}]
[]
["HABILIDADE DE ESTABILIZAÇÃO"]
[{"$f":"IFERROR(VLOOKUP(6,fimAuxiliar!B3:G8,2,0),\"\")","v":"Equilíbrio"},null,{"$f":"IF(fimTurma!A2=1,IFERROR(VLOOKUP(1,fimAuxiliar!L8:X8,11,0),0),0)","v":10.951666666666668},null,{"$f":"IF(fimTurma!A2=1,IFERROR(VLOOKUP(1,fimAuxiliar!L8:X8,12,0),0),0)","v":1.3716281890107287},null,{"$f":"IF(fimTurma!A2=1,IFERROR(VLOOKUP(1,fimAuxiliar!L8:X8,4,0),0),0)","v":9.7416666666666654},null,{"$f":"IF(fimTurma!A2=1,IFERROR(VLOOKUP(1,fimAuxiliar!L8:X8,13,0),0),0)","v":1.1161379345264175},null,{"$f":"IF(fimTurma!A2=1,IFERROR(VLOOKUP(1,fimAuxiliar!L8:X8,9,0),0),0)","v":"Não"}]
[]
[]
[]
[{"$f":"IFERROR(VLOOKUP(8,fimAuxiliar!B3:G10,2,0),\"\")","v":""},null,{"$f":"IFERROR(VLOOKUP(8,iniAuxiliar!$B$3:$G$10,4,0),0)","v":0},null,{"$f":"IFERROR(VLOOKUP(8,iniAuxiliar!$B$3:$J$10,9,0),0)","v":0},null,{"$f":"IFERROR(VLOOKUP(8,fimAuxiliar!$B$3:$G$10,4,0),0)","v":0},null,{"$f":"IFERROR(VLOOKUP(8,fimAuxiliar!$B$3:$J$10,9,0),0)","v":0},null,{"$f":"IFERROR(VLOOKUP(8,fimAuxiliar!$B$3:$M$10,12,0),0)","v":0}]

{"sheet":"profPorTeste","index":7,"n_rows":5,"n_cols":1,"rows_kept":5,"cut":false,"hidden":false,"merged":[]}
["RELATÓRIO POR TESTE PARA O PROFESSOR/TREINADOR"]
[{"$f":"_xlfn.CONCAT(fimTurma!C1,\"º ano\",\" | \",fimTurma!C2)","v":"2º ano | A"}]
[]
[]
["Teste: Receber"]

{"sheet":"iniAuxiliar","index":8,"n_rows":21,"n_cols":17,"rows_kept":21,"cut":false,"hidden":true,"merged":[]}
["Número","Ordem Resumo","Teste","Criança","Média","Mínimo","Máximo","Score Z","Nome Gráfico","Dpadrão","Grupo","Ordem Relatório","Nome","Criança","Média","Mínimo","Máximo"]
[null,0]
[{"$f":"COUNT(iniTurma!F4:F53)","v":12},{"$f":"IF(A3>0,B2+1,B2)","v":1},{"$f":"iniTurma!F3","v":"Corrida vaivém"},{"$f":"IF(AND(iniTurma!$A$2=1,B3=B2+1),VLOOKUP(\"x\",iniTurma!$B$4:$M$53,5,0),\"\")","v":11.64},{"$f":"IF(B3=B2+1,iniTurma!$F$1,\"\")","v":12.3575},{"$f":"IF(AND(iniTurma!$A$2=1,B3=B2+1),SMALL(iniTurma!$F$4:$F$53,1),\"\")","v":10},{"$f":"IF(AND(iniTurma!$A$2=1,B3=B2+1),LARGE(iniTurma!$F$4:$F$53,1),\"\")","v":14.2},{"$f":"IF(AND(iniTurma!$A$2=1,B3=B2+1),VLOOKUP(\"x\",'iniScore Z'!$A$4:$L$53,5,0),\"\")","v":-0.61972491750343039},{"$f":"C3","v":"Corrida vaivém"},{"$f":"IF(B3=B2+1,iniTurma!$F$2,\"\")","v":1.1577717463587831},"HABILIDADES DE LOCOMOÇÃO",{"$f":"IF(K3<>K2,IF(A3>0,1,0),IF(A3>0,L2+1,L2))","v":1},{"$f":"C3","v":"Corrida vaivém"},{"$f":"D3","v":11.64},{"$f":"E3","v":12.3575},10,14.2]
[{"$f":"COUNT(iniTurma!G4:G53)","v":12},{"$f":"IF(A4>0,B3+1,B3)","v":2},{"$f":"iniTurma!G3","v":"Corrida velocidade"},{"$f":"IF(AND(iniTurma!$A$2=1,B4=B3+1),VLOOKUP(\"x\",iniTurma!$B$4:$M$53,6,0),\"\")","v":15},{"$f":"IF(B4=B3+1,iniTurma!$G$1,\"\")","v":13.333333333333334},{"$f":"IF(AND(iniTurma!$A$2=1,B4=B3+1),SMALL(iniTurma!$G$4:$G$53,1),\"\")","v":10},{"$f":"IF(AND(iniTurma!$A$2=1,B4=B3+1),LARGE(iniTurma!$G$4:$G$53,1),\"\")","v":16},{"$f":"IF(AND(iniTurma!$A$2=1,B4=B3+1),VLOOKUP(\"x\",'iniScore Z'!$A$4:$L$53,6,0),\"\")","v":1.0425720702853734},{"$f":"C4","v":"Corrida velocidade"},{"$f":"IF(B4=B3+1,iniTurma!$G$2,\"\")","v":1.5986105077709065},"HABILIDADES DE LOCOMOÇÃO",{"$f":"IF(K4<>K3,IF(A4>0,1,0),IF(A4>0,L3+1,L3))","v":2},{"$f":"C4","v":"Corrida velocidade"},{"$f":"D4","v":15},{"$f":"E4","v":13.333333333333334},{"$f":"F4","v":10},{"$f":"G4","v":16}]
[{"$f":"COUNT(iniTurma!H4:H53)","v":12},3,{"$f":"iniTurma!H3","v":"Salto horizontal"},{"$f":"IF(AND(iniTurma!$A$2=1,B5=B4+1),VLOOKUP(\"x\",iniTurma!$B$4:$M$53,7,0),\"\")","v":10},{"$f":"IF(B5=B4+1,iniTurma!$H$1,\"\")","v":9.0333333333333332},{"$f":"IF(AND(iniTurma!$A$2=1,B5=B4+1),SMALL(iniTurma!$H$4:$H$53,1),\"\")","v":6},{"$f":"IF(AND(iniTurma!$A$2=1,B5=B4+1),LARGE(iniTurma!$H$4:$H$53,1),\"\")","v":14.7},{"$f":"IF(AND(iniTurma!$A$2=1,B5=B4+1),VLOOKUP(\"x\",'iniScore Z'!$A$4:$L$53,7,0),\"\")","v":0.41316997543435507},"Salto horizontal",{"$f":"IF(B5=B4+1,iniTurma!$H$2,\"\")","v":2.3396343493992631},"HABILIDADES DE LOCOMOÇÃO",3,"Salto horizontal",10,9.0333333333333332,6,14.7]
[{"$f":"COUNT(iniTurma!I4:I53)","v":12},4,{"$f":"iniTurma!I3","v":"Receber"},{"$f":"IF(AND(iniTurma!$A$2=1,B6=B5+1),VLOOKUP(\"x\",iniTurma!$B$4:$M$53,8,0),\"\")","v":31},{"$f":"IF(B6=B5+1,iniTurma!$I$1,\"\")","v":29.866666666666664},{"$f":"IF(AND(iniTurma!$A$2=1,B6=B5+1),SMALL(iniTurma!$I$4:$I$53,1),\"\")","v":24},{"$f":"IF(AND(iniTurma!$A$2=1,B6=B5+1),LARGE(iniTurma!$I$4:$I$53,1),\"\")","v":38},{"$f":"IF(AND(iniTurma!$A$2=1,B6=B5+1),VLOOKUP(\"x\",'iniScore Z'!$A$4:$L$53,8,0),\"\")","v":0.27792399673660301},"Receber",{"$f":"IF(B6=B5+1,iniTurma!$I$2,\"\")","v":4.0778534658431482},"HABILIDADES DE CONTROLO DE OBJETOS",1,"Receber",31,29.866666666666664,24,38]
[{"$f":"COUNT(iniTurma!J4:J53)","v":11},5,{"$f":"iniTurma!J3","v":"Lançar"},{"$f":"IF(AND(iniTurma!$A$2=1,B7=B6+1),VLOOKUP(\"x\",iniTurma!$B$4:$M$53,9,0),\"\")","v":0},{"$f":"IF(B7=B6+1,iniTurma!$J$1,\"\")","v":12.363636363636363},{"$f":"IF(AND(iniTurma!$A$2=1,B7=B6+1),SMALL(iniTurma!$J$4:$J$53,1),\"\")","v":6},{"$f":"IF(AND(iniTurma!$A$2=1,B7=B6+1),LARGE(iniTurma!$J$4:$J$53,1),\"\")","v":20},{"$f":"IF(AND(iniTurma!$A$2=1,B7=B6+1),VLOOKUP(\"x\",'iniScore Z'!$A$4:$L$53,9,0),\"\")","v":""},"Lançar",{"$f":"IF(B7=B6+1,iniTurma!$J$2,\"\")","v":4.3332273773865397},"HABILIDADES DE CONTROLO DE OBJETOS",2,"Lançar",0,12.363636363636363,6,20]
[{"$f":"COUNT(iniTurma!K4:K53)","v":12},6,{"$f":"iniTurma!K3","v":"Equilíbrio"},{"$f":"IF(AND(iniTurma!$A$2=1,B8=B7+1),VLOOKUP(\"x\",iniTurma!$B$4:$M$53,10,0),\"\")","v":10.119999999999999},{"$f":"IF(B8=B7+1,iniTurma!$K$1,\"\")","v":10.951666666666668},{"$f":"IF(AND(iniTurma!$A$2=1,B8=B7+1),SMALL(iniTurma!$K$4:$K$53,1),\"\")","v":9.5},{"$f":"IF(AND(iniTurma!$A$2=1,B8=B7+1),LARGE(iniTurma!$K$4:$K$53,1),\"\")","v":14},{"$f":"IF(AND(iniTurma!$A$2=1,B8=B7+1),VLOOKUP(\"x\",'iniScore Z'!$A$4:$L$53,10,0),\"\")","v":-0.60633535627938573},"Equilíbrio",{"$f":"IF(B8=B7+1,iniTurma!$K$2,\"\")","v":1.3716281890107287},"HABILIDADE DE ESTABILIZAÇÃO",1,"Equilíbrio",10.119999999999999,10.951666666666668,9.5,14]
[]
[]
[]
[]
[null,null,"Dados para o gráfico","Score Z"]
[null,null,{"$f":"IF(iniTurma!A2=1,IFERROR(VLOOKUP(1,iniAuxiliar!B3:G10,2,0),\"\"),\"\")","v":"Corrida vaivém"},{"$f":"IF(iniTurma!A2=1,IFERROR(VLOOKUP(1,iniAuxiliar!B3:H10,7,0),\"\"),\"\")","v":-0.61972491750343039}]
[null,null,{"$f":"IF(iniTurma!A2=1,IFERROR(VLOOKUP(2,iniAuxiliar!B3:G10,2,0),\"\"),\"\")","v":"Corrida velocidade"},{"$f":"IF(iniTurma!A2=1,IFERROR(VLOOKUP(2,iniAuxiliar!B3:H10,7,0),\"\"),\"\")","v":1.0425720702853734}]
[null,null,{"$f":"IF(iniTurma!A2=1,IFERROR(VLOOKUP(3,iniAuxiliar!B3:G10,2,0),\"\"),\"\")","v":"Salto horizontal"},{"$f":"IF(iniTurma!A2=1,IFERROR(VLOOKUP(3,iniAuxiliar!B3:H10,7,0),\"\"),\"\")","v":0.41316997543435507}]
[null,null,{"$f":"IF(iniTurma!A2=1,IFERROR(VLOOKUP(4,iniAuxiliar!B3:G10,2,0),\"\"),\"\")","v":"Receber"},{"$f":"IF(iniTurma!A2=1,IFERROR(VLOOKUP(4,iniAuxiliar!B3:H10,7,0),\"\"),\"\")","v":0.27792399673660301}]
[null,null,{"$f":"IF(iniTurma!A2=1,IFERROR(VLOOKUP(5,iniAuxiliar!B3:G10,2,0),\"\"),\"\")","v":"Lançar"},{"$f":"IF(iniTurma!A2=1,IFERROR(VLOOKUP(5,iniAuxiliar!B3:H10,7,0),\"\"),\"\")","v":""}]
[null,null,{"$f":"IF(iniTurma!A2=1,IFERROR(VLOOKUP(6,iniAuxiliar!B3:G10,2,0),\"\"),\"\")","v":"Equilíbrio"},{"$f":"IF(iniTurma!A2=1,IFERROR(VLOOKUP(6,iniAuxiliar!B3:H10,7,0),\"\"),\"\")","v":-0.60633535627938573}]
[null,null,{"$f":"IF(iniTurma!A2=1,IFERROR(VLOOKUP(7,iniAuxiliar!B3:G10,2,0),\"\"),\"\")","v":""},{"$f":"IF(iniTurma!A2=1,IFERROR(VLOOKUP(7,iniAuxiliar!B4:H11,7,0),\"\"),\"\")","v":""}]
[null,null,{"$f":"IF(iniTurma!A2=1,IFERROR(VLOOKUP(8,iniAuxiliar!B3:G10,2,0),\"\"),\"\")","v":""},{"$f":"IF(iniTurma!A2=1,IFERROR(VLOOKUP(8,iniAuxiliar!B3:H10,7,0),\"\"),\"\")","v":""}]

{"sheet":"fimAuxiliar","index":9,"n_rows":21,"n_cols":24,"rows_kept":21,"cut":false,"hidden":true,"merged":[]}
["Número","Ordem Resumo","Teste","Criança","Média","Mínimo","Máximo","Score Z","Nome Gráfico","Dpadrão","Grupo","Ordem Relatório","Nome","Criança","Média","Mínimo","Máximo","Melhor","difMédia","Conclusão","Teste T","média","dpadrão","dpadrão"]
[null,0,null,"fim","fim","fim","fim","fim",null,"fim",null,null,null,"fim","fim","fim","fim",null,null,null,null,"ini","ini","fim"]
[{"$f":"COUNT(fimTurma!F4:F53)","v":12},{"$f":"IF(A3>0,B2+1,B2)","v":1},{"$f":"fimTurma!F3","v":"Corrida vaivém"},{"$f":"IF(AND(fimTurma!$A$2=1,B3=B2+1),VLOOKUP(\"x\",fimTurma!$B$4:$M$53,5,0),\"\")","v":15.5},{"$f":"IF(B3=B2+1,fimTurma!$F$1,\"\")","v":15.374999999999998},{"$f":"IF(AND(fimTurma!$A$2=1,B3=B2+1),SMALL(fimTurma!$F$4:$F$53,1),\"\")","v":14.6},{"$f":"IF(AND(fimTurma!$A$2=1,B3=B2+1),LARGE(fimTurma!$F$4:$F$53,1),\"\")","v":16.3},{"$f":"IF(AND(fimTurma!$A$2=1,B3=B2+1),VLOOKUP(\"x\",'fimScore Z'!$A$4:$L$53,5,0),\"\")","v":0.24663181183349836},{"$f":"C3","v":"Corrida vaivém"},{"$f":"IF(B3=B2+1,fimTurma!$F$2,\"\")","v":0.5068283733178327},"HABILIDADES DE LOCOMOÇÃO",{"$f":"IF(K3<>K2,IF(A3>0,1,0),IF(A3>0,L2+1,L2))","v":1},{"$f":"C3","v":"Corrida vaivém"},{"$f":"D3","v":15.5},{"$f":"E3","v":15.374999999999998},14.6,16.3,-1,{"$f":"IF(AND(E3<>\"\",iniAuxiliar!E3<>\"\"),E3-iniAuxiliar!E3,\"\")","v":3.0174999999999983},{"$f":"IF(AND(E3<>\"\",iniAuxiliar!E3<>\"\"),IF(U3*R3<=0,\"Não\",IF(U3>=0.05,\"Não\",\"Sim\")),\"\")","v":"Não"},{"$f":"IF(AND(E3<>\"\",iniAuxiliar!E3<>\"\"),IFERROR(_xlfn.T.TEST(iniTurma!F$4:F$53,fimTurma!F$4:F$53,1,1),_xlfn.T.TEST(iniTurma!F$4:F$53,fimTurma!F$4:F$53,1,2)),\"\")","v":2.1838664566690021E-6},{"$f":"iniAuxiliar!E3","v":12.3575},{"$f":"iniAuxiliar!J3","v":1.1577717463587831},{"$f":"J3","v":0.5068283733178327}]
[{"$f":"COUNT(fimTurma!G4:G53)","v":12},{"$f":"IF(A4>0,B3+1,B3)","v":2},{"$f":"fimTurma!G3","v":"Corrida velocidade"},{"$f":"IF(AND(fimTurma!$A$2=1,B4=B3+1),VLOOKUP(\"x\",fimTurma!$B$4:$M$53,6,0),\"\")","v":12},{"$f":"IF(B4=B3+1,fimTurma!$G$1,\"\")","v":11.75},{"$f":"IF(AND(fimTurma!$A$2=1,B4=B3+1),SMALL(fimTurma!$G$4:$G$53,1),\"\")","v":9},{"$f":"IF(AND(fimTurma!$A$2=1,B4=B3+1),LARGE(fimTurma!$G$4:$G$53,1),\"\")","v":14},{"$f":"IF(AND(fimTurma!$A$2=1,B4=B3+1),VLOOKUP(\"x\",'fimScore Z'!$A$4:$L$53,6,0),\"\")","v":0.19245008972987526},{"$f":"C4","v":"Corrida velocidade"},{"$f":"IF(B4=B3+1,fimTurma!$G$2,\"\")","v":1.299038105676658},"HABILIDADES DE LOCOMOÇÃO",{"$f":"IF(K4<>K3,IF(A4>0,1,0),IF(A4>0,L3+1,L3))","v":2},{"$f":"C4","v":"Corrida velocidade"},12,11.75,9,14,-1,{"$f":"IF(AND(E4<>\"\",iniAuxiliar!E4<>\"\"),E4-iniAuxiliar!E4,\"\")","v":-1.5833333333333339},{"$f":"IF(AND(E4<>\"\",iniAuxiliar!E4<>\"\"),IF(U4*R4<=0,\"Não\",IF(U4>=0.05,\"Não\",\"Sim\")),\"\")","v":"Não"},{"$f":"IF(AND(E4<>\"\",iniAuxiliar!E4<>\"\"),IFERROR(_xlfn.T.TEST(iniTurma!G$4:G$53,fimTurma!G$4:G$53,1,1),_xlfn.T.TEST(iniTurma!G$4:G$53,fimTurma!G$4:G$53,1,2)),\"\")","v":1.4734618219787993E-2},{"$f":"iniAuxiliar!E4","v":13.333333333333334},{"$f":"iniAuxiliar!J4","v":1.5986105077709065},{"$f":"J4","v":1.299038105676658}]
[{"$f":"COUNT(fimTurma!H4:H53)","v":11},3,{"$f":"fimTurma!H3","v":"Salto horizontal"},{"$f":"IF(AND(fimTurma!$A$2=1,B5=B4+1),VLOOKUP(\"x\",fimTurma!$B$4:$M$53,7,0),\"\")","v":7},{"$f":"IF(B5=B4+1,fimTurma!$H$1,\"\")","v":7.7636363636363646},{"$f":"IF(AND(fimTurma!$A$2=1,B5=B4+1),SMALL(fimTurma!$H$4:$H$53,1),\"\")","v":6.5},{"$f":"IF(AND(fimTurma!$A$2=1,B5=B4+1),LARGE(fimTurma!$H$4:$H$53,1),\"\")","v":10.199999999999999},{"$f":"IF(AND(fimTurma!$A$2=1,B5=B4+1),VLOOKUP(\"x\",'fimScore Z'!$A$4:$L$53,7,0),\"\")","v":-0.7904853968246297},"Salto horizontal",{"$f":"IF(B5=B4+1,fimTurma!$H$2,\"\")","v":0.96603475118437687},"HABILIDADES DE LOCOMOÇÃO",3,"Salto horizontal",7,7.7636363636363646,6.5,10.199999999999999,1,{"$f":"IF(AND(E5<>\"\",iniAuxiliar!E5<>\"\"),E5-iniAuxiliar!E5,\"\")","v":-1.2696969696969687},{"$f":"IF(AND(E5<>\"\",iniAuxiliar!E5<>\"\"),IF(U5*R5<=0,\"Não\",IF(U5>=0.05,\"Não\",\"Sim\")),\"\")","v":"Não"},{"$f":"IF(AND(E5<>\"\",iniAuxiliar!E5<>\"\"),IFERROR(_xlfn.T.TEST(iniTurma!H$4:H$53,fimTurma!H$4:H$53,1,1),_xlfn.T.TEST(iniTurma!H$4:H$53,fimTurma!H$4:H$53,1,2)),\"\")","v":9.5792366204519225E-2},{"$f":"iniAuxiliar!E5","v":9.0333333333333332},{"$f":"iniAuxiliar!J5","v":2.3396343493992631},0.96603475118437687]
[{"$f":"COUNT(fimTurma!I4:I53)","v":11},4,{"$f":"fimTurma!I3","v":"Receber"},{"$f":"IF(AND(fimTurma!$A$2=1,B6=B5+1),VLOOKUP(\"x\",fimTurma!$B$4:$M$53,8,0),\"\")","v":0},{"$f":"IF(B6=B5+1,fimTurma!$I$1,\"\")","v":34.527272727272731},{"$f":"IF(AND(fimTurma!$A$2=1,B6=B5+1),SMALL(fimTurma!$I$4:$I$53,1),\"\")","v":30},{"$f":"IF(AND(fimTurma!$A$2=1,B6=B5+1),LARGE(fimTurma!$I$4:$I$53,1),\"\")","v":41},{"$f":"IF(AND(fimTurma!$A$2=1,B6=B5+1),VLOOKUP(\"x\",'fimScore Z'!$A$4:$L$53,8,0),\"\")","v":""},"Receber",{"$f":"IF(B6=B5+1,fimTurma!$I$2,\"\")","v":3.0766247471394266},"HABILIDADES DE CONTROLO DE OBJETOS",1,"Receber",0,34.527272727272731,30,41,1,{"$f":"IF(AND(E6<>\"\",iniAuxiliar!E6<>\"\"),E6-iniAuxiliar!E6,\"\")","v":4.6606060606060673},{"$f":"IF(AND(E6<>\"\",iniAuxiliar!E6<>\"\"),IF(U6*R6<=0,\"Não\",IF(U6>=0.05,\"Não\",\"Sim\")),\"\")","v":"Sim"},{"$f":"IF(AND(E6<>\"\",iniAuxiliar!E6<>\"\"),IFERROR(_xlfn.T.TEST(iniTurma!I$4:I$53,fimTurma!I$4:I$53,1,1),_xlfn.T.TEST(iniTurma!I$4:I$53,fimTurma!I$4:I$53,1,2)),\"\")","v":3.7411206561437215E-3},{"$f":"iniAuxiliar!E6","v":29.866666666666664},{"$f":"iniAuxiliar!J6","v":4.0778534658431482},3.0766247471394266]
[{"$f":"COUNT(fimTurma!J4:J53)","v":12},5,{"$f":"fimTurma!J3","v":"Lançar"},{"$f":"IF(AND(fimTurma!$A$2=1,B7=B6+1),VLOOKUP(\"x\",fimTurma!$B$4:$M$53,9,0),\"\")","v":11},{"$f":"IF(B7=B6+1,fimTurma!$J$1,\"\")","v":15.5},{"$f":"IF(AND(fimTurma!$A$2=1,B7=B6+1),SMALL(fimTurma!$J$4:$J$53,1),\"\")","v":10},{"$f":"IF(AND(fimTurma!$A$2=1,B7=B6+1),LARGE(fimTurma!$J$4:$J$53,1),\"\")","v":21},{"$f":"IF(AND(fimTurma!$A$2=1,B7=B6+1),VLOOKUP(\"x\",'fimScore Z'!$A$4:$L$53,9,0),\"\")","v":-1.3035722838802226},"Lançar",{"$f":"IF(B7=B6+1,fimTurma!$J$2,\"\")","v":3.4520525295346629},"HABILIDADES DE CONTROLO DE OBJETOS",2,"Lançar",11,15.5,10,21,1,{"$f":"IF(AND(E7<>\"\",iniAuxiliar!E7<>\"\"),E7-iniAuxiliar!E7,\"\")","v":3.1363636363636367},{"$f":"IF(AND(E7<>\"\",iniAuxiliar!E7<>\"\"),IF(U7*R7<=0,\"Não\",IF(U7>=0.05,\"Não\",\"Sim\")),\"\")","v":"Sim"},{"$f":"IF(AND(E7<>\"\",iniAuxiliar!E7<>\"\"),IFERROR(_xlfn.T.TEST(iniTurma!J$4:J$53,fimTurma!J$4:J$53,1,1),_xlfn.T.TEST(iniTurma!J$4:J$53,fimTurma!J$4:J$53,1,2)),\"\")","v":4.8532468542686448E-3},{"$f":"iniAuxiliar!E7","v":12.363636363636363},{"$f":"iniAuxiliar!J7","v":4.3332273773865397},3.4520525295346629]
[{"$f":"COUNT(fimTurma!K4:K53)","v":12},6,{"$f":"fimTurma!K3","v":"Equilíbrio"},{"$f":"IF(AND(fimTurma!$A$2=1,B8=B7+1),VLOOKUP(\"x\",fimTurma!$B$4:$M$53,10,0),\"\")","v":10.199999999999999},{"$f":"IF(B8=B7+1,fimTurma!$K$1,\"\")","v":9.7416666666666654},{"$f":"IF(AND(fimTurma!$A$2=1,B8=B7+1),SMALL(fimTurma!$K$4:$K$53,1),\"\")","v":7.6},{"$f":"IF(AND(fimTurma!$A$2=1,B8=B7+1),LARGE(fimTurma!$K$4:$K$53,1),\"\")","v":11.5},{"$f":"IF(AND(fimTurma!$A$2=1,B8=B7+1),VLOOKUP(\"x\",'fimScore Z'!$A$4:$L$53,10,0),\"\")","v":0.41064219677096353},"Equilíbrio",{"$f":"IF(B8=B7+1,fimTurma!$K$2,\"\")","v":1.1161379345264175},"HABILIDADE DE ESTABILIZAÇÃO",1,"Equilíbrio",10.199999999999999,9.7416666666666654,7.6,11.5,-1,{"$f":"IF(AND(E8<>\"\",iniAuxiliar!E8<>\"\"),E8-iniAuxiliar!E8,\"\")","v":-1.2100000000000026},{"$f":"IF(AND(E8<>\"\",iniAuxiliar!E8<>\"\"),IF(U8*R8<=0,\"Não\",IF(U8>=0.05,\"Não\",\"Sim\")),\"\")","v":"Não"},{"$f":"IF(AND(E8<>\"\",iniAuxiliar!E8<>\"\"),IFERROR(_xlfn.T.TEST(iniTurma!K$4:K$53,fimTurma!K$4:K$53,1,1),_xlfn.T.TEST(iniTurma!K$4:K$53,fimTurma!K$4:K$53,1,2)),\"\")","v":7.5162882125197157E-3},{"$f":"iniAuxiliar!E8","v":10.951666666666668},{"$f":"iniAuxiliar!J8","v":1.3716281890107287},1.1161379345264175]
[]
[]
[]
[]
[null,null,"Dados para o gráfico","Score Z"]
[null,null,{"$f":"IF(fimTurma!A2=1,IFERROR(VLOOKUP(1,fimAuxiliar!B3:G10,2,0),\"\"),\"\")","v":"Corrida vaivém"},{"$f":"IF(fimTurma!A2=1,IFERROR(VLOOKUP(1,fimAuxiliar!B3:H10,7,0),\"\"),\"\")","v":0.24663181183349836}]
[null,null,{"$f":"IF(fimTurma!A2=1,IFERROR(VLOOKUP(2,fimAuxiliar!B3:G10,2,0),\"\"),\"\")","v":"Corrida velocidade"},{"$f":"IF(fimTurma!A2=1,IFERROR(VLOOKUP(2,fimAuxiliar!B3:H10,7,0),\"\"),\"\")","v":0.19245008972987526}]
[null,null,{"$f":"IF(fimTurma!A2=1,IFERROR(VLOOKUP(3,fimAuxiliar!B3:G10,2,0),\"\"),\"\")","v":"Salto horizontal"},{"$f":"IF(fimTurma!A2=1,IFERROR(VLOOKUP(3,fimAuxiliar!B3:H10,7,0),\"\"),\"\")","v":-0.7904853968246297}]
[null,null,{"$f":"IF(fimTurma!A2=1,IFERROR(VLOOKUP(4,fimAuxiliar!B3:G10,2,0),\"\"),\"\")","v":"Receber"},{"$f":"IF(fimTurma!A2=1,IFERROR(VLOOKUP(4,fimAuxiliar!B3:H10,7,0),\"\"),\"\")","v":""}]
[null,null,{"$f":"IF(fimTurma!A2=1,IFERROR(VLOOKUP(5,fimAuxiliar!B3:G10,2,0),\"\"),\"\")","v":"Lançar"},{"$f":"IF(fimTurma!A2=1,IFERROR(VLOOKUP(5,fimAuxiliar!B3:H10,7,0),\"\"),\"\")","v":-1.3035722838802226}]
[null,null,{"$f":"IF(fimTurma!A2=1,IFERROR(VLOOKUP(6,fimAuxiliar!B3:G10,2,0),\"\"),\"\")","v":"Equilíbrio"},{"$f":"IF(fimTurma!A2=1,IFERROR(VLOOKUP(6,fimAuxiliar!B3:H10,7,0),\"\"),\"\")","v":0.41064219677096353}]
[null,null,{"$f":"IF(fimTurma!A2=1,IFERROR(VLOOKUP(7,fimAuxiliar!B3:G10,2,0),\"\"),\"\")","v":""},{"$f":"IF(fimTurma!A2=1,IFERROR(VLOOKUP(7,fimAuxiliar!B4:H11,7,0),\"\"),\"\")","v":""}]
[null,null,{"$f":"IF(fimTurma!A2=1,IFERROR(VLOOKUP(8,fimAuxiliar!B3:G10,2,0),\"\"),\"\")","v":""},{"$f":"IF(fimTurma!A2=1,IFERROR(VLOOKUP(8,fimAuxiliar!B3:H10,7,0),\"\"),\"\")","v":""}]

{"sheet":"difAuxiliar","index":10,"n_rows":61,"n_cols":13,"rows_kept":61,"cut":false,"hidden":true,"merged":[]}
[]
[null,null,null,null,"Melhor:",-1,-1,1,1,-1,-1,1,-1]
[{"$f":"fimTurma!A3","v":"ID Aluno"},null,{"$f":"fimTurma!C3","v":"Nome"},null,null,{"$f":"fimTurma!F3","v":"Corrida vaivém"},{"$f":"fimTurma!G3","v":"Corrida velocidade"},{"$f":"fimTurma!H3","v":"Salto horizontal"},{"$f":"fimTurma!I3","v":"Receber"},{"$f":"fimTurma!J3","v":"Lançar"},{"$f":"fimTurma!K3","v":"Equilíbrio"},{"$f":"fimTurma!L3","v":0},{"$f":"fimTurma!M3","v":0}]
[{"$f":"fimTurma!A4","v":1},null,{"$f":"fimTurma!C4","v":"Micas"},null,null,{"$f":"fimTurma!F4-iniTurma!F4","v":1.8800000000000008},{"$f":"fimTurma!G4-iniTurma!G4","v":-1},{"$f":"fimTurma!H4-iniTurma!H4","v":0.5},{"$f":"fimTurma!I4-iniTurma!I4","v":3},{"$f":"fimTurma!J4-iniTurma!J4","v":2},{"$f":"fimTurma!K4-iniTurma!K4","v":-1},{"$f":"fimTurma!L4-iniTurma!L4","v":0},{"$f":"fimTurma!M4-iniTurma!M4","v":0}]
[{"$f":"fimTurma!A5","v":2},null,{"$f":"fimTurma!C5","v":"Tecas"},null,null,{"$f":"fimTurma!F5-iniTurma!F5","v":3.0700000000000003},{"$f":"fimTurma!G5-iniTurma!G5","v":-2},{"$f":"fimTurma!H5-iniTurma!H5","v":0},{"$f":"fimTurma!I5-iniTurma!I5","v":-38},{"$f":"fimTurma!J5-iniTurma!J5","v":2},{"$f":"fimTurma!K5-iniTurma!K5","v":0},{"$f":"fimTurma!L5-iniTurma!L5","v":0},{"$f":"fimTurma!M5-iniTurma!M5","v":0}]
[{"$f":"fimTurma!A6","v":3},null,{"$f":"fimTurma!C6","v":"Lecas"},null,null,{"$f":"fimTurma!F6-iniTurma!F6","v":6},{"$f":"fimTurma!G6-iniTurma!G6","v":-1},{"$f":"fimTurma!H6-iniTurma!H6","v":-0.30000000000000071},{"$f":"fimTurma!I6-iniTurma!I6","v":9},{"$f":"fimTurma!J6-iniTurma!J6","v":0},{"$f":"fimTurma!K6-iniTurma!K6","v":0},{"$f":"fimTurma!L6-iniTurma!L6","v":0},{"$f":"fimTurma!M6-iniTurma!M6","v":0}]
[{"$f":"fimTurma!A7","v":4},null,{"$f":"fimTurma!C7","v":"Becas"},null,null,{"$f":"fimTurma!F7-iniTurma!F7","v":3.26},{"$f":"fimTurma!G7-iniTurma!G7","v":-4},{"$f":"fimTurma!H7-iniTurma!H7","v":-10},{"$f":"fimTurma!I7-iniTurma!I7","v":8},{"$f":"fimTurma!J7-iniTurma!J7","v":13},{"$f":"fimTurma!K7-iniTurma!K7","v":-1.42},{"$f":"fimTurma!L7-iniTurma!L7","v":0},{"$f":"fimTurma!M7-iniTurma!M7","v":0}]
[{"$f":"fimTurma!A8","v":5},null,{"$f":"fimTurma!C8","v":"Nocas"},null,null,{"$f":"fimTurma!F8-iniTurma!F8","v":3.2000000000000011},{"$f":"fimTurma!G8-iniTurma!G8","v":2},{"$f":"fimTurma!H8-iniTurma!H8","v":0.20000000000000018},{"$f":"fimTurma!I8-iniTurma!I8","v":17},{"$f":"fimTurma!J8-iniTurma!J8","v":8},{"$f":"fimTurma!K8-iniTurma!K8","v":-2.4000000000000004},{"$f":"fimTurma!L8-iniTurma!L8","v":0},{"$f":"fimTurma!M8-iniTurma!M8","v":0}]
[{"$f":"fimTurma!A9","v":6},null,{"$f":"fimTurma!C9","v":"Françoise Hardy"},null,null,{"$f":"fimTurma!F9-iniTurma!F9","v":1.9000000000000004},{"$f":"fimTurma!G9-iniTurma!G9","v":-4},{"$f":"fimTurma!H9-iniTurma!H9","v":0.40000000000000036},{"$f":"fimTurma!I9-iniTurma!I9","v":9},{"$f":"fimTurma!J9-iniTurma!J9","v":-2},{"$f":"fimTurma!K9-iniTurma!K9","v":1.5},{"$f":"fimTurma!L9-iniTurma!L9","v":0},{"$f":"fimTurma!M9-iniTurma!M9","v":0}]
[{"$f":"fimTurma!A10","v":7},null,{"$f":"fimTurma!C10","v":"Asterix"},null,null,{"$f":"fimTurma!F10-iniTurma!F10","v":4.0999999999999996},{"$f":"fimTurma!G10-iniTurma!G10","v":-3},{"$f":"fimTurma!H10-iniTurma!H10","v":-3.4000000000000004},{"$f":"fimTurma!I10-iniTurma!I10","v":-4},{"$f":"fimTurma!J10-iniTurma!J10","v":8},{"$f":"fimTurma!K10-iniTurma!K10","v":-2.1999999999999993},{"$f":"fimTurma!L10-iniTurma!L10","v":0},{"$f":"fimTurma!M10-iniTurma!M10","v":0}]
[{"$f":"fimTurma!A11","v":8},null,{"$f":"fimTurma!C11","v":"Obelix"},null,null,{"$f":"fimTurma!F11-iniTurma!F11","v":2.1000000000000014},{"$f":"fimTurma!G11-iniTurma!G11","v":-3},{"$f":"fimTurma!H11-iniTurma!H11","v":-7.6999999999999993},{"$f":"fimTurma!I11-iniTurma!I11","v":3},{"$f":"fimTurma!J11-iniTurma!J11","v":5},{"$f":"fimTurma!K11-iniTurma!K11","v":-3.0999999999999996},{"$f":"fimTurma!L11-iniTurma!L11","v":0},{"$f":"fimTurma!M11-iniTurma!M11","v":0}]
[{"$f":"fimTurma!A12","v":9},null,{"$f":"fimTurma!C12","v":"Ideiafix"},null,null,{"$f":"fimTurma!F12-iniTurma!F12","v":1.5},{"$f":"fimTurma!G12-iniTurma!G12","v":-3},{"$f":"fimTurma!H12-iniTurma!H12","v":-3.8},{"$f":"fimTurma!I12-iniTurma!I12","v":4.2000000000000028},{"$f":"fimTurma!J12-iniTurma!J12","v":7},{"$f":"fimTurma!K12-iniTurma!K12","v":-1.6999999999999993},{"$f":"fimTurma!L12-iniTurma!L12","v":0},{"$f":"fimTurma!M12-iniTurma!M12","v":0}]
[{"$f":"fimTurma!A13","v":10},null,{"$f":"fimTurma!C13","v":"Sylvie Vartan"},null,null,{"$f":"fimTurma!F13-iniTurma!F13","v":3.5},{"$f":"fimTurma!G13-iniTurma!G13","v":-3},{"$f":"fimTurma!H13-iniTurma!H13","v":1.0000000000000009},{"$f":"fimTurma!I13-iniTurma!I13","v":4.1000000000000014},{"$f":"fimTurma!J13-iniTurma!J13","v":-1},{"$f":"fimTurma!K13-iniTurma!K13","v":-3.5},{"$f":"fimTurma!L13-iniTurma!L13","v":0},{"$f":"fimTurma!M13-iniTurma!M13","v":0}]
[{"$f":"fimTurma!A14","v":11},null,{"$f":"fimTurma!C14","v":"Carlos Lopes"},null,null,{"$f":"fimTurma!F14-iniTurma!F14","v":3.6000000000000014},{"$f":"fimTurma!G14-iniTurma!G14","v":2},{"$f":"fimTurma!H14-iniTurma!H14","v":1.8999999999999986},{"$f":"fimTurma!I14-iniTurma!I14","v":1.2999999999999972},{"$f":"fimTurma!J14-iniTurma!J14","v":4},{"$f":"fimTurma!K14-iniTurma!K14","v":-0.5},{"$f":"fimTurma!L14-iniTurma!L14","v":0},{"$f":"fimTurma!M14-iniTurma!M14","v":0}]
[{"$f":"fimTurma!A15","v":12},null,{"$f":"fimTurma!C15","v":"Rosa Mota"},null,null,{"$f":"fimTurma!F15-iniTurma!F15","v":2.0999999999999996},{"$f":"fimTurma!G15-iniTurma!G15","v":1},{"$f":"fimTurma!H15-iniTurma!H15","v":-1.8000000000000007},{"$f":"fimTurma!I15-iniTurma!I15","v":4.8000000000000043},{"$f":"fimTurma!J15-iniTurma!J15","v":4},{"$f":"fimTurma!K15-iniTurma!K15","v":-0.19999999999999929},{"$f":"fimTurma!L15-iniTurma!L15","v":0},{"$f":"fimTurma!M15-iniTurma!M15","v":0}]
[{"$f":"fimTurma!A16","v":13},null,{"$f":"fimTurma!C16","v":""},null,null,{"$f":"fimTurma!F16-iniTurma!F16","v":0},{"$f":"fimTurma!G16-iniTurma!G16","v":0},{"$f":"fimTurma!H16-iniTurma!H16","v":0},{"$f":"fimTurma!I16-iniTurma!I16","v":0},{"$f":"fimTurma!J16-iniTurma!J16","v":0},{"$f":"fimTurma!K16-iniTurma!K16","v":0},{"$f":"fimTurma!L16-iniTurma!L16","v":0},{"$f":"fimTurma!M16-iniTurma!M16","v":0}]
[{"$f":"fimTurma!A17","v":14},null,{"$f":"fimTurma!C17","v":""},null,null,{"$f":"fimTurma!F17-iniTurma!F17","v":0},{"$f":"fimTurma!G17-iniTurma!G17","v":0},{"$f":"fimTurma!H17-iniTurma!H17","v":0},{"$f":"fimTurma!I17-iniTurma!I17","v":0},{"$f":"fimTurma!J17-iniTurma!J17","v":0},{"$f":"fimTurma!K17-iniTurma!K17","v":0},{"$f":"fimTurma!L17-iniTurma!L17","v":0},{"$f":"fimTurma!M17-iniTurma!M17","v":0}]
[{"$f":"fimTurma!A18","v":15},null,{"$f":"fimTurma!C18","v":""},null,null,{"$f":"fimTurma!F18-iniTurma!F18","v":0},{"$f":"fimTurma!G18-iniTurma!G18","v":0},{"$f":"fimTurma!H18-iniTurma!H18","v":0},{"$f":"fimTurma!I18-iniTurma!I18","v":0},{"$f":"fimTurma!J18-iniTurma!J18","v":0},{"$f":"fimTurma!K18-iniTurma!K18","v":0},{"$f":"fimTurma!L18-iniTurma!L18","v":0},{"$f":"fimTurma!M18-iniTurma!M18","v":0}]
[{"$f":"fimTurma!A19","v":16},null,{"$f":"fimTurma!C19","v":""},null,null,{"$f":"fimTurma!F19-iniTurma!F19","v":0},{"$f":"fimTurma!G19-iniTurma!G19","v":0},{"$f":"fimTurma!H19-iniTurma!H19","v":0},{"$f":"fimTurma!I19-iniTurma!I19","v":0},{"$f":"fimTurma!J19-iniTurma!J19","v":0},{"$f":"fimTurma!K19-iniTurma!K19","v":0},{"$f":"fimTurma!L19-iniTurma!L19","v":0},{"$f":"fimTurma!M19-iniTurma!M19","v":0}]
[{"$f":"fimTurma!A20","v":17},null,{"$f":"fimTurma!C20","v":""},null,null,{"$f":"fimTurma!F20-iniTurma!F20","v":0},{"$f":"fimTurma!G20-iniTurma!G20","v":0},{"$f":"fimTurma!H20-iniTurma!H20","v":0},{"$f":"fimTurma!I20-iniTurma!I20","v":0},{"$f":"fimTurma!J20-iniTurma!J20","v":0},{"$f":"fimTurma!K20-iniTurma!K20","v":0},{"$f":"fimTurma!L20-iniTurma!L20","v":0},{"$f":"fimTurma!M20-iniTurma!M20","v":0}]
[{"$f":"fimTurma!A21","v":18},null,{"$f":"fimTurma!C21","v":""},null,null,{"$f":"fimTurma!F21-iniTurma!F21","v":0},{"$f":"fimTurma!G21-iniTurma!G21","v":0},{"$f":"fimTurma!H21-iniTurma!H21","v":0},{"$f":"fimTurma!I21-iniTurma!I21","v":0},{"$f":"fimTurma!J21-iniTurma!J21","v":0},{"$f":"fimTurma!K21-iniTurma!K21","v":0},{"$f":"fimTurma!L21-iniTurma!L21","v":0},{"$f":"fimTurma!M21-iniTurma!M21","v":0}]
[{"$f":"fimTurma!A22","v":19},null,{"$f":"fimTurma!C22","v":""},null,null,{"$f":"fimTurma!F22-iniTurma!F22","v":0},{"$f":"fimTurma!G22-iniTurma!G22","v":0},{"$f":"fimTurma!H22-iniTurma!H22","v":0},{"$f":"fimTurma!I22-iniTurma!I22","v":0},{"$f":"fimTurma!J22-iniTurma!J22","v":0},{"$f":"fimTurma!K22-iniTurma!K22","v":0},{"$f":"fimTurma!L22-iniTurma!L22","v":0},{"$f":"fimTurma!M22-iniTurma!M22","v":0}]
[{"$f":"fimTurma!A23","v":20},null,{"$f":"fimTurma!C23","v":""},null,null,{"$f":"fimTurma!F23-iniTurma!F23","v":0},{"$f":"fimTurma!G23-iniTurma!G23","v":0},{"$f":"fimTurma!H23-iniTurma!H23","v":0},{"$f":"fimTurma!I23-iniTurma!I23","v":0},{"$f":"fimTurma!J23-iniTurma!J23","v":0},{"$f":"fimTurma!K23-iniTurma!K23","v":0},{"$f":"fimTurma!L23-iniTurma!L23","v":0},{"$f":"fimTurma!M23-iniTurma!M23","v":0}]
[{"$f":"fimTurma!A24","v":21},null,{"$f":"fimTurma!C24","v":""},null,null,{"$f":"fimTurma!F24-iniTurma!F24","v":0},{"$f":"fimTurma!G24-iniTurma!G24","v":0},{"$f":"fimTurma!H24-iniTurma!H24","v":0},{"$f":"fimTurma!I24-iniTurma!I24","v":0},{"$f":"fimTurma!J24-iniTurma!J24","v":0},{"$f":"fimTurma!K24-iniTurma!K24","v":0},{"$f":"fimTurma!L24-iniTurma!L24","v":0},{"$f":"fimTurma!M24-iniTurma!M24","v":0}]
[{"$f":"fimTurma!A25","v":22},null,{"$f":"fimTurma!C25","v":""},null,null,{"$f":"fimTurma!F25-iniTurma!F25","v":0},{"$f":"fimTurma!G25-iniTurma!G25","v":0},{"$f":"fimTurma!H25-iniTurma!H25","v":0},{"$f":"fimTurma!I25-iniTurma!I25","v":0},{"$f":"fimTurma!J25-iniTurma!J25","v":0},{"$f":"fimTurma!K25-iniTurma!K25","v":0},{"$f":"fimTurma!L25-iniTurma!L25","v":0},{"$f":"fimTurma!M25-iniTurma!M25","v":0}]
[{"$f":"fimTurma!A26","v":23},null,{"$f":"fimTurma!C26","v":""},null,null,{"$f":"fimTurma!F26-iniTurma!F26","v":0},{"$f":"fimTurma!G26-iniTurma!G26","v":0},{"$f":"fimTurma!H26-iniTurma!H26","v":0},{"$f":"fimTurma!I26-iniTurma!I26","v":0},{"$f":"fimTurma!J26-iniTurma!J26","v":0},{"$f":"fimTurma!K26-iniTurma!K26","v":0},{"$f":"fimTurma!L26-iniTurma!L26","v":0},{"$f":"fimTurma!M26-iniTurma!M26","v":0}]
[{"$f":"fimTurma!A27","v":24},null,{"$f":"fimTurma!C27","v":""},null,null,{"$f":"fimTurma!F27-iniTurma!F27","v":0},{"$f":"fimTurma!G27-iniTurma!G27","v":0},{"$f":"fimTurma!H27-iniTurma!H27","v":0},{"$f":"fimTurma!I27-iniTurma!I27","v":0},{"$f":"fimTurma!J27-iniTurma!J27","v":0},{"$f":"fimTurma!K27-iniTurma!K27","v":0},{"$f":"fimTurma!L27-iniTurma!L27","v":0},{"$f":"fimTurma!M27-iniTurma!M27","v":0}]
[{"$f":"fimTurma!A28","v":25},null,{"$f":"fimTurma!C28","v":""},null,null,{"$f":"fimTurma!F28-iniTurma!F28","v":0},{"$f":"fimTurma!G28-iniTurma!G28","v":0},{"$f":"fimTurma!H28-iniTurma!H28","v":0},{"$f":"fimTurma!I28-iniTurma!I28","v":0},{"$f":"fimTurma!J28-iniTurma!J28","v":0},{"$f":"fimTurma!K28-iniTurma!K28","v":0},{"$f":"fimTurma!L28-iniTurma!L28","v":0},{"$f":"fimTurma!M28-iniTurma!M28","v":0}]
[{"$f":"fimTurma!A29","v":26},null,{"$f":"fimTurma!C29","v":""},null,null,{"$f":"fimTurma!F29-iniTurma!F29","v":0},{"$f":"fimTurma!G29-iniTurma!G29","v":0},{"$f":"fimTurma!H29-iniTurma!H29","v":0},{"$f":"fimTurma!I29-iniTurma!I29","v":0},{"$f":"fimTurma!J29-iniTurma!J29","v":0},{"$f":"fimTurma!K29-iniTurma!K29","v":0},{"$f":"fimTurma!L29-iniTurma!L29","v":0},{"$f":"fimTurma!M29-iniTurma!M29","v":0}]
[{"$f":"fimTurma!A30","v":27},null,{"$f":"fimTurma!C30","v":""},null,null,{"$f":"fimTurma!F30-iniTurma!F30","v":0},{"$f":"fimTurma!G30-iniTurma!G30","v":0},{"$f":"fimTurma!H30-iniTurma!H30","v":0},{"$f":"fimTurma!I30-iniTurma!I30","v":0},{"$f":"fimTurma!J30-iniTurma!J30","v":0},{"$f":"fimTurma!K30-iniTurma!K30","v":0},{"$f":"fimTurma!L30-iniTurma!L30","v":0},{"$f":"fimTurma!M30-iniTurma!M30","v":0}]
[{"$f":"fimTurma!A31","v":28},null,{"$f":"fimTurma!C31","v":""},null,null,{"$f":"fimTurma!F31-iniTurma!F31","v":0},{"$f":"fimTurma!G31-iniTurma!G31","v":0},{"$f":"fimTurma!H31-iniTurma!H31","v":0},{"$f":"fimTurma!I31-iniTurma!I31","v":0},{"$f":"fimTurma!J31-iniTurma!J31","v":0},{"$f":"fimTurma!K31-iniTurma!K31","v":0},{"$f":"fimTurma!L31-iniTurma!L31","v":0},{"$f":"fimTurma!M31-iniTurma!M31","v":0}]
[{"$f":"fimTurma!A32","v":29},null,{"$f":"fimTurma!C32","v":""},null,null,{"$f":"fimTurma!F32-iniTurma!F32","v":0},{"$f":"fimTurma!G32-iniTurma!G32","v":0},{"$f":"fimTurma!H32-iniTurma!H32","v":0},{"$f":"fimTurma!I32-iniTurma!I32","v":0},{"$f":"fimTurma!J32-iniTurma!J32","v":0},{"$f":"fimTurma!K32-iniTurma!K32","v":0},{"$f":"fimTurma!L32-iniTurma!L32","v":0},{"$f":"fimTurma!M32-iniTurma!M32","v":0}]
[{"$f":"fimTurma!A33","v":30},null,{"$f":"fimTurma!C33","v":""},null,null,{"$f":"fimTurma!F33-iniTurma!F33","v":0},{"$f":"fimTurma!G33-iniTurma!G33","v":0},{"$f":"fimTurma!H33-iniTurma!H33","v":0},{"$f":"fimTurma!I33-iniTurma!I33","v":0},{"$f":"fimTurma!J33-iniTurma!J33","v":0},{"$f":"fimTurma!K33-iniTurma!K33","v":0},{"$f":"fimTurma!L33-iniTurma!L33","v":0},{"$f":"fimTurma!M33-iniTurma!M33","v":0}]
[{"$f":"fimTurma!A34","v":31},null,{"$f":"fimTurma!C34","v":""},null,null,{"$f":"fimTurma!F34-iniTurma!F34","v":0},{"$f":"fimTurma!G34-iniTurma!G34","v":0},{"$f":"fimTurma!H34-iniTurma!H34","v":0},{"$f":"fimTurma!I34-iniTurma!I34","v":0},{"$f":"fimTurma!J34-iniTurma!J34","v":0},{"$f":"fimTurma!K34-iniTurma!K34","v":0},{"$f":"fimTurma!L34-iniTurma!L34","v":0},{"$f":"fimTurma!M34-iniTurma!M34","v":0}]
[{"$f":"fimTurma!A35","v":32},null,{"$f":"fimTurma!C35","v":""},null,null,{"$f":"fimTurma!F35-iniTurma!F35","v":0},{"$f":"fimTurma!G35-iniTurma!G35","v":0},{"$f":"fimTurma!H35-iniTurma!H35","v":0},{"$f":"fimTurma!I35-iniTurma!I35","v":0},{"$f":"fimTurma!J35-iniTurma!J35","v":0},{"$f":"fimTurma!K35-iniTurma!K35","v":0},{"$f":"fimTurma!L35-iniTurma!L35","v":0},{"$f":"fimTurma!M35-iniTurma!M35","v":0}]
[{"$f":"fimTurma!A36","v":33},null,{"$f":"fimTurma!C36","v":""},null,null,{"$f":"fimTurma!F36-iniTurma!F36","v":0},{"$f":"fimTurma!G36-iniTurma!G36","v":0},{"$f":"fimTurma!H36-iniTurma!H36","v":0},{"$f":"fimTurma!I36-iniTurma!I36","v":0},{"$f":"fimTurma!J36-iniTurma!J36","v":0},{"$f":"fimTurma!K36-iniTurma!K36","v":0},{"$f":"fimTurma!L36-iniTurma!L36","v":0},{"$f":"fimTurma!M36-iniTurma!M36","v":0}]
[{"$f":"fimTurma!A37","v":34},null,{"$f":"fimTurma!C37","v":""},null,null,{"$f":"fimTurma!F37-iniTurma!F37","v":0},{"$f":"fimTurma!G37-iniTurma!G37","v":0},{"$f":"fimTurma!H37-iniTurma!H37","v":0},{"$f":"fimTurma!I37-iniTurma!I37","v":0},{"$f":"fimTurma!J37-iniTurma!J37","v":0},{"$f":"fimTurma!K37-iniTurma!K37","v":0},{"$f":"fimTurma!L37-iniTurma!L37","v":0},{"$f":"fimTurma!M37-iniTurma!M37","v":0}]
[{"$f":"fimTurma!A38","v":35},null,{"$f":"fimTurma!C38","v":""},null,null,{"$f":"fimTurma!F38-iniTurma!F38","v":0},{"$f":"fimTurma!G38-iniTurma!G38","v":0},{"$f":"fimTurma!H38-iniTurma!H38","v":0},{"$f":"fimTurma!I38-iniTurma!I38","v":0},{"$f":"fimTurma!J38-iniTurma!J38","v":0},{"$f":"fimTurma!K38-iniTurma!K38","v":0},{"$f":"fimTurma!L38-iniTurma!L38","v":0},{"$f":"fimTurma!M38-iniTurma!M38","v":0}]
[{"$f":"fimTurma!A39","v":36},null,{"$f":"fimTurma!C39","v":""},null,null,{"$f":"fimTurma!F39-iniTurma!F39","v":0},{"$f":"fimTurma!G39-iniTurma!G39","v":0},{"$f":"fimTurma!H39-iniTurma!H39","v":0},{"$f":"fimTurma!I39-iniTurma!I39","v":0},{"$f":"fimTurma!J39-iniTurma!J39","v":0},{"$f":"fimTurma!K39-iniTurma!K39","v":0},{"$f":"fimTurma!L39-iniTurma!L39","v":0},{"$f":"fimTurma!M39-iniTurma!M39","v":0}]
[{"$f":"fimTurma!A40","v":37},null,{"$f":"fimTurma!C40","v":""},null,null,{"$f":"fimTurma!F40-iniTurma!F40","v":0},{"$f":"fimTurma!G40-iniTurma!G40","v":0},{"$f":"fimTurma!H40-iniTurma!H40","v":0},{"$f":"fimTurma!I40-iniTurma!I40","v":0},{"$f":"fimTurma!J40-iniTurma!J40","v":0},{"$f":"fimTurma!K40-iniTurma!K40","v":0},{"$f":"fimTurma!L40-iniTurma!L40","v":0},{"$f":"fimTurma!M40-iniTurma!M40","v":0}]
[{"$f":"fimTurma!A41","v":38},null,{"$f":"fimTurma!C41","v":""},null,null,{"$f":"fimTurma!F41-iniTurma!F41","v":0},{"$f":"fimTurma!G41-iniTurma!G41","v":0},{"$f":"fimTurma!H41-iniTurma!H41","v":0},{"$f":"fimTurma!I41-iniTurma!I41","v":0},{"$f":"fimTurma!J41-iniTurma!J41","v":0},{"$f":"fimTurma!K41-iniTurma!K41","v":0},{"$f":"fimTurma!L41-iniTurma!L41","v":0},{"$f":"fimTurma!M41-iniTurma!M41","v":0}]
[{"$f":"fimTurma!A42","v":39},null,{"$f":"fimTurma!C42","v":""},null,null,{"$f":"fimTurma!F42-iniTurma!F42","v":0},{"$f":"fimTurma!G42-iniTurma!G42","v":0},{"$f":"fimTurma!H42-iniTurma!H42","v":0},{"$f":"fimTurma!I42-iniTurma!I42","v":0},{"$f":"fimTurma!J42-iniTurma!J42","v":0},{"$f":"fimTurma!K42-iniTurma!K42","v":0},{"$f":"fimTurma!L42-iniTurma!L42","v":0},{"$f":"fimTurma!M42-iniTurma!M42","v":0}]
[{"$f":"fimTurma!A43","v":40},null,{"$f":"fimTurma!C43","v":""},null,null,{"$f":"fimTurma!F43-iniTurma!F43","v":0},{"$f":"fimTurma!G43-iniTurma!G43","v":0},{"$f":"fimTurma!H43-iniTurma!H43","v":0},{"$f":"fimTurma!I43-iniTurma!I43","v":0},{"$f":"fimTurma!J43-iniTurma!J43","v":0},{"$f":"fimTurma!K43-iniTurma!K43","v":0},{"$f":"fimTurma!L43-iniTurma!L43","v":0},{"$f":"fimTurma!M43-iniTurma!M43","v":0}]
[{"$f":"fimTurma!A44","v":41},null,{"$f":"fimTurma!C44","v":""},null,null,{"$f":"fimTurma!F44-iniTurma!F44","v":0},{"$f":"fimTurma!G44-iniTurma!G44","v":0},{"$f":"fimTurma!H44-iniTurma!H44","v":0},{"$f":"fimTurma!I44-iniTurma!I44","v":0},{"$f":"fimTurma!J44-iniTurma!J44","v":0},{"$f":"fimTurma!K44-iniTurma!K44","v":0},{"$f":"fimTurma!L44-iniTurma!L44","v":0},{"$f":"fimTurma!M44-iniTurma!M44","v":0}]
[{"$f":"fimTurma!A45","v":42},null,{"$f":"fimTurma!C45","v":""},null,null,{"$f":"fimTurma!F45-iniTurma!F45","v":0},{"$f":"fimTurma!G45-iniTurma!G45","v":0},{"$f":"fimTurma!H45-iniTurma!H45","v":0},{"$f":"fimTurma!I45-iniTurma!I45","v":0},{"$f":"fimTurma!J45-iniTurma!J45","v":0},{"$f":"fimTurma!K45-iniTurma!K45","v":0},{"$f":"fimTurma!L45-iniTurma!L45","v":0},{"$f":"fimTurma!M45-iniTurma!M45","v":0}]
[{"$f":"fimTurma!A46","v":43},null,{"$f":"fimTurma!C46","v":""},null,null,{"$f":"fimTurma!F46-iniTurma!F46","v":0},{"$f":"fimTurma!G46-iniTurma!G46","v":0},{"$f":"fimTurma!H46-iniTurma!H46","v":0},{"$f":"fimTurma!I46-iniTurma!I46","v":0},{"$f":"fimTurma!J46-iniTurma!J46","v":0},{"$f":"fimTurma!K46-iniTurma!K46","v":0},{"$f":"fimTurma!L46-iniTurma!L46","v":0},{"$f":"fimTurma!M46-iniTurma!M46","v":0}]
[{"$f":"fimTurma!A47","v":44},null,{"$f":"fimTurma!C47","v":""},null,null,{"$f":"fimTurma!F47-iniTurma!F47","v":0},{"$f":"fimTurma!G47-iniTurma!G47","v":0},{"$f":"fimTurma!H47-iniTurma!H47","v":0},{"$f":"fimTurma!I47-iniTurma!I47","v":0},{"$f":"fimTurma!J47-iniTurma!J47","v":0},{"$f":"fimTurma!K47-iniTurma!K47","v":0},{"$f":"fimTurma!L47-iniTurma!L47","v":0},{"$f":"fimTurma!M47-iniTurma!M47","v":0}]
[{"$f":"fimTurma!A48","v":45},null,{"$f":"fimTurma!C48","v":""},null,null,{"$f":"fimTurma!F48-iniTurma!F48","v":0},{"$f":"fimTurma!G48-iniTurma!G48","v":0},{"$f":"fimTurma!H48-iniTurma!H48","v":0},{"$f":"fimTurma!I48-iniTurma!I48","v":0},{"$f":"fimTurma!J48-iniTurma!J48","v":0},{"$f":"fimTurma!K48-iniTurma!K48","v":0},{"$f":"fimTurma!L48-iniTurma!L48","v":0},{"$f":"fimTurma!M48-iniTurma!M48","v":0}]
[{"$f":"fimTurma!A49","v":46},null,{"$f":"fimTurma!C49","v":""},null,null,{"$f":"fimTurma!F49-iniTurma!F49","v":0},{"$f":"fimTurma!G49-iniTurma!G49","v":0},{"$f":"fimTurma!H49-iniTurma!H49","v":0},{"$f":"fimTurma!I49-iniTurma!I49","v":0},{"$f":"fimTurma!J49-iniTurma!J49","v":0},{"$f":"fimTurma!K49-iniTurma!K49","v":0},{"$f":"fimTurma!L49-iniTurma!L49","v":0},{"$f":"fimTurma!M49-iniTurma!M49","v":0}]
[{"$f":"fimTurma!A50","v":47},null,{"$f":"fimTurma!C50","v":""},null,null,{"$f":"fimTurma!F50-iniTurma!F50","v":0},{"$f":"fimTurma!G50-iniTurma!G50","v":0},{"$f":"fimTurma!H50-iniTurma!H50","v":0},{"$f":"fimTurma!I50-iniTurma!I50","v":0},{"$f":"fimTurma!J50-iniTurma!J50","v":0},{"$f":"fimTurma!K50-iniTurma!K50","v":0},{"$f":"fimTurma!L50-iniTurma!L50","v":0},{"$f":"fimTurma!M50-iniTurma!M50","v":0}]
[{"$f":"fimTurma!A51","v":48},null,{"$f":"fimTurma!C51","v":""},null,null,{"$f":"fimTurma!F51-iniTurma!F51","v":0},{"$f":"fimTurma!G51-iniTurma!G51","v":0},{"$f":"fimTurma!H51-iniTurma!H51","v":0},{"$f":"fimTurma!I51-iniTurma!I51","v":0},{"$f":"fimTurma!J51-iniTurma!J51","v":0},{"$f":"fimTurma!K51-iniTurma!K51","v":0},{"$f":"fimTurma!L51-iniTurma!L51","v":0},{"$f":"fimTurma!M51-iniTurma!M51","v":0}]
[{"$f":"fimTurma!A52","v":49},null,{"$f":"fimTurma!C52","v":""},null,null,{"$f":"fimTurma!F52-iniTurma!F52","v":0},{"$f":"fimTurma!G52-iniTurma!G52","v":0},{"$f":"fimTurma!H52-iniTurma!H52","v":0},{"$f":"fimTurma!I52-iniTurma!I52","v":0},{"$f":"fimTurma!J52-iniTurma!J52","v":0},{"$f":"fimTurma!K52-iniTurma!K52","v":0},{"$f":"fimTurma!L52-iniTurma!L52","v":0},{"$f":"fimTurma!M52-iniTurma!M52","v":0}]
[{"$f":"fimTurma!A53","v":50},null,{"$f":"fimTurma!C53","v":""},null,null,{"$f":"fimTurma!F53-iniTurma!F53","v":0},{"$f":"fimTurma!G53-iniTurma!G53","v":0},{"$f":"fimTurma!H53-iniTurma!H53","v":0},{"$f":"fimTurma!I53-iniTurma!I53","v":0},{"$f":"fimTurma!J53-iniTurma!J53","v":0},{"$f":"fimTurma!K53-iniTurma!K53","v":0},{"$f":"fimTurma!L53-iniTurma!L53","v":0},{"$f":"fimTurma!M53-iniTurma!M53","v":0}]
[]
[null,null,null,null,"Média",{"$f":"AVERAGE(F4:F53)","v":0.72420000000000018},{"$f":"AVERAGE(G4:G53)","v":-0.38},-0.46000000000000008,0.4280000000000001,1,-0.29039999999999994,0,0]
[null,null,null,null,"Desvio P",{"$f":"STDEVA(F4:F53)","v":1.4307384849247953},{"$f":"STDEVA(G4:G53)","v":1.2435958395897351},1.9330635514326864,6.4571125157314961,2.7330180671012845,0.86531570268088998,0,0]
[null,null,null,null,"n",{"$f":"COUNTIF(F4:F53,\">0\")","v":12},{"$f":"COUNTIF(G4:G53,\">0\")","v":3},5,10,9,1,0,0]
[null,null,null,null,"t teste",{"$f":"IF(F57>0,F55/(F56/SQRT(F57)),\"\")","v":1.7534318228775601},{"$f":"IF(G57>0,G55/(G56/SQRT(G57)),\"\")","v":-0.52925499259736031},-0.53210421813993902,0.2096068227485022,1.0976875843275651,-0.33560005799073461,"",""]
[null,null,null,null,"t crítico",{"$f":"IF(F57>5,IF(F2<0,_xlfn.T.INV(0.05,F57-1),_xlfn.T.INV(0.95,F57-1)),\"\")","v":-1.7958848187040437},{"$f":"IF(G57>5,IF(G2<0,_xlfn.T.INV(0.05,G57-1),_xlfn.T.INV(0.95,G57-1)),\"\")","v":""},"",1.8331129326562368,-1.8595480375308981,"","",""]
[null,null,null,null,"valor p"]
[null,null,null,null,"Conclusão"]