{"text_format":"1","workbook":"xlsx","n_sheets":11,"sheets":["iniTurma","iniRelatório","iniScore Z","fimTurma","fimRelatório","fimScore Z","profRelatório","profPorTeste","iniAuxiliar","fimAuxiliar","difAuxiliar"],"not_rendered":{"charts":0,"images":5,"macros":1,"external_links":0,"defined_names":0,"comments":2,"pivot_tables":0},"unopened":[],"bounds":{"document_bytes":16777216,"sheet_cells":100000,"rows_first":2000,"rows_last":500,"rows_between":2000,"halvings":0,"cell_chars":16384,"cell_head_chars":4096},"cells_cut":0,"cells_raw":0,"read":"whole","date_system":"1900"}

{"sheet":"iniTurma","index":0,"n_rows":53,"n_cols":11,"rows_kept":53,"cut":false,"hidden":false,"merged":[]}
[null,"Ano:",2,null,"Média:",{"$f":"IF(COUNTA(F4:F53)>0,AVERAGE(F4:F53),\"\")","v":12.3575},{"$f":"IF(COUNTA(G4:G53)>0,AVERAGE(G4:G53),\"\")","v":13.333333333333334},9.0333333333333332,29.866666666666664,12.363636363636363,10.951666666666668]
[{"$f":"COUNTIF(B4:B53,\"x\")","v":1},"Turma:","A",null,"Desvio-padrão:",{"$f":"IF(COUNTA(F4:F53)>0,_xlfn.STDEV.P(F4:F53),\"\")","v":1.1577717463587831},{"$f":"IF(COUNTA(G4:G53)>0,_xlfn.STDEV.P(G4:G53),\"\")","v":1.5986105077709065},2.3396343493992631,4.0778534658431482,4.3332273773865397,1.3716281890107287]
["ID Aluno",{"$f":"_xlfn.CONCAT(\"Ver: \",COUNTIF(B4:B53,\"x\"))","v":"Ver: 1"},"Nome","Idade","Data","Corrida vaivém","Corrida velocidade","Salto horizontal","Receber","Lançar","Equilíbrio"]
[1,null,"Micas",13,"2024-12-12",13.12,13,6,32,8,11.2]
[{"$f":"A4+1","v":2},null,"Tecas",12,"2024-12-12",12.43,14,7,38,9,10.199999999999999]
[{"$f":"A5+1","v":3},null,"Lecas",15,"2024-12-12",10,14,8.3000000000000007,25,12,9.9]
{"$rows_left_out":48}
{"sheet":"iniRelatório","index":1,"n_rows":23,"n_cols":8,"rows_kept":23,"cut":false,"hidden":false,"merged":[]}
["RELATÓRIO INDIVIDUAL PRESCHOOL TEST BATTERY"]
[{"$f":"IF(iniTurma!A2=1,VLOOKUP(\"x\",iniTurma!B$4:M$53,2,0),\"\")","v":"Becas"}]
[{"$f":"IF(iniTurma!A2=1,_xlfn.CONCAT(TEXT(VLOOKUP(\"x\",iniTurma!B$4:M$53,4,0),\"dd-mm-aaaa\"),\" | \",iniTurma!C1,\"º ano\",\" | \",iniTurma!C2),\"\")","v":"13-12-2024 | 2º ano | A"}]
[]
[null,"Resultado",null,"Média ",null,"Mínimo",null,"Máximo"]
[null,"da criança",null,"da turma",null,"da turma",null,"da turma"]
{"$rows_left_out":18}
{"sheet":"iniScore Z","index":2,"n_rows":53,"n_cols":12,"rows_kept":53,"cut":false,"hidden":false,"merged":[]}
[]
[]
[{"$f":"iniTurma!B3","v":"Ver: 1"},{"$f":"iniTurma!A3","v":"ID Aluno"},{"$f":"iniTurma!C3","v":"Nome"},{"$f":"iniTurma!D3","v":"Idade"},{"$f":"iniTurma!F3","v":"Corrida vaivém"},{"$f":"iniTurma!G3","v":"Corrida velocidade"},{"$f":"iniTurma!H3","v":"Salto horizontal"},{"$f":"iniTurma!I3","v":"Receber"},{"$f":"iniTurma!J3","v":"Lançar"},{"$f":"iniTurma!K3","v":"Equilíbrio"}]
[{"$f":"IF(iniTurma!B4<>\"\",iniTurma!B4,\"\")","v":""},{"$f":"iniTurma!A4","v":1},{"$f":"IF(iniTurma!C4<>\"\",iniTurma!C4,\"\")","v":"Micas"},{"$f":"IF(iniTurma!D4<>\"\",iniTurma!D4,\"\")","v":13},{"$f":"IF(AND(iniTurma!F$2<>\"\",iniTurma!F4<>\"\"),(iniTurma!F4-iniTurma!F$1)/iniTurma!F$2,\"\")","v":0.65859268236427271},{"$f":"IF(AND(iniTurma!G$2<>\"\",iniTurma!G4<>\"\"),(iniTurma!G4-iniTurma!G$1)/iniTurma!G$2,\"\")","v":-0.20851441405707513},{"$f":"IF(AND(iniTurma!H$2<>\"\",iniTurma!H4<>\"\"),(iniTurma!H4-iniTurma!H$1)/iniTurma!H$2,\"\")","v":-1.2964988884319415},{"$f":"IF(AND(iniTurma!I$2<>\"\",iniTurma!I4<>\"\"),(iniTurma!I4-iniTurma!I$1)/iniTurma!I$2,\"\")","v":0.52315105268066386},{"$f":"IF(AND(iniTurma!J$2<>\"\",iniTurma!J4<>\"\"),(iniTurma!J4-iniTurma!J$1)/iniTurma!J$2,\"\")","v":-1.0070176299560269},{"$f":"IF(AND(iniTurma!K$2<>\"\",iniTurma!K4<>\"\"),(iniTurma!K4-iniTurma!K$1)/iniTurma!K$2,\"\")","v":0.1810500362437425},{"$f":"IF(AND(iniTurma!L$2<>\"\",iniTurma!L4<>\"\"),(iniTurma!L4-iniTurma!L$1)/iniTurma!L$2,\"\")","v":""},{"$f":"IF(AND(iniTurma!M$2<>\"\",iniTurma!M4<>\"\"),(iniTurma!M4-iniTurma!M$1)/iniTurma!M$2,\"\")","v":""}]
[{"$f":"IF(iniTurma!B5<>\"\",iniTurma!B5,\"\")","v":""},{"$f":"iniTurma!A5","v":2},{"$f":"IF(iniTurma!C5<>\"\",iniTurma!C5,\"\")","v":"Tecas"},{"$f":"IF(iniTurma!D5<>\"\",iniTurma!D5,\"\")","v":12},{"$f":"IF(AND(iniTurma!F$2<>\"\",iniTurma!F5<>\"\"),(iniTurma!F5-iniTurma!F$1)/iniTurma!F$2,\"\")","v":6.2620287831356952E-2},{"$f":"IF(AND(iniTurma!G$2<>\"\",iniTurma!G5<>\"\"),(iniTurma!G5-iniTurma!G$1)/iniTurma!G$2,\"\")","v":0.41702882811414915},{"$f":"IF(AND(iniTurma!H$2<>\"\",iniTurma!H5<>\"\"),(iniTurma!H5-iniTurma!H$1)/iniTurma!H$2,\"\")","v":-0.86908167246536738},{"$f":"IF(AND(iniTurma!I$2<>\"\",iniTurma!I5<>\"\"),(iniTurma!I5-iniTurma!I$1)/iniTurma!I$2,\"\")","v":1.9945133883450288},{"$f":"IF(AND(iniTurma!J$2<>\"\",iniTurma!J5<>\"\"),(iniTurma!J5-iniTurma!J$1)/iniTurma!J$2,\"\")","v":-0.77624275642443741},{"$f":"IF(AND(iniTurma!K$2<>\"\",iniTurma!K5<>\"\"),(iniTurma!K5-iniTurma!K$1)/iniTurma!K$2,\"\")","v":-0.54801051238878362},{"$f":"IF(AND(iniTurma!L$2<>\"\",iniTurma!L5<>\"\"),(iniTurma!L5-iniTurma!L$1)/iniTurma!L$2,\"\")","v":""},{"$f":"IF(AND(iniTurma!M$2<>\"\",iniTurma!M5<>\"\"),(iniTurma!M5-iniTurma!M$1)/iniTurma!M$2,\"\")","v":""}]
[{"$f":"IF(iniTurma!B6<>\"\",iniTurma!B6,\"\")","v":""},{"$f":"iniTurma!A6","v":3},{"$f":"IF(iniTurma!C6<>\"\",iniTurma!C6,\"\")","v":"Lecas"},{"$f":"IF(iniTurma!D6<>\"\",iniTurma!D6,\"\")","v":15},{"$f":"IF(AND(iniTurma!F$2<>\"\",iniTurma!F6<>\"\"),(iniTurma!F6-iniTurma!F$1)/iniTurma!F$2,\"\")","v":-2.03623901465413},{"$f":"IF(AND(iniTurma!G$2<>\"\",iniTurma!G6<>\"\"),(iniTurma!G6-iniTurma!G$1)/iniTurma!G$2,\"\")","v":0.41702882811414915},{"$f":"IF(AND(iniTurma!H$2<>\"\",iniTurma!H6<>\"\"),(iniTurma!H6-iniTurma!H$1)/iniTurma!H$2,\"\")","v":-0.31343929170882068},{"$f":"IF(AND(iniTurma!I$2<>\"\",iniTurma!I6<>\"\"),(iniTurma!I6-iniTurma!I$1)/iniTurma!I$2,\"\")","v":-1.1934383389277619},{"$f":"IF(AND(iniTurma!J$2<>\"\",iniTurma!J6<>\"\"),(iniTurma!J6-iniTurma!J$1)/iniTurma!J$2,\"\")","v":-8.3918135829668838E-2},{"$f":"IF(AND(iniTurma!K$2<>\"\",iniTurma!K6<>\"\"),(iniTurma!K6-iniTurma!K$1)/iniTurma!K$2,\"\")","v":-0.76672867697854064},{"$f":"IF(AND(iniTurma!L$2<>\"\",iniTurma!L6<>\"\"),(iniTurma!L6-iniTurma!L$1)/iniTurma!L$2,\"\")","v":""},{"$f":"IF(AND(iniTurma!M$2<>\"\",iniTurma!M6<>\"\"),(iniTurma!M6-iniTurma!M$1)/iniTurma!M$2,\"\")","v":""}]
{"$rows_left_out":48}
{"sheet":"fimTurma","index":3,"n_rows":53,"n_cols":11,"rows_kept":53,"cut":false,"hidden":false,"merged":[]}
[null,"Ano:",{"$f":"IF(iniTurma!C1<>\"\",iniTurma!C1,\"\")","v":2},null,"Média:",{"$f":"IF(COUNTA(F4:F53)>0,AVERAGE(F4:F53),\"\")","v":15.374999999999998},{"$f":"IF(COUNTA(G4:G53)>0,AVERAGE(G4:G53),\"\")","v":11.75},7.7636363636363646,34.527272727272731,15.5,9.7416666666666654]
[{"$f":"COUNTIF(B4:B53,\"x\")","v":1},"Turma:",{"$f":"IF(iniTurma!C2<>\"\",iniTurma!C2,\"\")","v":"A"},null,"Desvio-padrão:",{"$f":"IF(COUNTA(F4:F53)>0,_xlfn.STDEV.P(F4:F53),\"\")","v":0.5068283733178327},{"$f":"IF(COUNTA(G4:G53)>0,_xlfn.STDEV.P(G4:G53),\"\")","v":1.299038105676658},0.96603475118437687,3.0766247471394266,3.4520525295346629,1.1161379345264175]
["ID Aluno",{"$f":"_xlfn.CONCAT(\"Ver: \",COUNTIF(B4:B53,\"x\"))","v":"Ver: 1"},"Nome","Idade","Data","Corrida vaivém","Corrida velocidade","Salto horizontal","Receber","Lançar","Equilíbrio"]
[1,null,{"$f":"IF(iniTurma!C4<>\"\",iniTurma!C4,\"\")","v":"Micas"},13,"2025-06-08",15,12,6.5,35,10,10.199999999999999]
[{"$f":"A4+1","v":2},"x",{"$f":"IF(iniTurma!C5<>\"\",iniTurma!C5,\"\")","v":"Tecas"},12,"2025-06-08",15.5,12,7,null,11,10.199999999999999]
[{"$f":"A5+1","v":3},null,{"$f":"IF(iniTurma!C6<>\"\",iniTurma!C6,\"\")","v":"Lecas"},15,"2025-06-08",16,13,8,34,12,9.9]
{"$rows_left_out":48}
{"sheet":"fimRelatório","index":4,"n_rows":23,"n_cols":8,"rows_kept":23,"cut":false,"hidden":false,"merged":[]}
["RELATÓRIO INDIVIDUAL PRESCHOOL TEST BATTERY"]
[{"$f":"IF(fimTurma!A2=1,VLOOKUP(\"x\",fimTurma!B$4:M$53,2,0),\"\")","v":"Tecas"}]
[{"$f":"IF(fimTurma!A2=1,_xlfn.CONCAT(TEXT(VLOOKUP(\"x\",fimTurma!B$4:M$53,4,0),\"dd-mm-aaaa\"),\" | \",fimTurma!C1,\"º ano\",\" | \",fimTurma!C2),\"\")","v":"08-06-2025 | 2º ano | A"}]
[]
[null,"Resultado",null,"Média ",null,"Mínimo",null,"Máximo"]
[null,"da criança",null,"da turma",null,"da turma",null,"da turma"]
{"$rows_left_out":18}
{"sheet":"fimScore Z","index":5,"n_rows":53,"n_cols":12,"rows_kept":53,"cut":false,"hidden":false,"merged":[]}
[]
[]
[{"$f":"fimTurma!B3","v":"Ver: 1"},{"$f":"fimTurma!A3","v":"ID Aluno"},{"$f":"fimTurma!C3","v":"Nome"},{"$f":"fimTurma!D3","v":"Idade"},{"$f":"fimTurma!F3","v":"Corrida vaivém"},{"$f":"fimTurma!G3","v":"Corrida velocidade"},{"$f":"fimTurma!H3","v":"Salto horizontal"},{"$f":"fimTurma!I3","v":"Receber"},{"$f":"fimTurma!J3","v":"Lançar"},{"$f":"fimTurma!K3","v":"Equilíbrio"}]
[{"$f":"IF(fimTurma!B4<>\"\",fimTurma!B4,\"\")","v":""},{"$f":"fimTurma!A4","v":1},{"$f":"IF(fimTurma!C4<>\"\",fimTurma!C4,\"\")","v":"Micas"},{"$f":"IF(fimTurma!D4<>\"\",fimTurma!D4,\"\")","v":13},{"$f":"IF(AND(fimTurma!F$2<>\"\",fimTurma!F4<>\"\"),(fimTurma!F4-fimTurma!F$1)/fimTurma!F$2,\"\")","v":-0.73989543550048109},{"$f":"IF(AND(fimTurma!G$2<>\"\",fimTurma!G4<>\"\"),(fimTurma!G4-fimTurma!G$1)/fimTurma!G$2,\"\")","v":0.19245008972987526},{"$f":"IF(AND(fimTurma!H$2<>\"\",fimTurma!H4<>\"\"),(fimTurma!H4-fimTurma!H$1)/fimTurma!H$2,\"\")","v":-1.3080651209359937},{"$f":"IF(AND(fimTurma!I$2<>\"\",fimTurma!I4<>\"\"),(fimTurma!I4-fimTurma!I$1)/fimTurma!I$2,\"\")","v":0.1536512612293065},{"$f":"IF(AND(fimTurma!J$2<>\"\",fimTurma!J4<>\"\"),(fimTurma!J4-fimTurma!J$1)/fimTurma!J$2,\"\")","v":-1.5932550136313832},{"$f":"IF(AND(fimTurma!K$2<>\"\",fimTurma!K4<>\"\"),(fimTurma!K4-fimTurma!K$1)/fimTurma!K$2,\"\")","v":0.41064219677096353},{"$f":"IF(AND(fimTurma!L$2<>\"\",fimTurma!L4<>\"\"),(fimTurma!L4-fimTurma!L$1)/fimTurma!L$2,\"\")","v":""},{"$f":"IF(AND(fimTurma!M$2<>\"\",fimTurma!M4<>\"\"),(fimTurma!M4-fimTurma!M$1)/fimTurma!M$2,\"\")","v":""}]
[{"$f":"IF(fimTurma!B5<>\"\",fimTurma!B5,\"\")","v":"x"},{"$f":"fimTurma!A5","v":2},{"$f":"IF(fimTurma!C5<>\"\",fimTurma!C5,\"\")","v":"Tecas"},{"$f":"IF(fimTurma!D5<>\"\",fimTurma!D5,\"\")","v":12},{"$f":"IF(AND(fimTurma!F$2<>\"\",fimTurma!F5<>\"\"),(fimTurma!F5-fimTurma!F$1)/fimTurma!F$2,\"\")","v":0.24663181183349836},{"$f":"IF(AND(fimTurma!G$2<>\"\",fimTurma!G5<>\"\"),(fimTurma!G5-fimTurma!G$1)/fimTurma!G$2,\"\")","v":0.19245008972987526},{"$f":"IF(AND(fimTurma!H$2<>\"\",fimTurma!H5<>\"\"),(fimTurma!H5-fimTurma!H$1)/fimTurma!H$2,\"\")","v":-0.7904853968246297},{"$f":"IF(AND(fimTurma!I$2<>\"\",fimTurma!I5<>\"\"),(fimTurma!I5-fimTurma!I$1)/fimTurma!I$2,\"\")","v":""},{"$f":"IF(AND(fimTurma!J$2<>\"\",fimTurma!J5<>\"\"),(fimTurma!J5-fimTurma!J$1)/fimTurma!J$2,\"\")","v":-1.3035722838802226},{"$f":"IF(AND(fimTurma!K$2<>\"\",fimTurma!K5<>\"\"),(fimTurma!K5-fimTurma!K$1)/fimTurma!K$2,\"\")","v":0.41064219677096353},{"$f":"IF(AND(fimTurma!L$2<>\"\",fimTurma!L5<>\"\"),(fimTurma!L5-fimTurma!L$1)/fimTurma!L$2,\"\")","v":""},{"$f":"IF(AND(fimTurma!M$2<>\"\",fimTurma!M5<>\"\"),(fimTurma!M5-fimTurma!M$1)/fimTurma!M$2,\"\")","v":""}]
[{"$f":"IF(fimTurma!B6<>\"\",fimTurma!B6,\"\")","v":""},{"$f":"fimTurma!A6","v":3},{"$f":"IF(fimTurma!C6<>\"\",fimTurma!C6,\"\")","v":"Lecas"},{"$f":"IF(fimTurma!D6<>\"\",fimTurma!D6,\"\")","v":15},{"$f":"IF(AND(fimTurma!F$2<>\"\",fimTurma!F6<>\"\"),(fimTurma!F6-fimTurma!F$1)/fimTurma!F$2,\"\")","v":1.2331590591674777},{"$f":"IF(AND(fimTurma!G$2<>\"\",fimTurma!G6<>\"\"),(fimTurma!G6-fimTurma!G$1)/fimTurma!G$2,\"\")","v":0.96225044864937626},{"$f":"IF(AND(fimTurma!H$2<>\"\",fimTurma!H6<>\"\"),(fimTurma!H6-fimTurma!H$1)/fimTurma!H$2,\"\")","v":0.24467405139809842},{"$f":"IF(AND(fimTurma!I$2<>\"\",fimTurma!I6<>\"\"),(fimTurma!I6-fimTurma!I$1)/fimTurma!I$2,\"\")","v":-0.17138025290961359},{"$f":"IF(AND(fimTurma!J$2<>\"\",fimTurma!J6<>\"\"),(fimTurma!J6-fimTurma!J$1)/fimTurma!J$2,\"\")","v":-1.013889554129062},{"$f":"IF(AND(fimTurma!K$2<>\"\",fimTurma!K6<>\"\"),(fimTurma!K6-fimTurma!K$1)/fimTurma!K$2,\"\")","v":0.14185821342997051},{"$f":"IF(AND(fimTurma!L$2<>\"\",fimTurma!L6<>\"\"),(fimTurma!L6-fimTurma!L$1)/fimTurma!L$2,\"\")","v":""},{"$f":"IF(AND(fimTurma!M$2<>\"\",fimTurma!M6<>\"\"),(fimTurma!M6-fimTurma!M$1)/fimTurma!M$2,\"\")","v":""}]
{"$rows_left_out":48}
{"sheet":"profRelatório","index":6,"n_rows":24,"n_cols":11,"rows_kept":24,"cut":false,"hidden":false,"merged":[[3,2,3,4],[3,6,3,8]]}
["RELATÓRIO RESUMO PARA O PROFESSOR/TREINADOR"]
[{"$f":"_xlfn.CONCAT(fimTurma!C1,\"º ano\",\" | \",fimTurma!C2)","v":"2º ano | A"}]
[]
[null,null,"Início do Ano",null,null,null,"Fim do Ano",null,null,null,"Melhoria"]
[null,null,"Média",null,"Desvio",null,"Média",null,"Desvio",null,"Com"]
[null,null,null,null,"Padrão",null,null,null,"Padrão",null,"Significado?"]
{"$rows_left_out":19}
{"sheet":"profPorTeste","index":7,"n_rows":5,"n_cols":1,"rows_kept":5,"cut":false,"hidden":false,"merged":[]}
["RELATÓRIO POR TESTE PARA O PROFESSOR/TREINADOR"]
[{"$f":"_xlfn.CONCAT(fimTurma!C1,\"º ano\",\" | \",fimTurma!C2)","v":"2º ano | A"}]
[]
[]
["Teste: Receber"]

{"sheet":"iniAuxiliar","index":8,"n_rows":21,"n_cols":17,"rows_kept":21,"cut":false,"hidden":true,"merged":[]}
["Número","Ordem Resumo","Teste","Criança","Média","Mínimo","Máximo","Score Z","Nome Gráfico","Dpadrão","Grupo","Ordem Relatório","Nome","Criança","Média","Mínimo","Máximo"]
[null,0]
[{"$f":"COUNT(iniTurma!F4:F53)","v":12},{"$f":"IF(A3>0,B2+1,B2)","v":1},{"$f":"iniTurma!F3","v":"Corrida vaivém"},{"$f":"IF(AND(iniTurma!$A$2=1,B3=B2+1),VLOOKUP(\"x\",iniTurma!$B$4:$M$53,5,0),\"\")","v":11.64},{"$f":"IF(B3=B2+1,iniTurma!$F$1,\"\")","v":12.3575},{"$f":"IF(AND(iniTurma!$A$2=1,B3=B2+1),SMALL(iniTurma!$F$4:$F$53,1),\"\")","v":10},{"$f":"IF(AND(iniTurma!$A$2=1,B3=B2+1),LARGE(iniTurma!$F$4:$F$53,1),\"\")","v":14.2},{"$f":"IF(AND(iniTurma!$A$2=1,B3=B2+1),VLOOKUP(\"x\",'iniScore Z'!$A$4:$L$53,5,0),\"\")","v":-0.61972491750343039},{"$f":"C3","v":"Corrida vaivém"},{"$f":"IF(B3=B2+1,iniTurma!$F$2,\"\")","v":1.1577717463587831},"HABILIDADES DE LOCOMOÇÃO",{"$f":"IF(K3<>K2,IF(A3>0,1,0),IF(A3>0,L2+1,L2))","v":1},{"$f":"C3","v":"Corrida vaivém"},{"$f":"D3","v":11.64},{"$f":"E3","v":12.3575},10,14.2]
[{"$f":"COUNT(iniTurma!G4:G53)","v":12},{"$f":"IF(A4>0,B3+1,B3)","v":2},{"$f":"iniTurma!G3","v":"Corrida velocidade"},{"$f":"IF(AND(iniTurma!$A$2=1,B4=B3+1),VLOOKUP(\"x\",iniTurma!$B$4:$M$53,6,0),\"\")","v":15},{"$f":"IF(B4=B3+1,iniTurma!$G$1,\"\")","v":13.333333333333334},{"$f":"IF(AND(iniTurma!$A$2=1,B4=B3+1),SMALL(iniTurma!$G$4:$G$53,1),\"\")","v":10},{"$f":"IF(AND(iniTurma!$A$2=1,B4=B3+1),LARGE(iniTurma!$G$4:$G$53,1),\"\")","v":16},{"$f":"IF(AND(iniTurma!$A$2=1,B4=B3+1),VLOOKUP(\"x\",'iniScore Z'!$A$4:$L$53,6,0),\"\")","v":1.0425720702853734},{"$f":"C4","v":"Corrida velocidade"},{"$f":"IF(B4=B3+1,iniTurma!$G$2,\"\")","v":1.5986105077709065},"HABILIDADES DE LOCOMOÇÃO",{"$f":"IF(K4<>K3,IF(A4>0,1,0),IF(A4>0,L3+1,L3))","v":2},{"$f":"C4","v":"Corrida velocidade"},{"$f":"D4","v":15},{"$f":"E4","v":13.333333333333334},{"$f":"F4","v":10},{"$f":"G4","v":16}]
[{"$f":"COUNT(iniTurma!H4:H53)","v":12},3,{"$f":"iniTurma!H3","v":"Salto horizontal"},{"$f":"IF(AND(iniTurma!$A$2=1,B5=B4+1),VLOOKUP(\"x\",iniTurma!$B$4:$M$53,7,0),\"\")","v":10},{"$f":"IF(B5=B4+1,iniTurma!$H$1,\"\")","v":9.0333333333333332},{"$f":"IF(AND(iniTurma!$A$2=1,B5=B4+1),SMALL(iniTurma!$H$4:$H$53,1),\"\")","v":6},{"$f":"IF(AND(iniTurma!$A$2=1,B5=B4+1),LARGE(iniTurma!$H$4:$H$53,1),\"\")","v":14.7},{"$f":"IF(AND(iniTurma!$A$2=1,B5=B4+1),VLOOKUP(\"x\",'iniScore Z'!$A$4:$L$53,7,0),\"\")","v":0.41316997543435507},"Salto horizontal",{"$f":"IF(B5=B4+1,iniTurma!$H$2,\"\")","v":2.3396343493992631},"HABILIDADES DE LOCOMOÇÃO",3,"Salto horizontal",10,9.0333333333333332,6,14.7]
[{"$f":"COUNT(iniTurma!I4:I53)","v":12},4,{"$f":"iniTurma!I3","v":"Receber"},{"$f":"IF(AND(iniTurma!$A$2=1,B6=B5+1),VLOOKUP(\"x\",iniTurma!$B$4:$M$53,8,0),\"\")","v":31},{"$f":"IF(B6=B5+1,iniTurma!$I$1,\"\")","v":29.866666666666664},{"$f":"IF(AND(iniTurma!$A$2=1,B6=B5+1),SMALL(iniTurma!$I$4:$I$53,1),\"\")","v":24},{"$f":"IF(AND(iniTurma!$A$2=1,B6=B5+1),LARGE(iniTurma!$I$4:$I$53,1),\"\")","v":38},{"$f":"IF(AND(iniTurma!$A$2=1,B6=B5+1),VLOOKUP(\"x\",'iniScore Z'!$A$4:$L$53,8,0),\"\")","v":0.27792399673660301},"Receber",{"$f":"IF(B6=B5+1,iniTurma!$I$2,\"\")","v":4.0778534658431482},"HABILIDADES DE CONTROLO DE OBJETOS",1,"Receber",31,29.866666666666664,24,38]
{"$rows_left_out":16}
{"sheet":"fimAuxiliar","index":9,"n_rows":21,"n_cols":24,"rows_kept":21,"cut":false,"hidden":true,"merged":[]}
["Número","Ordem Resumo","Teste","Criança","Média","Mínimo","Máximo","Score Z","Nome Gráfico","Dpadrão","Grupo","Ordem Relatório","Nome","Criança","Média","Mínimo","Máximo","Melhor","difMédia","Conclusão","Teste T","média","dpadrão","dpadrão"]
[null,0,null,"fim","fim","fim","fim","fim",null,"fim",null,null,null,"fim","fim","fim","fim",null,null,null,null,"ini","ini","fim"]
[{"$f":"COUNT(fimTurma!F4:F53)","v":12},{"$f":"IF(A3>0,B2+1,B2)","v":1},{"$f":"fimTurma!F3","v":"Corrida vaivém"},{"$f":"IF(AND(fimTurma!$A$2=1,B3=B2+1),VLOOKUP(\"x\",fimTurma!$B$4:$M$53,5,0),\"\")","v":15.5},{"$f":"IF(B3=B2+1,fimTurma!$F$1,\"\")","v":15.374999999999998},{"$f":"IF(AND(fimTurma!$A$2=1,B3=B2+1),SMALL(fimTurma!$F$4:$F$53,1),\"\")","v":14.6},{"$f":"IF(AND(fimTurma!$A$2=1,B3=B2+1),LARGE(fimTurma!$F$4:$F$53,1),\"\")","v":16.3},{"$f":"IF(AND(fimTurma!$A$2=1,B3=B2+1),VLOOKUP(\"x\",'fimScore Z'!$A$4:$L$53,5,0),\"\")","v":0.24663181183349836},{"$f":"C3","v":"Corrida vaivém"},{"$f":"IF(B3=B2+1,fimTurma!$F$2,\"\")","v":0.5068283733178327},"HABILIDADES DE LOCOMOÇÃO",{"$f":"IF(K3<>K2,IF(A3>0,1,0),IF(A3>0,L2+1,L2))","v":1},{"$f":"C3","v":"Corrida vaivém"},{"$f":"D3","v":15.5},{"$f":"E3","v":15.374999999999998},14.6,16.3,-1,{"$f":"IF(AND(E3<>\"\",iniAuxiliar!E3<>\"\"),E3-iniAuxiliar!E3,\"\")","v":3.0174999999999983},{"$f":"IF(AND(E3<>\"\",iniAuxiliar!E3<>\"\"),IF(U3*R3<=0,\"Não\",IF(U3>=0.05,\"Não\",\"Sim\")),\"\")","v":"Não"},{"$f":"IF(AND(E3<>\"\",iniAuxiliar!E3<>\"\"),IFERROR(_xlfn.T.TEST(iniTurma!F$4:F$53,fimTurma!F$4:F$53,1,1),_xlfn.T.TEST(iniTurma!F$4:F$53,fimTurma!F$4:F$53,1,2)),\"\")","v":2.1838664566690021E-6},{"$f":"iniAuxiliar!E3","v":12.3575},{"$f":"iniAuxiliar!J3","v":1.1577717463587831},{"$f":"J3","v":0.5068283733178327}]
[{"$f":"COUNT(fimTurma!G4:G53)","v":12},{"$f":"IF(A4>0,B3+1,B3)","v":2},{"$f":"fimTurma!G3","v":"Corrida velocidade"},{"$f":"IF(AND(fimTurma!$A$2=1,B4=B3+1),VLOOKUP(\"x\",fimTurma!$B$4:$M$53,6,0),\"\")","v":12},{"$f":"IF(B4=B3+1,fimTurma!$G$1,\"\")","v":11.75},{"$f":"IF(AND(fimTurma!$A$2=1,B4=B3+1),SMALL(fimTurma!$G$4:$G$53,1),\"\")","v":9},{"$f":"IF(AND(fimTurma!$A$2=1,B4=B3+1),LARGE(fimTurma!$G$4:$G$53,1),\"\")","v":14},{"$f":"IF(AND(fimTurma!$A$2=1,B4=B3+1),VLOOKUP(\"x\",'fimScore Z'!$A$4:$L$53,6,0),\"\")","v":0.19245008972987526},{"$f":"C4","v":"Corrida velocidade"},{"$f":"IF(B4=B3+1,fimTurma!$G$2,\"\")","v":1.299038105676658},"HABILIDADES DE LOCOMOÇÃO",{"$f":"IF(K4<>K3,IF(A4>0,1,0),IF(A4>0,L3+1,L3))","v":2},{"$f":"C4","v":"Corrida velocidade"},12,11.75,9,14,-1,{"$f":"IF(AND(E4<>\"\",iniAuxiliar!E4<>\"\"),E4-iniAuxiliar!E4,\"\")","v":-1.5833333333333339},{"$f":"IF(AND(E4<>\"\",iniAuxiliar!E4<>\"\"),IF(U4*R4<=0,\"Não\",IF(U4>=0.05,\"Não\",\"Sim\")),\"\")","v":"Não"},{"$f":"IF(AND(E4<>\"\",iniAuxiliar!E4<>\"\"),IFERROR(_xlfn.T.TEST(iniTurma!G$4:G$53,fimTurma!G$4:G$53,1,1),_xlfn.T.TEST(iniTurma!G$4:G$53,fimTurma!G$4:G$53,1,2)),\"\")","v":1.4734618219787993E-2},{"$f":"iniAuxiliar!E4","v":13.333333333333334},{"$f":"iniAuxiliar!J4","v":1.5986105077709065},{"$f":"J4","v":1.299038105676658}]
[{"$f":"COUNT(fimTurma!H4:H53)","v":11},3,{"$f":"fimTurma!H3","v":"Salto horizontal"},{"$f":"IF(AND(fimTurma!$A$2=1,B5=B4+1),VLOOKUP(\"x\",fimTurma!$B$4:$M$53,7,0),\"\")","v":7},{"$f":"IF(B5=B4+1,fimTurma!$H$1,\"\")","v":7.7636363636363646},{"$f":"IF(AND(fimTurma!$A$2=1,B5=B4+1),SMALL(fimTurma!$H$4:$H$53,1),\"\")","v":6.5},{"$f":"IF(AND(fimTurma!$A$2=1,B5=B4+1),LARGE(fimTurma!$H$4:$H$53,1),\"\")","v":10.199999999999999},{"$f":"IF(AND(fimTurma!$A$2=1,B5=B4+1),VLOOKUP(\"x\",'fimScore Z'!$A$4:$L$53,7,0),\"\")","v":-0.7904853968246297},"Salto horizontal",{"$f":"IF(B5=B4+1,fimTurma!$H$2,\"\")","v":0.96603475118437687},"HABILIDADES DE LOCOMOÇÃO",3,"Salto horizontal",7,7.7636363636363646,6.5,10.199999999999999,1,{"$f":"IF(AND(E5<>\"\",iniAuxiliar!E5<>\"\"),E5-iniAuxiliar!E5,\"\")","v":-1.2696969696969687},{"$f":"IF(AND(E5<>\"\",iniAuxiliar!E5<>\"\"),IF(U5*R5<=0,\"Não\",IF(U5>=0.05,\"Não\",\"Sim\")),\"\")","v":"Não"},{"$f":"IF(AND(E5<>\"\",iniAuxiliar!E5<>\"\"),IFERROR(_xlfn.T.TEST(iniTurma!H$4:H$53,fimTurma!H$4:H$53,1,1),_xlfn.T.TEST(iniTurma!H$4:H$53,fimTurma!H$4:H$53,1,2)),\"\")","v":9.5792366204519225E-2},{"$f":"iniAuxiliar!E5","v":9.0333333333333332},{"$f":"iniAuxiliar!J5","v":2.3396343493992631},0.96603475118437687]
[{"$f":"COUNT(fimTurma!I4:I53)","v":11},4,{"$f":"fimTurma!I3","v":"Receber"},{"$f":"IF(AND(fimTurma!$A$2=1,B6=B5+1),VLOOKUP(\"x\",fimTurma!$B$4:$M$53,8,0),\"\")","v":0},{"$f":"IF(B6=B5+1,fimTurma!$I$1,\"\")","v":34.527272727272731},{"$f":"IF(AND(fimTurma!$A$2=1,B6=B5+1),SMALL(fimTurma!$I$4:$I$53,1),\"\")","v":30},{"$f":"IF(AND(fimTurma!$A$2=1,B6=B5+1),LARGE(fimTurma!$I$4:$I$53,1),\"\")","v":41},{"$f":"IF(AND(fimTurma!$A$2=1,B6=B5+1),VLOOKUP(\"x\",'fimScore Z'!$A$4:$L$53,8,0),\"\")","v":""},"Receber",{"$f":"IF(B6=B5+1,fimTurma!$I$2,\"\")","v":3.0766247471394266},"HABILIDADES DE CONTROLO DE OBJETOS",1,"Receber",0,34.527272727272731,30,41,1,{"$f":"IF(AND(E6<>\"\",iniAuxiliar!E6<>\"\"),E6-iniAuxiliar!E6,\"\")","v":4.6606060606060673},{"$f":"IF(AND(E6<>\"\",iniAuxiliar!E6<>\"\"),IF(U6*R6<=0,\"Não\",IF(U6>=0.05,\"Não\",\"Sim\")),\"\")","v":"Sim"},{"$f":"IF(AND(E6<>\"\",iniAuxiliar!E6<>\"\"),IFERROR(_xlfn.T.TEST(iniTurma!I$4:I$53,fimTurma!I$4:I$53,1,1),_xlfn.T.TEST(iniTurma!I$4:I$53,fimTurma!I$4:I$53,1,2)),\"\")","v":3.7411206561437215E-3},{"$f":"iniAuxiliar!E6","v":29.866666666666664},{"$f":"iniAuxiliar!J6","v":4.0778534658431482},3.0766247471394266]
{"$rows_left_out":16}
{"sheet":"difAuxiliar","index":10,"n_rows":61,"n_cols":13,"rows_kept":61,"cut":false,"hidden":true,"merged":[]}
[]
[null,null,null,null,"Melhor:",-1,-1,1,1,-1,-1,1,-1]
[{"$f":"fimTurma!A3","v":"ID Aluno"},null,{"$f":"fimTurma!C3","v":"Nome"},null,null,{"$f":"fimTurma!F3","v":"Corrida vaivém"},{"$f":"fimTurma!G3","v":"Corrida velocidade"},{"$f":"fimTurma!H3","v":"Salto horizontal"},{"$f":"fimTurma!I3","v":"Receber"},{"$f":"fimTurma!J3","v":"Lançar"},{"$f":"fimTurma!K3","v":"Equilíbrio"},{"$f":"fimTurma!L3","v":0},{"$f":"fimTurma!M3","v":0}]
[{"$f":"fimTurma!A4","v":1},null,{"$f":"fimTurma!C4","v":"Micas"},null,null,{"$f":"fimTurma!F4-iniTurma!F4","v":1.8800000000000008},{"$f":"fimTurma!G4-iniTurma!G4","v":-1},{"$f":"fimTurma!H4-iniTurma!H4","v":0.5},{"$f":"fimTurma!I4-iniTurma!I4","v":3},{"$f":"fimTurma!J4-iniTurma!J4","v":2},{"$f":"fimTurma!K4-iniTurma!K4","v":-1},{"$f":"fimTurma!L4-iniTurma!L4","v":0},{"$f":"fimTurma!M4-iniTurma!M4","v":0}]
[{"$f":"fimTurma!A5","v":2},null,{"$f":"fimTurma!C5","v":"Tecas"},null,null,{"$f":"fimTurma!F5-iniTurma!F5","v":3.0700000000000003},{"$f":"fimTurma!G5-iniTurma!G5","v":-2},{"$f":"fimTurma!H5-iniTurma!H5","v":0},{"$f":"fimTurma!I5-iniTurma!I5","v":-38},{"$f":"fimTurma!J5-iniTurma!J5","v":2},{"$f":"fimTurma!K5-iniTurma!K5","v":0},{"$f":"fimTurma!L5-iniTurma!L5","v":0},{"$f":"fimTurma!M5-iniTurma!M5","v":0}]
[{"$f":"fimTurma!A6","v":3},null,{"$f":"fimTurma!C6","v":"Lecas"},null,null,{"$f":"fimTurma!F6-iniTurma!F6","v":6},{"$f":"fimTurma!G6-iniTurma!G6","v":-1},{"$f":"fimTurma!H6-iniTurma!H6","v":-0.30000000000000071},{"$f":"fimTurma!I6-iniTurma!I6","v":9},{"$f":"fimTurma!J6-iniTurma!J6","v":0},{"$f":"fimTurma!K6-iniTurma!K6","v":0},{"$f":"fimTurma!L6-iniTurma!L6","v":0},{"$f":"fimTurma!M6-iniTurma!M6","v":0}]
{"$rows_left_out":55}