{"text_format":"1","workbook":"xlsx","n_sheets":10,"sheets":["iniTurma","iniRelatório","iniKTK","References","Auxiliar","fimTurma","fimKTK","fimRelatório","profRelatório","profPorTeste"],"not_rendered":{"charts":0,"images":11,"macros":1,"external_links":0,"defined_names":0,"comments":2,"pivot_tables":0},"unopened":[],"bounds":{"document_bytes":16777216,"sheet_cells":100000,"rows_first":2000,"rows_last":500,"rows_between":2000,"halvings":0,"cell_chars":16384,"cell_head_chars":4096},"cells_cut":0,"cells_raw":0,"read":"whole","date_system":"1900"}

{"sheet":"iniTurma","index":0,"n_rows":53,"n_cols":10,"rows_kept":53,"cut":false,"hidden":false,"merged":[]}
[null,"Ano:",3,null,null,"Média:",{"$f":"IF(COUNTA(G4:G53)>0,AVERAGE(G4:G53),\"\")","v":43.4},{"$f":"IF(COUNTA(H4:H53)>0,AVERAGE(H4:H53),\"\")","v":37},32.799999999999997,36]
[{"$f":"COUNTIF(B4:B53,\"x\")","v":1},"Turma:","B",null,null,"Desvio-padrão:",{"$f":"IF(COUNTA(G4:G53)>0,_xlfn.STDEV.P(G4:G53),\"\")","v":6.6513156593263565},{"$f":"IF(COUNTA(H4:H53)>0,_xlfn.STDEV.P(H4:H53),\"\")","v":25.680732076792516},13.044539087296261,22.054478003344354]
["ID Aluno",{"$f":"_xlfn.CONCAT(\"Ver: \",COUNTIF(B4:B53,\"x\"))","v":"Ver: 1"},"Nome","Género","Data Nascimento","Data Avaliação","TL_Ponto","SL_Ponto","EQ_Ponto","SM_Ponto"]
[1,null,"Maria Adelaide","Menina","2000-01-01","2007-01-01",35,8,25,63]
[{"$f":"A4+1","v":2},null,"Manuel Silva","Menino","2000-01-01","2007-01-01",45,null,54,63]
[{"$f":"A5+1","v":3},"x","Pedro Silva","Menino","2015-03-11","2022-05-30",40,45,22,18]
[4,null,"António Ferreira","Menino","2014-08-23","2021-01-12",42,20,21,19]
[5,null,"Teresa Martinho","Menina","2012-07-10","2022-04-11",55,75,42,17]
[6]
[7]
[8]
[9]
[10]
[11]
[12]
[13]
[14]
[15]
[16]
[17]
[18]
[19]
[20]
[21]
[22]
[23]
[24]
[25]
[26]
[27]
[28]
[29]
[30]
[31]
[32]
[33]
[34]
[35]
[36]
[37]
[38]
[39]
[40]
[41]
[42]
[43]
[44]
[45]
[46]
[47]
[48]
[49]
[50]

{"sheet":"iniRelatório","index":1,"n_rows":22,"n_cols":8,"rows_kept":22,"cut":false,"hidden":false,"merged":[[17,1,18,1],[17,0,18,0]]}
["RELATÓRIO INDIVIDUAL DA COORDENAÇÃO MOTORA"]
[{"$f":"IF(iniTurma!A2=1,VLOOKUP(\"x\",iniTurma!B$4:M$53,2,0),\"\")","v":"Pedro Silva"}]
[{"$f":"IF(iniTurma!A2=1,_xlfn.CONCAT(TEXT(VLOOKUP(\"x\",iniTurma!B$4:M$53,4,0),\"dd-mm-aaaa\"),\" | \",iniTurma!C1,\"º ano\",\" | \",iniTurma!C2),\"\")","v":"11-03-2015 | 3º ano | B"}]
[]
[null,"Pontuação",null,"Média",null,"Mínimo",null,"Máximo"]
[null,"da criança",null,"da turma",null,"da turma",null,"da turma"]
[{"$f":"IF(iniTurma!A2=1,Auxiliar!C3,0)","v":"Transposição lateral"},{"$f":"IF(iniTurma!$A$2=1,VLOOKUP(\"x\",iniTurma!$B$4:$J$53,6,0),0)","v":40},null,{"$f":"IF(iniTurma!A2=1,iniTurma!G1,0)","v":43.4},null,{"$f":"IF(iniTurma!A2=1,SMALL(iniTurma!G4:G53,1),0)","v":35},null,{"$f":"IF(iniTurma!A2=1,LARGE(iniTurma!G4:G53,1),0)","v":55}]
[]
[{"$f":"IF(iniTurma!A2=1,Auxiliar!C4,0)","v":"Saltos laterais"},{"$f":"IF(iniTurma!$A$2=1,VLOOKUP(\"x\",iniTurma!$B$4:$J$53,7,0),0)","v":45},null,{"$f":"IF(iniTurma!A2=1,iniTurma!H1,0)","v":37},null,{"$f":"IF(iniTurma!A2=1,SMALL(iniTurma!H4:H53,1),0)","v":8},null,{"$f":"IF(iniTurma!A2=1,LARGE(iniTurma!H4:H53,1),0)","v":75}]
[]
[{"$f":"IF(iniTurma!A2=1,Auxiliar!C5,0)","v":"Equilíbrio à retaguarda"},{"$f":"IF(iniTurma!$A$2=1,VLOOKUP(\"x\",iniTurma!$B$4:$J$53,8,0),0)","v":22},null,{"$f":"IF(iniTurma!A2=1,iniTurma!I1,0)","v":32.799999999999997},null,{"$f":"IF(iniTurma!A2=1,SMALL(iniTurma!I4:I53,1),0)","v":21},null,{"$f":"IF(iniTurma!A2=1,LARGE(iniTurma!I4:I53,1),0)","v":54}]
[]
[{"$f":"IF(iniTurma!A2=1,Auxiliar!C6,0)","v":"Saltos monopedais"},{"$f":"IF(iniTurma!$A$2=1,VLOOKUP(\"x\",iniTurma!$B$4:$J$53,9,0),0)","v":18},null,{"$f":"IF(iniTurma!A2=1,iniTurma!J1,0)","v":36},null,{"$f":"IF(iniTurma!A2=1,SMALL(iniTurma!J4:J53,1),0)","v":17},null,{"$f":"IF(iniTurma!A2=1,LARGE(iniTurma!J4:J53,1),0)","v":63}]
[]
[]
["PONTUAÇÃO TOTAL",{"$f":"IF(iniTurma!$A2=1,B7+B9+B11+B13,0)","v":125},null,{"$f":"IF(iniTurma!$A2=1,D7+D9+D11+D13,0)","v":149.19999999999999},null,{"$f":"IF(iniTurma!$A2=1,F7+F9+F11+F13,0)","v":81},null,{"$f":"IF(iniTurma!$A2=1,H7+H9+H11+H13,0)","v":247}]
[null,null,null,null,null,"Nível coordenativo"]
["QUOCIENTE MOTOR",{"$f":"IF(iniTurma!A2=1,VLOOKUP(\"x\",iniKTK!A4:N53,12,0),0)","v":95},null,null,null,{"$f":"IF(iniTurma!A2=1,VLOOKUP(\"x\",iniKTK!A4:P53,15,0),\"\")","v":"Desempenho"}]
[null,null,null,null,null,{"$f":"IF(iniTurma!A2=1,VLOOKUP(\"x\",iniKTK!A4:P53,16,0),\"\")","v":"típico ou normal"}]
[]
[]
["Perfil"]

{"sheet":"iniKTK","index":2,"n_rows":53,"n_cols":16,"rows_kept":53,"cut":false,"hidden":true,"merged":[]}
[null,"Ano:",{"$f":"IF(iniTurma!C1=0,\"\",iniTurma!C1)","v":3}]
[null,"Turma:",{"$f":"IF(iniTurma!C2=0,\"\",iniTurma!C2)","v":"B"}]
[{"$f":"iniTurma!B3","v":"Ver: 1"},"ID Aluno","Nome","Idade decimal","Idade KTK","Coluna Idade","TL_Cof","SL_Cof","EQ_Cof","SM_Cof","Soma_KTK","MQ_KTK","Nível_KTK","Percentil_KTK"]
[{"$f":"IF(iniTurma!B4<>\"\",iniTurma!B4,\"\")","v":""},{"$f":"iniTurma!A4","v":1},{"$f":"IF(iniTurma!C4=0,\"\",iniTurma!C4)","v":"Maria Adelaide"},{"$f":"IF(OR(iniTurma!E4=\"\",iniTurma!F4=\"\"),\"\",(iniTurma!F4-iniTurma!E4)/365.25)","v":7.0006844626967828},{"$f":"IF(OR(iniTurma!E4=\"\",iniTurma!F4=\"\"),\"\",iniTurma!F4-iniTurma!E4)","v":2557},{"$f":"IF(AND(E4>1000,E4<2192),2, IF(AND(E4>= 2192,E4<2557),3, IF(AND(E4>=2557,E4<2922),4, IF(AND(E4>=2922,E4<3287),5, IF(AND(E4>=3287,E4<3653),6, IF(AND(E4>=3653,E4<4018),7, IF(AND(E4>=4018,E4<4383),8, IF(AND(E4>=4383,E4<4748),9, IF(AND(E4>=4748,E4<5478),10,\"\") ) ) ) ) ) ) ) )","v":4},{"$f":"IF(OR(F4=\"\",iniTurma!G4=\"\"),\"\",VLOOKUP(iniTurma!G4,References!A$3:J$78,F4,0))","v":98},{"$f":"IF(OR(F4=\"\",iniTurma!H4=\"\"),\"\",IF(iniTurma!D4=\"Menino\",VLOOKUP(iniTurma!H4,References!A$103:J$208,F4,0),VLOOKUP(iniTurma!H4,References!A$303:J$413,F4,0)))","v":50},{"$f":"IF(OR(F4=\"\",iniTurma!I4=\"\"),\"\",VLOOKUP(iniTurma!I4,References!A$503:J$575,F4,0))","v":82},{"$f":"IF(OR(F4=\"\",iniTurma!J4=\"\"),\"\",IF(iniTurma!D4=\"Menino\",VLOOKUP(iniTurma!J4,References!A$603:J$681,F4,0),VLOOKUP(iniTurma!J4,References!A$803:J$881,F4,0)))","v":132},{"$f":"IF(OR(G4=\"\",OR(H4=\"\",OR(I4=\"\",J4=\"\"))),\"\",G4+H4+I4+J4)","v":362},{"$f":"IF(K4=\"\",\"\",VLOOKUP(K4,References!A$903:B$1362,2,))","v":88},{"$f":"IF(L4=\"\",\"\",IF(AND(40<=L4,L4<=70),\"Perturbação da coordenação\", IF(AND(71<=L4,L4<=85),\"Desempenho coordenativo insuficiente\", IF(AND(86<=L4,L4<=115),\"Desempenho coordenativo típico ou normal\", IF(AND(116<=L4,L4<=130),\"Bom desempenho coordenativo\", IF(AND(131<=L4,L4<=145),\"Elevado desempenho coordenativo\", \"\") ) ) )))","v":"Desempenho coordenativo típico ou normal"},{"$f":"IF(L4=\"\",\"\",VLOOKUP(L4,References!A$1403:B$1903,2,0))","v":21},{"$f":"IF(L4=\"\",\"\",IF(AND(40<=L4,L4<=70),\"Perturbação da\", IF(AND(71<=L4,L4<=85),\"Desempenho\", IF(AND(86<=L4,L4<=115),\"Desempenho\", IF(AND(116<=L4,L4<=130),\"Bom desempenho\", IF(AND(131<=L4,L4<=145),\"Elevado\", \"\") ) ) )))","v":"Desempenho"},{"$f":"IF(L4=\"\",\"\",IF(AND(40<=L4,L4<=70),\"coordenação\", IF(AND(71<=L4,L4<=85),\"insuficiente\", IF(AND(86<=L4,L4<=115),\"típico ou normal\", IF(AND(116<=L4,L4<=130),\"coordenativo\", IF(AND(131<=L4,L4<=145),\"desempenho\", \"\") ) ) )))","v":"típico ou normal"}]
[{"$f":"IF(iniTurma!B5<>\"\",iniTurma!B5,\"\")","v":""},{"$f":"iniTurma!A5","v":2},{"$f":"IF(iniTurma!C5=0,\"\",iniTurma!C5)","v":"Manuel Silva"},{"$f":"IF(OR(iniTurma!E5=\"\",iniTurma!F5=\"\"),\"\",(iniTurma!F5-iniTurma!E5)/365.25)","v":7.0006844626967828},{"$f":"IF(OR(iniTurma!E5=\"\",iniTurma!F5=\"\"),\"\",iniTurma!F5-iniTurma!E5)","v":2557},{"$f":"IF(AND(E5>1000,E5<2192),2, IF(AND(E5>= 2192,E5<2557),3, IF(AND(E5>=2557,E5<2922),4, IF(AND(E5>=2922,E5<3287),5, IF(AND(E5>=3287,E5<3653),6, IF(AND(E5>=3653,E5<4018),7, IF(AND(E5>=4018,E5<4383),8, IF(AND(E5>=4383,E5<4748),9, IF(AND(E5>=4748,E5<5478),10,\"\") ) ) ) ) ) ) ) )","v":4},{"$f":"IF(OR(F5=\"\",iniTurma!G5=\"\"),\"\",VLOOKUP(iniTurma!G5,References!A$3:J$78,F5,0))","v":122},{"$f":"IF(OR(F5=\"\",iniTurma!H5=\"\"),\"\",IF(iniTurma!D5=\"Menino\",VLOOKUP(iniTurma!H5,References!A$103:J$208,F5,0),VLOOKUP(iniTurma!H5,References!A$303:J$413,F5,0)))","v":""},{"$f":"IF(OR(F5=\"\",iniTurma!I5=\"\"),\"\",VLOOKUP(iniTurma!I5,References!A$503:J$575,F5,0))","v":114},{"$f":"IF(OR(F5=\"\",iniTurma!J5=\"\"),\"\",IF(iniTurma!D5=\"Menino\",VLOOKUP(iniTurma!J5,References!A$603:J$681,F5,0),VLOOKUP(iniTurma!J5,References!A$803:J$881,F5,0)))","v":132},{"$f":"IF(OR(G5=\"\",OR(H5=\"\",OR(I5=\"\",J5=\"\"))),\"\",G5+H5+I5+J5)","v":""},{"$f":"IF(K5=\"\",\"\",VLOOKUP(K5,References!A$903:B$1362,2,))","v":""},{"$f":"IF(L5=\"\",\"\",IF(AND(40<=L5,L5<=70),\"Perturbação da coordenação\", IF(AND(71<=L5,L5<=85),\"Desempenho coordenativo insuficiente\", IF(AND(86<=L5,L5<=115),\"Desempenho coordenativo típico ou normal\", IF(AND(116<=L5,L5<=130),\"Bom desempenho coordenativo\", IF(AND(131<=L5,L5<=145),\"Elevado desempenho coordenativo\", \"\") ) ) )))","v":""},{"$f":"IF(L5=\"\",\"\",VLOOKUP(L5,References!A$1403:B$1903,2,0))","v":""},{"$f":"IF(L5=\"\",\"\",IF(AND(40<=L5,L5<=70),\"Perturbação da\", IF(AND(71<=L5,L5<=85),\"Desempenho\", IF(AND(86<=L5,L5<=115),\"Desempenho\", IF(AND(116<=L5,L5<=130),\"Bom desempenho\", IF(AND(131<=L5,L5<=145),\"Elevado\", \"\") ) ) )))","v":""},{"$f":"IF(L5=\"\",\"\",IF(AND(40<=L5,L5<=70),\"coordenação\", IF(AND(71<=L5,L5<=85),\"insuficiente\", IF(AND(86<=L5,L5<=115),\"típico ou normal\", IF(AND(116<=L5,L5<=130),\"coordenativo\", IF(AND(131<=L5,L5<=145),\"desempenho\", \"\") ) ) )))","v":""}]
[{"$f":"IF(iniTurma!B6<>\"\",iniTurma!B6,\"\")","v":"x"},{"$f":"iniTurma!A6","v":3},{"$f":"IF(iniTurma!C6=0,\"\",iniTurma!C6)","v":"Pedro Silva"},{"$f":"IF(OR(iniTurma!E6=\"\",iniTurma!F6=\"\"),\"\",(iniTurma!F6-iniTurma!E6)/365.25)","v":7.2197125256673509},{"$f":"IF(OR(iniTurma!E6=\"\",iniTurma!F6=\"\"),\"\",iniTurma!F6-iniTurma!E6)","v":2637},4,{"$f":"IF(OR(F6=\"\",iniTurma!G6=\"\"),\"\",VLOOKUP(iniTurma!G6,References!A$3:J$78,F6,0))","v":110},{"$f":"IF(OR(F6=\"\",iniTurma!H6=\"\"),\"\",IF(iniTurma!D6=\"Menino\",VLOOKUP(iniTurma!H6,References!A$103:J$208,F6,0),VLOOKUP(iniTurma!H6,References!A$303:J$413,F6,0)))","v":113},{"$f":"IF(OR(F6=\"\",iniTurma!I6=\"\"),\"\",VLOOKUP(iniTurma!I6,References!A$503:J$575,F6,0))","v":79},{"$f":"IF(OR(F6=\"\",iniTurma!J6=\"\"),\"\",IF(iniTurma!D6=\"Menino\",VLOOKUP(iniTurma!J6,References!A$603:J$681,F6,0),VLOOKUP(iniTurma!J6,References!A$803:J$881,F6,0)))","v":82},384,{"$f":"IF(K6=\"\",\"\",VLOOKUP(K6,References!A$903:B$1362,2,))","v":95},"Desempenho coordenativo típico ou normal",{"$f":"IF(L6=\"\",\"\",VLOOKUP(L6,References!A$1403:B$1903,2,0))","v":36},"Desempenho","típico ou normal"]
[{"$f":"IF(iniTurma!B7<>\"\",iniTurma!B7,\"\")","v":""},{"$f":"iniTurma!A7","v":4},{"$f":"IF(iniTurma!C7=0,\"\",iniTurma!C7)","v":"António Ferreira"},{"$f":"IF(OR(iniTurma!E7=\"\",iniTurma!F7=\"\"),\"\",(iniTurma!F7-iniTurma!E7)/365.25)","v":6.3901437371663246},{"$f":"IF(OR(iniTurma!E7=\"\",iniTurma!F7=\"\"),\"\",iniTurma!F7-iniTurma!E7)","v":2334},3,{"$f":"IF(OR(F7=\"\",iniTurma!G7=\"\"),\"\",VLOOKUP(iniTurma!G7,References!A$3:J$78,F7,0))","v":123},{"$f":"IF(OR(F7=\"\",iniTurma!H7=\"\"),\"\",IF(iniTurma!D7=\"Menino\",VLOOKUP(iniTurma!H7,References!A$103:J$208,F7,0),VLOOKUP(iniTurma!H7,References!A$303:J$413,F7,0)))","v":80},{"$f":"IF(OR(F7=\"\",iniTurma!I7=\"\"),\"\",VLOOKUP(iniTurma!I7,References!A$503:J$575,F7,0))","v":84},{"$f":"IF(OR(F7=\"\",iniTurma!J7=\"\"),\"\",IF(iniTurma!D7=\"Menino\",VLOOKUP(iniTurma!J7,References!A$603:J$681,F7,0),VLOOKUP(iniTurma!J7,References!A$803:J$881,F7,0)))","v":95},382,{"$f":"IF(K7=\"\",\"\",VLOOKUP(K7,References!A$903:B$1362,2,))","v":94},"Desempenho coordenativo típico ou normal",{"$f":"IF(L7=\"\",\"\",VLOOKUP(L7,References!A$1403:B$1903,2,0))","v":34},"Desempenho","típico ou normal"]
[{"$f":"IF(iniTurma!B8<>\"\",iniTurma!B8,\"\")","v":""},{"$f":"iniTurma!A8","v":5},{"$f":"IF(iniTurma!C8=0,\"\",iniTurma!C8)","v":"Teresa Martinho"},{"$f":"IF(OR(iniTurma!E8=\"\",iniTurma!F8=\"\"),\"\",(iniTurma!F8-iniTurma!E8)/365.25)","v":9.7522245037645447},{"$f":"IF(OR(iniTurma!E8=\"\",iniTurma!F8=\"\"),\"\",iniTurma!F8-iniTurma!E8)","v":3562},6,{"$f":"IF(OR(F8=\"\",iniTurma!G8=\"\"),\"\",VLOOKUP(iniTurma!G8,References!A$3:J$78,F8,0))","v":124},{"$f":"IF(OR(F8=\"\",iniTurma!H8=\"\"),\"\",IF(iniTurma!D8=\"Menino\",VLOOKUP(iniTurma!H8,References!A$103:J$208,F8,0),VLOOKUP(iniTurma!H8,References!A$303:J$413,F8,0)))","v":121},{"$f":"IF(OR(F8=\"\",iniTurma!I8=\"\"),\"\",VLOOKUP(iniTurma!I8,References!A$503:J$575,F8,0))","v":90},{"$f":"IF(OR(F8=\"\",iniTurma!J8=\"\"),\"\",IF(iniTurma!D8=\"Menino\",VLOOKUP(iniTurma!J8,References!A$603:J$681,F8,0),VLOOKUP(iniTurma!J8,References!A$803:J$881,F8,0)))","v":60},395,{"$f":"IF(K8=\"\",\"\",VLOOKUP(K8,References!A$903:B$1362,2,))","v":98},"Desempenho coordenativo típico ou normal",{"$f":"IF(L8=\"\",\"\",VLOOKUP(L8,References!A$1403:B$1903,2,0))","v":45},"Desempenho","típico ou normal"]
[{"$f":"IF(iniTurma!B9<>\"\",iniTurma!B9,\"\")","v":""},{"$f":"iniTurma!A9","v":6},{"$f":"IF(iniTurma!C9=0,\"\",iniTurma!C9)","v":""},{"$f":"IF(OR(iniTurma!E9=\"\",iniTurma!F9=\"\"),\"\",(iniTurma!F9-iniTurma!E9)/365.25)","v":""},{"$f":"IF(OR(iniTurma!E9=\"\",iniTurma!F9=\"\"),\"\",iniTurma!F9-iniTurma!E9)","v":""},"",{"$f":"IF(OR(F9=\"\",iniTurma!G9=\"\"),\"\",VLOOKUP(iniTurma!G9,References!A$3:J$78,F9,0))","v":""},{"$f":"IF(OR(F9=\"\",iniTurma!H9=\"\"),\"\",IF(iniTurma!D9=\"Menino\",VLOOKUP(iniTurma!H9,References!A$103:J$208,F9,0),VLOOKUP(iniTurma!H9,References!A$303:J$413,F9,0)))","v":""},{"$f":"IF(OR(F9=\"\",iniTurma!I9=\"\"),\"\",VLOOKUP(iniTurma!I9,References!A$503:J$575,F9,0))","v":""},{"$f":"IF(OR(F9=\"\",iniTurma!J9=\"\"),\"\",IF(iniTurma!D9=\"Menino\",VLOOKUP(iniTurma!J9,References!A$603:J$681,F9,0),VLOOKUP(iniTurma!J9,References!A$803:J$881,F9,0)))","v":""},"",{"$f":"IF(K9=\"\",\"\",VLOOKUP(K9,References!A$903:B$1362,2,))","v":""},"",{"$f":"IF(L9=\"\",\"\",VLOOKUP(L9,References!A$1403:B$1903,2,0))","v":""},"",""]
[{"$f":"IF(iniTurma!B10<>\"\",iniTurma!B10,\"\")","v":""},{"$f":"iniTurma!A10","v":7},{"$f":"IF(iniTurma!C10=0,\"\",iniTurma!C10)","v":""},{"$f":"IF(OR(iniTurma!E10=\"\",iniTurma!F10=\"\"),\"\",(iniTurma!F10-iniTurma!E10)/365.25)","v":""},{"$f":"IF(OR(iniTurma!E10=\"\",iniTurma!F10=\"\"),\"\",iniTurma!F10-iniTurma!E10)","v":""},"",{"$f":"IF(OR(F10=\"\",iniTurma!G10=\"\"),\"\",VLOOKUP(iniTurma!G10,References!A$3:J$78,F10,0))","v":""},{"$f":"IF(OR(F10=\"\",iniTurma!H10=\"\"),\"\",IF(iniTurma!D10=\"Menino\",VLOOKUP(iniTurma!H10,References!A$103:J$208,F10,0),VLOOKUP(iniTurma!H10,References!A$303:J$413,F10,0)))","v":""},{"$f":"IF(OR(F10=\"\",iniTurma!I10=\"\"),\"\",VLOOKUP(iniTurma!I10,References!A$503:J$575,F10,0))","v":""},{"$f":"IF(OR(F10=\"\",iniTurma!J10=\"\"),\"\",IF(iniTurma!D10=\"Menino\",VLOOKUP(iniTurma!J10,References!A$603:J$681,F10,0),VLOOKUP(iniTurma!J10,References!A$803:J$881,F10,0)))","v":""},"",{"$f":"IF(K10=\"\",\"\",VLOOKUP(K10,References!A$903:B$1362,2,))","v":""},"",{"$f":"IF(L10=\"\",\"\",VLOOKUP(L10,References!A$1403:B$1903,2,0))","v":""},"",""]
[{"$f":"IF(iniTurma!B11<>\"\",iniTurma!B11,\"\")","v":""},{"$f":"iniTurma!A11","v":8},{"$f":"IF(iniTurma!C11=0,\"\",iniTurma!C11)","v":""},{"$f":"IF(OR(iniTurma!E11=\"\",iniTurma!F11=\"\"),\"\",(iniTurma!F11-iniTurma!E11)/365.25)","v":""},{"$f":"IF(OR(iniTurma!E11=\"\",iniTurma!F11=\"\"),\"\",iniTurma!F11-iniTurma!E11)","v":""},"",{"$f":"IF(OR(F11=\"\",iniTurma!G11=\"\"),\"\",VLOOKUP(iniTurma!G11,References!A$3:J$78,F11,0))","v":""},{"$f":"IF(OR(F11=\"\",iniTurma!H11=\"\"),\"\",IF(iniTurma!D11=\"Menino\",VLOOKUP(iniTurma!H11,References!A$103:J$208,F11,0),VLOOKUP(iniTurma!H11,References!A$303:J$413,F11,0)))","v":""},{"$f":"IF(OR(F11=\"\",iniTurma!I11=\"\"),\"\",VLOOKUP(iniTurma!I11,References!A$503:J$575,F11,0))","v":""},{"$f":"IF(OR(F11=\"\",iniTurma!J11=\"\"),\"\",IF(iniTurma!D11=\"Menino\",VLOOKUP(iniTurma!J11,References!A$603:J$681,F11,0),VLOOKUP(iniTurma!J11,References!A$803:J$881,F11,0)))","v":""},"",{"$f":"IF(K11=\"\",\"\",VLOOKUP(K11,References!A$903:B$1362,2,))","v":""},"",{"$f":"IF(L11=\"\",\"\",VLOOKUP(L11,References!A$1403:B$1903,2,0))","v":""},"",""]
[{"$f":"IF(iniTurma!B12<>\"\",iniTurma!B12,\"\")","v":""},{"$f":"iniTurma!A12","v":9},{"$f":"IF(iniTurma!C12=0,\"\",iniTurma!C12)","v":""},{"$f":"IF(OR(iniTurma!E12=\"\",iniTurma!F12=\"\"),\"\",(iniTurma!F12-iniTurma!E12)/365.25)","v":""},{"$f":"IF(OR(iniTurma!E12=\"\",iniTurma!F12=\"\"),\"\",iniTurma!F12-iniTurma!E12)","v":""},"",{"$f":"IF(OR(F12=\"\",iniTurma!G12=\"\"),\"\",VLOOKUP(iniTurma!G12,References!A$3:J$78,F12,0))","v":""},{"$f":"IF(OR(F12=\"\",iniTurma!H12=\"\"),\"\",IF(iniTurma!D12=\"Menino\",VLOOKUP(iniTurma!H12,References!A$103:J$208,F12,0),VLOOKUP(iniTurma!H12,References!A$303:J$413,F12,0)))","v":""},{"$f":"IF(OR(F12=\"\",iniTurma!I12=\"\"),\"\",VLOOKUP(iniTurma!I12,References!A$503:J$575,F12,0))","v":""},{"$f":"IF(OR(F12=\"\",iniTurma!J12=\"\"),\"\",IF(iniTurma!D12=\"Menino\",VLOOKUP(iniTurma!J12,References!A$603:J$681,F12,0),VLOOKUP(iniTurma!J12,References!A$803:J$881,F12,0)))","v":""},"",{"$f":"IF(K12=\"\",\"\",VLOOKUP(K12,References!A$903:B$1362,2,))","v":""},"",{"$f":"IF(L12=\"\",\"\",VLOOKUP(L12,References!A$1403:B$1903,2,0))","v":""},"",""]
[{"$f":"IF(iniTurma!B13<>\"\",iniTurma!B13,\"\")","v":""},{"$f":"iniTurma!A13","v":10},{"$f":"IF(iniTurma!C13=0,\"\",iniTurma!C13)","v":""},{"$f":"IF(OR(iniTurma!E13=\"\",iniTurma!F13=\"\"),\"\",(iniTurma!F13-iniTurma!E13)/365.25)","v":""},{"$f":"IF(OR(iniTurma!E13=\"\",iniTurma!F13=\"\"),\"\",iniTurma!F13-iniTurma!E13)","v":""},"",{"$f":"IF(OR(F13=\"\",iniTurma!G13=\"\"),\"\",VLOOKUP(iniTurma!G13,References!A$3:J$78,F13,0))","v":""},{"$f":"IF(OR(F13=\"\",iniTurma!H13=\"\"),\"\",IF(iniTurma!D13=\"Menino\",VLOOKUP(iniTurma!H13,References!A$103:J$208,F13,0),VLOOKUP(iniTurma!H13,References!A$303:J$413,F13,0)))","v":""},{"$f":"IF(OR(F13=\"\",iniTurma!I13=\"\"),\"\",VLOOKUP(iniTurma!I13,References!A$503:J$575,F13,0))","v":""},{"$f":"IF(OR(F13=\"\",iniTurma!J13=\"\"),\"\",IF(iniTurma!D13=\"Menino\",VLOOKUP(iniTurma!J13,References!A$603:J$681,F13,0),VLOOKUP(iniTurma!J13,References!A$803:J$881,F13,0)))","v":""},"",{"$f":"IF(K13=\"\",\"\",VLOOKUP(K13,References!A$903:B$1362,2,))","v":""},"",{"$f":"IF(L13=\"\",\"\",VLOOKUP(L13,References!A$1403:B$1903,2,0))","v":""},"",""]
[{"$f":"IF(iniTurma!B14<>\"\",iniTurma!B14,\"\")","v":""},{"$f":"iniTurma!A14","v":11},{"$f":"IF(iniTurma!C14=0,\"\",iniTurma!C14)","v":""},{"$f":"IF(OR(iniTurma!E14=\"\",iniTurma!F14=\"\"),\"\",(iniTurma!F14-iniTurma!E14)/365.25)","v":""},{"$f":"IF(OR(iniTurma!E14=\"\",iniTurma!F14=\"\"),\"\",iniTurma!F14-iniTurma!E14)","v":""},"",{"$f":"IF(OR(F14=\"\",iniTurma!G14=\"\"),\"\",VLOOKUP(iniTurma!G14,References!A$3:J$78,F14,0))","v":""},{"$f":"IF(OR(F14=\"\",iniTurma!H14=\"\"),\"\",IF(iniTurma!D14=\"Menino\",VLOOKUP(iniTurma!H14,References!A$103:J$208,F14,0),VLOOKUP(iniTurma!H14,References!A$303:J$413,F14,0)))","v":""},{"$f":"IF(OR(F14=\"\",iniTurma!I14=\"\"),\"\",VLOOKUP(iniTurma!I14,References!A$503:J$575,F14,0))","v":""},{"$f":"IF(OR(F14=\"\",iniTurma!J14=\"\"),\"\",IF(iniTurma!D14=\"Menino\",VLOOKUP(iniTurma!J14,References!A$603:J$681,F14,0),VLOOKUP(iniTurma!J14,References!A$803:J$881,F14,0)))","v":""},"",{"$f":"IF(K14=\"\",\"\",VLOOKUP(K14,References!A$903:B$1362,2,))","v":""},"",{"$f":"IF(L14=\"\",\"\",VLOOKUP(L14,References!A$1403:B$1903,2,0))","v":""},"",""]
[{"$f":"IF(iniTurma!B15<>\"\",iniTurma!B15,\"\")","v":""},{"$f":"iniTurma!A15","v":12},{"$f":"IF(iniTurma!C15=0,\"\",iniTurma!C15)","v":""},{"$f":"IF(OR(iniTurma!E15=\"\",iniTurma!F15=\"\"),\"\",(iniTurma!F15-iniTurma!E15)/365.25)","v":""},{"$f":"IF(OR(iniTurma!E15=\"\",iniTurma!F15=\"\"),\"\",iniTurma!F15-iniTurma!E15)","v":""},"",{"$f":"IF(OR(F15=\"\",iniTurma!G15=\"\"),\"\",VLOOKUP(iniTurma!G15,References!A$3:J$78,F15,0))","v":""},{"$f":"IF(OR(F15=\"\",iniTurma!H15=\"\"),\"\",IF(iniTurma!D15=\"Menino\",VLOOKUP(iniTurma!H15,References!A$103:J$208,F15,0),VLOOKUP(iniTurma!H15,References!A$303:J$413,F15,0)))","v":""},{"$f":"IF(OR(F15=\"\",iniTurma!I15=\"\"),\"\",VLOOKUP(iniTurma!I15,References!A$503:J$575,F15,0))","v":""},{"$f":"IF(OR(F15=\"\",iniTurma!J15=\"\"),\"\",IF(iniTurma!D15=\"Menino\",VLOOKUP(iniTurma!J15,References!A$603:J$681,F15,0),VLOOKUP(iniTurma!J15,References!A$803:J$881,F15,0)))","v":""},"",{"$f":"IF(K15=\"\",\"\",VLOOKUP(K15,References!A$903:B$1362,2,))","v":""},"",{"$f":"IF(L15=\"\",\"\",VLOOKUP(L15,References!A$1403:B$1903,2,0))","v":""},"",""]
[{"$f":"IF(iniTurma!B16<>\"\",iniTurma!B16,\"\")","v":""},{"$f":"iniTurma!A16","v":13},{"$f":"IF(iniTurma!C16=0,\"\",iniTurma!C16)","v":""},{"$f":"IF(OR(iniTurma!E16=\"\",iniTurma!F16=\"\"),\"\",(iniTurma!F16-iniTurma!E16)/365.25)","v":""},{"$f":"IF(OR(iniTurma!E16=\"\",iniTurma!F16=\"\"),\"\",iniTurma!F16-iniTurma!E16)","v":""},"",{"$f":"IF(OR(F16=\"\",iniTurma!G16=\"\"),\"\",VLOOKUP(iniTurma!G16,References!A$3:J$78,F16,0))","v":""},{"$f":"IF(OR(F16=\"\",iniTurma!H16=\"\"),\"\",IF(iniTurma!D16=\"Menino\",VLOOKUP(iniTurma!H16,References!A$103:J$208,F16,0),VLOOKUP(iniTurma!H16,References!A$303:J$413,F16,0)))","v":""},{"$f":"IF(OR(F16=\"\",iniTurma!I16=\"\"),\"\",VLOOKUP(iniTurma!I16,References!A$503:J$575,F16,0))","v":""},{"$f":"IF(OR(F16=\"\",iniTurma!J16=\"\"),\"\",IF(iniTurma!D16=\"Menino\",VLOOKUP(iniTurma!J16,References!A$603:J$681,F16,0),VLOOKUP(iniTurma!J16,References!A$803:J$881,F16,0)))","v":""},"",{"$f":"IF(K16=\"\",\"\",VLOOKUP(K16,References!A$903:B$1362,2,))","v":""},"",{"$f":"IF(L16=\"\",\"\",VLOOKUP(L16,References!A$1403:B$1903,2,0))","v":""},"",""]
[{"$f":"IF(iniTurma!B17<>\"\",iniTurma!B17,\"\")","v":""},{"$f":"iniTurma!A17","v":14},{"$f":"IF(iniTurma!C17=0,\"\",iniTurma!C17)","v":""},{"$f":"IF(OR(iniTurma!E17=\"\",iniTurma!F17=\"\"),\"\",(iniTurma!F17-iniTurma!E17)/365.25)","v":""},{"$f":"IF(OR(iniTurma!E17=\"\",iniTurma!F17=\"\"),\"\",iniTurma!F17-iniTurma!E17)","v":""},"",{"$f":"IF(OR(F17=\"\",iniTurma!G17=\"\"),\"\",VLOOKUP(iniTurma!G17,References!A$3:J$78,F17,0))","v":""},{"$f":"IF(OR(F17=\"\",iniTurma!H17=\"\"),\"\",IF(iniTurma!D17=\"Menino\",VLOOKUP(iniTurma!H17,References!A$103:J$208,F17,0),VLOOKUP(iniTurma!H17,References!A$303:J$413,F17,0)))","v":""},{"$f":"IF(OR(F17=\"\",iniTurma!I17=\"\"),\"\",VLOOKUP(iniTurma!I17,References!A$503:J$575,F17,0))","v":""},{"$f":"IF(OR(F17=\"\",iniTurma!J17=\"\"),\"\",IF(iniTurma!D17=\"Menino\",VLOOKUP(iniTurma!J17,References!A$603:J$681,F17,0),VLOOKUP(iniTurma!J17,References!A$803:J$881,F17,0)))","v":""},"",{"$f":"IF(K17=\"\",\"\",VLOOKUP(K17,References!A$903:B$1362,2,))","v":""},"",{"$f":"IF(L17=\"\",\"\",VLOOKUP(L17,References!A$1403:B$1903,2,0))","v":""},"",""]
[{"$f":"IF(iniTurma!B18<>\"\",iniTurma!B18,\"\")","v":""},{"$f":"iniTurma!A18","v":15},{"$f":"IF(iniTurma!C18=0,\"\",iniTurma!C18)","v":""},{"$f":"IF(OR(iniTurma!E18=\"\",iniTurma!F18=\"\"),\"\",(iniTurma!F18-iniTurma!E18)/365.25)","v":""},{"$f":"IF(OR(iniTurma!E18=\"\",iniTurma!F18=\"\"),\"\",iniTurma!F18-iniTurma!E18)","v":""},"",{"$f":"IF(OR(F18=\"\",iniTurma!G18=\"\"),\"\",VLOOKUP(iniTurma!G18,References!A$3:J$78,F18,0))","v":""},{"$f":"IF(OR(F18=\"\",iniTurma!H18=\"\"),\"\",IF(iniTurma!D18=\"Menino\",VLOOKUP(iniTurma!H18,References!A$103:J$208,F18,0),VLOOKUP(iniTurma!H18,References!A$303:J$413,F18,0)))","v":""},{"$f":"IF(OR(F18=\"\",iniTurma!I18=\"\"),\"\",VLOOKUP(iniTurma!I18,References!A$503:J$575,F18,0))","v":""},{"$f":"IF(OR(F18=\"\",iniTurma!J18=\"\"),\"\",IF(iniTurma!D18=\"Menino\",VLOOKUP(iniTurma!J18,References!A$603:J$681,F18,0),VLOOKUP(iniTurma!J18,References!A$803:J$881,F18,0)))","v":""},"",{"$f":"IF(K18=\"\",\"\",VLOOKUP(K18,References!A$903:B$1362,2,))","v":""},"",{"$f":"IF(L18=\"\",\"\",VLOOKUP(L18,References!A$1403:B$1903,2,0))","v":""},"",""]
[{"$f":"IF(iniTurma!B19<>\"\",iniTurma!B19,\"\")","v":""},{"$f":"iniTurma!A19","v":16},{"$f":"IF(iniTurma!C19=0,\"\",iniTurma!C19)","v":""},{"$f":"IF(OR(iniTurma!E19=\"\",iniTurma!F19=\"\"),\"\",(iniTurma!F19-iniTurma!E19)/365.25)","v":""},{"$f":"IF(OR(iniTurma!E19=\"\",iniTurma!F19=\"\"),\"\",iniTurma!F19-iniTurma!E19)","v":""},"",{"$f":"IF(OR(F19=\"\",iniTurma!G19=\"\"),\"\",VLOOKUP(iniTurma!G19,References!A$3:J$78,F19,0))","v":""},{"$f":"IF(OR(F19=\"\",iniTurma!H19=\"\"),\"\",IF(iniTurma!D19=\"Menino\",VLOOKUP(iniTurma!H19,References!A$103:J$208,F19,0),VLOOKUP(iniTurma!H19,References!A$303:J$413,F19,0)))","v":""},{"$f":"IF(OR(F19=\"\",iniTurma!I19=\"\"),\"\",VLOOKUP(iniTurma!I19,References!A$503:J$575,F19,0))","v":""},{"$f":"IF(OR(F19=\"\",iniTurma!J19=\"\"),\"\",IF(iniTurma!D19=\"Menino\",VLOOKUP(iniTurma!J19,References!A$603:J$681,F19,0),VLOOKUP(iniTurma!J19,References!A$803:J$881,F19,0)))","v":""},"",{"$f":"IF(K19=\"\",\"\",VLOOKUP(K19,References!A$903:B$1362,2,))","v":""},"",{"$f":"IF(L19=\"\",\"\",VLOOKUP(L19,References!A$1403:B$1903,2,0))","v":""},"",""]
[{"$f":"IF(iniTurma!B20<>\"\",iniTurma!B20,\"\")","v":""},{"$f":"iniTurma!A20","v":17},{"$f":"IF(iniTurma!C20=0,\"\",iniTurma!C20)","v":""},{"$f":"IF(OR(iniTurma!E20=\"\",iniTurma!F20=\"\"),\"\",(iniTurma!F20-iniTurma!E20)/365.25)","v":""},{"$f":"IF(OR(iniTurma!E20=\"\",iniTurma!F20=\"\"),\"\",iniTurma!F20-iniTurma!E20)","v":""},"",{"$f":"IF(OR(F20=\"\",iniTurma!G20=\"\"),\"\",VLOOKUP(iniTurma!G20,References!A$3:J$78,F20,0))","v":""},{"$f":"IF(OR(F20=\"\",iniTurma!H20=\"\"),\"\",IF(iniTurma!D20=\"Menino\",VLOOKUP(iniTurma!H20,References!A$103:J$208,F20,0),VLOOKUP(iniTurma!H20,References!A$303:J$413,F20,0)))","v":""},{"$f":"IF(OR(F20=\"\",iniTurma!I20=\"\"),\"\",VLOOKUP(iniTurma!I20,References!A$503:J$575,F20,0))","v":""},{"$f":"IF(OR(F20=\"\",iniTurma!J20=\"\"),\"\",IF(iniTurma!D20=\"Menino\",VLOOKUP(iniTurma!J20,References!A$603:J$681,F20,0),VLOOKUP(iniTurma!J20,References!A$803:J$881,F20,0)))","v":""},"",{"$f":"IF(K20=\"\",\"\",VLOOKUP(K20,References!A$903:B$1362,2,))","v":""},"",{"$f":"IF(L20=\"\",\"\",VLOOKUP(L20,References!A$1403:B$1903,2,0))","v":""},"",""]
[{"$f":"IF(iniTurma!B21<>\"\",iniTurma!B21,\"\")","v":""},{"$f":"iniTurma!A21","v":18},{"$f":"IF(iniTurma!C21=0,\"\",iniTurma!C21)","v":""},{"$f":"IF(OR(iniTurma!E21=\"\",iniTurma!F21=\"\"),\"\",(iniTurma!F21-iniTurma!E21)/365.25)","v":""},{"$f":"IF(OR(iniTurma!E21=\"\",iniTurma!F21=\"\"),\"\",iniTurma!F21-iniTurma!E21)","v":""},"",{"$f":"IF(OR(F21=\"\",iniTurma!G21=\"\"),\"\",VLOOKUP(iniTurma!G21,References!A$3:J$78,F21,0))","v":""},{"$f":"IF(OR(F21=\"\",iniTurma!H21=\"\"),\"\",IF(iniTurma!D21=\"Menino\",VLOOKUP(iniTurma!H21,References!A$103:J$208,F21,0),VLOOKUP(iniTurma!H21,References!A$303:J$413,F21,0)))","v":""},{"$f":"IF(OR(F21=\"\",iniTurma!I21=\"\"),\"\",VLOOKUP(iniTurma!I21,References!A$503:J$575,F21,0))","v":""},{"$f":"IF(OR(F21=\"\",iniTurma!J21=\"\"),\"\",IF(iniTurma!D21=\"Menino\",VLOOKUP(iniTurma!J21,References!A$603:J$681,F21,0),VLOOKUP(iniTurma!J21,References!A$803:J$881,F21,0)))","v":""},"",{"$f":"IF(K21=\"\",\"\",VLOOKUP(K21,References!A$903:B$1362,2,))","v":""},"",{"$f":"IF(L21=\"\",\"\",VLOOKUP(L21,References!A$1403:B$1903,2,0))","v":""},"",""]
[{"$f":"IF(iniTurma!B22<>\"\",iniTurma!B22,\"\")","v":""},{"$f":"iniTurma!A22","v":19},{"$f":"IF(iniTurma!C22=0,\"\",iniTurma!C22)","v":""},{"$f":"IF(OR(iniTurma!E22=\"\",iniTurma!F22=\"\"),\"\",(iniTurma!F22-iniTurma!E22)/365.25)","v":""},{"$f":"IF(OR(iniTurma!E22=\"\",iniTurma!F22=\"\"),\"\",iniTurma!F22-iniTurma!E22)","v":""},"",{"$f":"IF(OR(F22=\"\",iniTurma!G22=\"\"),\"\",VLOOKUP(iniTurma!G22,References!A$3:J$78,F22,0))","v":""},{"$f":"IF(OR(F22=\"\",iniTurma!H22=\"\"),\"\",IF(iniTurma!D22=\"Menino\",VLOOKUP(iniTurma!H22,References!A$103:J$208,F22,0),VLOOKUP(iniTurma!H22,References!A$303:J$413,F22,0)))","v":""},{"$f":"IF(OR(F22=\"\",iniTurma!I22=\"\"),\"\",VLOOKUP(iniTurma!I22,References!A$503:J$575,F22,0))","v":""},{"$f":"IF(OR(F22=\"\",iniTurma!J22=\"\"),\"\",IF(iniTurma!D22=\"Menino\",VLOOKUP(iniTurma!J22,References!A$603:J$681,F22,0),VLOOKUP(iniTurma!J22,References!A$803:J$881,F22,0)))","v":""},"",{"$f":"IF(K22=\"\",\"\",VLOOKUP(K22,References!A$903:B$1362,2,))","v":""},"",{"$f":"IF(L22=\"\",\"\",VLOOKUP(L22,References!A$1403:B$1903,2,0))","v":""},"",""]
[{"$f":"IF(iniTurma!B23<>\"\",iniTurma!B23,\"\")","v":""},{"$f":"iniTurma!A23","v":20},{"$f":"IF(iniTurma!C23=0,\"\",iniTurma!C23)","v":""},{"$f":"IF(OR(iniTurma!E23=\"\",iniTurma!F23=\"\"),\"\",(iniTurma!F23-iniTurma!E23)/365.25)","v":""},{"$f":"IF(OR(iniTurma!E23=\"\",iniTurma!F23=\"\"),\"\",iniTurma!F23-iniTurma!E23)","v":""},"",{"$f":"IF(OR(F23=\"\",iniTurma!G23=\"\"),\"\",VLOOKUP(iniTurma!G23,References!A$3:J$78,F23,0))","v":""},{"$f":"IF(OR(F23=\"\",iniTurma!H23=\"\"),\"\",IF(iniTurma!D23=\"Menino\",VLOOKUP(iniTurma!H23,References!A$103:J$208,F23,0),VLOOKUP(iniTurma!H23,References!A$303:J$413,F23,0)))","v":""},{"$f":"IF(OR(F23=\"\",iniTurma!I23=\"\"),\"\",VLOOKUP(iniTurma!I23,References!A$503:J$575,F23,0))","v":""},{"$f":"IF(OR(F23=\"\",iniTurma!J23=\"\"),\"\",IF(iniTurma!D23=\"Menino\",VLOOKUP(iniTurma!J23,References!A$603:J$681,F23,0),VLOOKUP(iniTurma!J23,References!A$803:J$881,F23,0)))","v":""},"",{"$f":"IF(K23=\"\",\"\",VLOOKUP(K23,References!A$903:B$1362,2,))","v":""},"",{"$f":"IF(L23=\"\",\"\",VLOOKUP(L23,References!A$1403:B$1903,2,0))","v":""},"",""]
[{"$f":"IF(iniTurma!B24<>\"\",iniTurma!B24,\"\")","v":""},{"$f":"iniTurma!A24","v":21},{"$f":"IF(iniTurma!C24=0,\"\",iniTurma!C24)","v":""},{"$f":"IF(OR(iniTurma!E24=\"\",iniTurma!F24=\"\"),\"\",(iniTurma!F24-iniTurma!E24)/365.25)","v":""},{"$f":"IF(OR(iniTurma!E24=\"\",iniTurma!F24=\"\"),\"\",iniTurma!F24-iniTurma!E24)","v":""},"",{"$f":"IF(OR(F24=\"\",iniTurma!G24=\"\"),\"\",VLOOKUP(iniTurma!G24,References!A$3:J$78,F24,0))","v":""},{"$f":"IF(OR(F24=\"\",iniTurma!H24=\"\"),\"\",IF(iniTurma!D24=\"Menino\",VLOOKUP(iniTurma!H24,References!A$103:J$208,F24,0),VLOOKUP(iniTurma!H24,References!A$303:J$413,F24,0)))","v":""},{"$f":"IF(OR(F24=\"\",iniTurma!I24=\"\"),\"\",VLOOKUP(iniTurma!I24,References!A$503:J$575,F24,0))","v":""},{"$f":"IF(OR(F24=\"\",iniTurma!J24=\"\"),\"\",IF(iniTurma!D24=\"Menino\",VLOOKUP(iniTurma!J24,References!A$603:J$681,F24,0),VLOOKUP(iniTurma!J24,References!A$803:J$881,F24,0)))","v":""},"",{"$f":"IF(K24=\"\",\"\",VLOOKUP(K24,References!A$903:B$1362,2,))","v":""},"",{"$f":"IF(L24=\"\",\"\",VLOOKUP(L24,References!A$1403:B$1903,2,0))","v":""},"",""]
[{"$f":"IF(iniTurma!B25<>\"\",iniTurma!B25,\"\")","v":""},{"$f":"iniTurma!A25","v":22},{"$f":"IF(iniTurma!C25=0,\"\",iniTurma!C25)","v":""},{"$f":"IF(OR(iniTurma!E25=\"\",iniTurma!F25=\"\"),\"\",(iniTurma!F25-iniTurma!E25)/365.25)","v":""},{"$f":"IF(OR(iniTurma!E25=\"\",iniTurma!F25=\"\"),\"\",iniTurma!F25-iniTurma!E25)","v":""},"",{"$f":"IF(OR(F25=\"\",iniTurma!G25=\"\"),\"\",VLOOKUP(iniTurma!G25,References!A$3:J$78,F25,0))","v":""},{"$f":"IF(OR(F25=\"\",iniTurma!H25=\"\"),\"\",IF(iniTurma!D25=\"Menino\",VLOOKUP(iniTurma!H25,References!A$103:J$208,F25,0),VLOOKUP(iniTurma!H25,References!A$303:J$413,F25,0)))","v":""},{"$f":"IF(OR(F25=\"\",iniTurma!I25=\"\"),\"\",VLOOKUP(iniTurma!I25,References!A$503:J$575,F25,0))","v":""},{"$f":"IF(OR(F25=\"\",iniTurma!J25=\"\"),\"\",IF(iniTurma!D25=\"Menino\",VLOOKUP(iniTurma!J25,References!A$603:J$681,F25,0),VLOOKUP(iniTurma!J25,References!A$803:J$881,F25,0)))","v":""},"",{"$f":"IF(K25=\"\",\"\",VLOOKUP(K25,References!A$903:B$1362,2,))","v":""},"",{"$f":"IF(L25=\"\",\"\",VLOOKUP(L25,References!A$1403:B$1903,2,0))","v":""},"",""]
[{"$f":"IF(iniTurma!B26<>\"\",iniTurma!B26,\"\")","v":""},{"$f":"iniTurma!A26","v":23},{"$f":"IF(iniTurma!C26=0,\"\",iniTurma!C26)","v":""},{"$f":"IF(OR(iniTurma!E26=\"\",iniTurma!F26=\"\"),\"\",(iniTurma!F26-iniTurma!E26)/365.25)","v":""},{"$f":"IF(OR(iniTurma!E26=\"\",iniTurma!F26=\"\"),\"\",iniTurma!F26-iniTurma!E26)","v":""},"",{"$f":"IF(OR(F26=\"\",iniTurma!G26=\"\"),\"\",VLOOKUP(iniTurma!G26,References!A$3:J$78,F26,0))","v":""},{"$f":"IF(OR(F26=\"\",iniTurma!H26=\"\"),\"\",IF(iniTurma!D26=\"Menino\",VLOOKUP(iniTurma!H26,References!A$103:J$208,F26,0),VLOOKUP(iniTurma!H26,References!A$303:J$413,F26,0)))","v":""},{"$f":"IF(OR(F26=\"\",iniTurma!I26=\"\"),\"\",VLOOKUP(iniTurma!I26,References!A$503:J$575,F26,0))","v":""},{"$f":"IF(OR(F26=\"\",iniTurma!J26=\"\"),\"\",IF(iniTurma!D26=\"Menino\",VLOOKUP(iniTurma!J26,References!A$603:J$681,F26,0),VLOOKUP(iniTurma!J26,References!A$803:J$881,F26,0)))","v":""},"",{"$f":"IF(K26=\"\",\"\",VLOOKUP(K26,References!A$903:B$1362,2,))","v":""},"",{"$f":"IF(L26=\"\",\"\",VLOOKUP(L26,References!A$1403:B$1903,2,0))","v":""},"",""]
[{"$f":"IF(iniTurma!B27<>\"\",iniTurma!B27,\"\")","v":""},{"$f":"iniTurma!A27","v":24},{"$f":"IF(iniTurma!C27=0,\"\",iniTurma!C27)","v":""},{"$f":"IF(OR(iniTurma!E27=\"\",iniTurma!F27=\"\"),\"\",(iniTurma!F27-iniTurma!E27)/365.25)","v":""},{"$f":"IF(OR(iniTurma!E27=\"\",iniTurma!F27=\"\"),\"\",iniTurma!F27-iniTurma!E27)","v":""},"",{"$f":"IF(OR(F27=\"\",iniTurma!G27=\"\"),\"\",VLOOKUP(iniTurma!G27,References!A$3:J$78,F27,0))","v":""},{"$f":"IF(OR(F27=\"\",iniTurma!H27=\"\"),\"\",IF(iniTurma!D27=\"Menino\",VLOOKUP(iniTurma!H27,References!A$103:J$208,F27,0),VLOOKUP(iniTurma!H27,References!A$303:J$413,F27,0)))","v":""},{"$f":"IF(OR(F27=\"\",iniTurma!I27=\"\"),\"\",VLOOKUP(iniTurma!I27,References!A$503:J$575,F27,0))","v":""},{"$f":"IF(OR(F27=\"\",iniTurma!J27=\"\"),\"\",IF(iniTurma!D27=\"Menino\",VLOOKUP(iniTurma!J27,References!A$603:J$681,F27,0),VLOOKUP(iniTurma!J27,References!A$803:J$881,F27,0)))","v":""},"",{"$f":"IF(K27=\"\",\"\",VLOOKUP(K27,References!A$903:B$1362,2,))","v":""},"",{"$f":"IF(L27=\"\",\"\",VLOOKUP(L27,References!A$1403:B$1903,2,0))","v":""},"",""]
[{"$f":"IF(iniTurma!B28<>\"\",iniTurma!B28,\"\")","v":""},{"$f":"iniTurma!A28","v":25},{"$f":"IF(iniTurma!C28=0,\"\",iniTurma!C28)","v":""},{"$f":"IF(OR(iniTurma!E28=\"\",iniTurma!F28=\"\"),\"\",(iniTurma!F28-iniTurma!E28)/365.25)","v":""},{"$f":"IF(OR(iniTurma!E28=\"\",iniTurma!F28=\"\"),\"\",iniTurma!F28-iniTurma!E28)","v":""},"",{"$f":"IF(OR(F28=\"\",iniTurma!G28=\"\"),\"\",VLOOKUP(iniTurma!G28,References!A$3:J$78,F28,0))","v":""},{"$f":"IF(OR(F28=\"\",iniTurma!H28=\"\"),\"\",IF(iniTurma!D28=\"Menino\",VLOOKUP(iniTurma!H28,References!A$103:J$208,F28,0),VLOOKUP(iniTurma!H28,References!A$303:J$413,F28,0)))","v":""},{"$f":"IF(OR(F28=\"\",iniTurma!I28=\"\"),\"\",VLOOKUP(iniTurma!I28,References!A$503:J$575,F28,0))","v":""},{"$f":"IF(OR(F28=\"\",iniTurma!J28=\"\"),\"\",IF(iniTurma!D28=\"Menino\",VLOOKUP(iniTurma!J28,References!A$603:J$681,F28,0),VLOOKUP(iniTurma!J28,References!A$803:J$881,F28,0)))","v":""},"",{"$f":"IF(K28=\"\",\"\",VLOOKUP(K28,References!A$903:B$1362,2,))","v":""},"",{"$f":"IF(L28=\"\",\"\",VLOOKUP(L28,References!A$1403:B$1903,2,0))","v":""},"",""]
[{"$f":"IF(iniTurma!B29<>\"\",iniTurma!B29,\"\")","v":""},{"$f":"iniTurma!A29","v":26},{"$f":"IF(iniTurma!C29=0,\"\",iniTurma!C29)","v":""},{"$f":"IF(OR(iniTurma!E29=\"\",iniTurma!F29=\"\"),\"\",(iniTurma!F29-iniTurma!E29)/365.25)","v":""},{"$f":"IF(OR(iniTurma!E29=\"\",iniTurma!F29=\"\"),\"\",iniTurma!F29-iniTurma!E29)","v":""},"",{"$f":"IF(OR(F29=\"\",iniTurma!G29=\"\"),\"\",VLOOKUP(iniTurma!G29,References!A$3:J$78,F29,0))","v":""},{"$f":"IF(OR(F29=\"\",iniTurma!H29=\"\"),\"\",IF(iniTurma!D29=\"Menino\",VLOOKUP(iniTurma!H29,References!A$103:J$208,F29,0),VLOOKUP(iniTurma!H29,References!A$303:J$413,F29,0)))","v":""},{"$f":"IF(OR(F29=\"\",iniTurma!I29=\"\"),\"\",VLOOKUP(iniTurma!I29,References!A$503:J$575,F29,0))","v":""},{"$f":"IF(OR(F29=\"\",iniTurma!J29=\"\"),\"\",IF(iniTurma!D29=\"Menino\",VLOOKUP(iniTurma!J29,References!A$603:J$681,F29,0),VLOOKUP(iniTurma!J29,References!A$803:J$881,F29,0)))","v":""},"",{"$f":"IF(K29=\"\",\"\",VLOOKUP(K29,References!A$903:B$1362,2,))","v":""},"",{"$f":"IF(L29=\"\",\"\",VLOOKUP(L29,References!A$1403:B$1903,2,0))","v":""},"",""]
[{"$f":"IF(iniTurma!B30<>\"\",iniTurma!B30,\"\")","v":""},{"$f":"iniTurma!A30","v":27},{"$f":"IF(iniTurma!C30=0,\"\",iniTurma!C30)","v":""},{"$f":"IF(OR(iniTurma!E30=\"\",iniTurma!F30=\"\"),\"\",(iniTurma!F30-iniTurma!E30)/365.25)","v":""},{"$f":"IF(OR(iniTurma!E30=\"\",iniTurma!F30=\"\"),\"\",iniTurma!F30-iniTurma!E30)","v":""},"",{"$f":"IF(OR(F30=\"\",iniTurma!G30=\"\"),\"\",VLOOKUP(iniTurma!G30,References!A$3:J$78,F30,0))","v":""},{"$f":"IF(OR(F30=\"\",iniTurma!H30=\"\"),\"\",IF(iniTurma!D30=\"Menino\",VLOOKUP(iniTurma!H30,References!A$103:J$208,F30,0),VLOOKUP(iniTurma!H30,References!A$303:J$413,F30,0)))","v":""},{"$f":"IF(OR(F30=\"\",iniTurma!I30=\"\"),\"\",VLOOKUP(iniTurma!I30,References!A$503:J$575,F30,0))","v":""},{"$f":"IF(OR(F30=\"\",iniTurma!J30=\"\"),\"\",IF(iniTurma!D30=\"Menino\",VLOOKUP(iniTurma!J30,References!A$603:J$681,F30,0),VLOOKUP(iniTurma!J30,References!A$803:J$881,F30,0)))","v":""},"",{"$f":"IF(K30=\"\",\"\",VLOOKUP(K30,References!A$903:B$1362,2,))","v":""},"",{"$f":"IF(L30=\"\",\"\",VLOOKUP(L30,References!A$1403:B$1903,2,0))","v":""},"",""]
[{"$f":"IF(iniTurma!B31<>\"\",iniTurma!B31,\"\")","v":""},{"$f":"iniTurma!A31","v":28},{"$f":"IF(iniTurma!C31=0,\"\",iniTurma!C31)","v":""},{"$f":"IF(OR(iniTurma!E31=\"\",iniTurma!F31=\"\"),\"\",(iniTurma!F31-iniTurma!E31)/365.25)","v":""},{"$f":"IF(OR(iniTurma!E31=\"\",iniTurma!F31=\"\"),\"\",iniTurma!F31-iniTurma!E31)","v":""},"",{"$f":"IF(OR(F31=\"\",iniTurma!G31=\"\"),\"\",VLOOKUP(iniTurma!G31,References!A$3:J$78,F31,0))","v":""},{"$f":"IF(OR(F31=\"\",iniTurma!H31=\"\"),\"\",IF(iniTurma!D31=\"Menino\",VLOOKUP(iniTurma!H31,References!A$103:J$208,F31,0),VLOOKUP(iniTurma!H31,References!A$303:J$413,F31,0)))","v":""},{"$f":"IF(OR(F31=\"\",iniTurma!I31=\"\"),\"\",VLOOKUP(iniTurma!I31,References!A$503:J$575,F31,0))","v":""},{"$f":"IF(OR(F31=\"\",iniTurma!J31=\"\"),\"\",IF(iniTurma!D31=\"Menino\",VLOOKUP(iniTurma!J31,References!A$603:J$681,F31,0),VLOOKUP(iniTurma!J31,References!A$803:J$881,F31,0)))","v":""},"",{"$f":"IF(K31=\"\",\"\",VLOOKUP(K31,References!A$903:B$1362,2,))","v":""},"",{"$f":"IF(L31=\"\",\"\",VLOOKUP(L31,References!A$1403:B$1903,2,0))","v":""},"",""]
[{"$f":"IF(iniTurma!B32<>\"\",iniTurma!B32,\"\")","v":""},{"$f":"iniTurma!A32","v":29},{"$f":"IF(iniTurma!C32=0,\"\",iniTurma!C32)","v":""},{"$f":"IF(OR(iniTurma!E32=\"\",iniTurma!F32=\"\"),\"\",(iniTurma!F32-iniTurma!E32)/365.25)","v":""},{"$f":"IF(OR(iniTurma!E32=\"\",iniTurma!F32=\"\"),\"\",iniTurma!F32-iniTurma!E32)","v":""},"",{"$f":"IF(OR(F32=\"\",iniTurma!G32=\"\"),\"\",VLOOKUP(iniTurma!G32,References!A$3:J$78,F32,0))","v":""},{"$f":"IF(OR(F32=\"\",iniTurma!H32=\"\"),\"\",IF(iniTurma!D32=\"Menino\",VLOOKUP(iniTurma!H32,References!A$103:J$208,F32,0),VLOOKUP(iniTurma!H32,References!A$303:J$413,F32,0)))","v":""},{"$f":"IF(OR(F32=\"\",iniTurma!I32=\"\"),\"\",VLOOKUP(iniTurma!I32,References!A$503:J$575,F32,0))","v":""},{"$f":"IF(OR(F32=\"\",iniTurma!J32=\"\"),\"\",IF(iniTurma!D32=\"Menino\",VLOOKUP(iniTurma!J32,References!A$603:J$681,F32,0),VLOOKUP(iniTurma!J32,References!A$803:J$881,F32,0)))","v":""},"",{"$f":"IF(K32=\"\",\"\",VLOOKUP(K32,References!A$903:B$1362,2,))","v":""},"",{"$f":"IF(L32=\"\",\"\",VLOOKUP(L32,References!A$1403:B$1903,2,0))","v":""},"",""]
[{"$f":"IF(iniTurma!B33<>\"\",iniTurma!B33,\"\")","v":""},{"$f":"iniTurma!A33","v":30},{"$f":"IF(iniTurma!C33=0,\"\",iniTurma!C33)","v":""},{"$f":"IF(OR(iniTurma!E33=\"\",iniTurma!F33=\"\"),\"\",(iniTurma!F33-iniTurma!E33)/365.25)","v":""},{"$f":"IF(OR(iniTurma!E33=\"\",iniTurma!F33=\"\"),\"\",iniTurma!F33-iniTurma!E33)","v":""},"",{"$f":"IF(OR(F33=\"\",iniTurma!G33=\"\"),\"\",VLOOKUP(iniTurma!G33,References!A$3:J$78,F33,0))","v":""},{"$f":"IF(OR(F33=\"\",iniTurma!H33=\"\"),\"\",IF(iniTurma!D33=\"Menino\",VLOOKUP(iniTurma!H33,References!A$103:J$208,F33,0),VLOOKUP(iniTurma!H33,References!A$303:J$413,F33,0)))","v":""},{"$f":"IF(OR(F33=\"\",iniTurma!I33=\"\"),\"\",VLOOKUP(iniTurma!I33,References!A$503:J$575,F33,0))","v":""},{"$f":"IF(OR(F33=\"\",iniTurma!J33=\"\"),\"\",IF(iniTurma!D33=\"Menino\",VLOOKUP(iniTurma!J33,References!A$603:J$681,F33,0),VLOOKUP(iniTurma!J33,References!A$803:J$881,F33,0)))","v":""},"",{"$f":"IF(K33=\"\",\"\",VLOOKUP(K33,References!A$903:B$1362,2,))","v":""},"",{"$f":"IF(L33=\"\",\"\",VLOOKUP(L33,References!A$1403:B$1903,2,0))","v":""},"",""]
[{"$f":"IF(iniTurma!B34<>\"\",iniTurma!B34,\"\")","v":""},{"$f":"iniTurma!A34","v":31},{"$f":"IF(iniTurma!C34=0,\"\",iniTurma!C34)","v":""},{"$f":"IF(OR(iniTurma!E34=\"\",iniTurma!F34=\"\"),\"\",(iniTurma!F34-iniTurma!E34)/365.25)","v":""},{"$f":"IF(OR(iniTurma!E34=\"\",iniTurma!F34=\"\"),\"\",iniTurma!F34-iniTurma!E34)","v":""},"",{"$f":"IF(OR(F34=\"\",iniTurma!G34=\"\"),\"\",VLOOKUP(iniTurma!G34,References!A$3:J$78,F34,0))","v":""},{"$f":"IF(OR(F34=\"\",iniTurma!H34=\"\"),\"\",IF(iniTurma!D34=\"Menino\",VLOOKUP(iniTurma!H34,References!A$103:J$208,F34,0),VLOOKUP(iniTurma!H34,References!A$303:J$413,F34,0)))","v":""},{"$f":"IF(OR(F34=\"\",iniTurma!I34=\"\"),\"\",VLOOKUP(iniTurma!I34,References!A$503:J$575,F34,0))","v":""},{"$f":"IF(OR(F34=\"\",iniTurma!J34=\"\"),\"\",IF(iniTurma!D34=\"Menino\",VLOOKUP(iniTurma!J34,References!A$603:J$681,F34,0),VLOOKUP(iniTurma!J34,References!A$803:J$881,F34,0)))","v":""},"",{"$f":"IF(K34=\"\",\"\",VLOOKUP(K34,References!A$903:B$1362,2,))","v":""},"",{"$f":"IF(L34=\"\",\"\",VLOOKUP(L34,References!A$1403:B$1903,2,0))","v":""},"",""]
[{"$f":"IF(iniTurma!B35<>\"\",iniTurma!B35,\"\")","v":""},{"$f":"iniTurma!A35","v":32},{"$f":"IF(iniTurma!C35=0,\"\",iniTurma!C35)","v":""},{"$f":"IF(OR(iniTurma!E35=\"\",iniTurma!F35=\"\"),\"\",(iniTurma!F35-iniTurma!E35)/365.25)","v":""},{"$f":"IF(OR(iniTurma!E35=\"\",iniTurma!F35=\"\"),\"\",iniTurma!F35-iniTurma!E35)","v":""},"",{"$f":"IF(OR(F35=\"\",iniTurma!G35=\"\"),\"\",VLOOKUP(iniTurma!G35,References!A$3:J$78,F35,0))","v":""},{"$f":"IF(OR(F35=\"\",iniTurma!H35=\"\"),\"\",IF(iniTurma!D35=\"Menino\",VLOOKUP(iniTurma!H35,References!A$103:J$208,F35,0),VLOOKUP(iniTurma!H35,References!A$303:J$413,F35,0)))","v":""},{"$f":"IF(OR(F35=\"\",iniTurma!I35=\"\"),\"\",VLOOKUP(iniTurma!I35,References!A$503:J$575,F35,0))","v":""},{"$f":"IF(OR(F35=\"\",iniTurma!J35=\"\"),\"\",IF(iniTurma!D35=\"Menino\",VLOOKUP(iniTurma!J35,References!A$603:J$681,F35,0),VLOOKUP(iniTurma!J35,References!A$803:J$881,F35,0)))","v":""},"",{"$f":"IF(K35=\"\",\"\",VLOOKUP(K35,References!A$903:B$1362,2,))","v":""},"",{"$f":"IF(L35=\"\",\"\",VLOOKUP(L35,References!A$1403:B$1903,2,0))","v":""},"",""]
[{"$f":"IF(iniTurma!B36<>\"\",iniTurma!B36,\"\")","v":""},{"$f":"iniTurma!A36","v":33},{"$f":"IF(iniTurma!C36=0,\"\",iniTurma!C36)","v":""},{"$f":"IF(OR(iniTurma!E36=\"\",iniTurma!F36=\"\"),\"\",(iniTurma!F36-iniTurma!E36)/365.25)","v":""},{"$f":"IF(OR(iniTurma!E36=\"\",iniTurma!F36=\"\"),\"\",iniTurma!F36-iniTurma!E36)","v":""},"",{"$f":"IF(OR(F36=\"\",iniTurma!G36=\"\"),\"\",VLOOKUP(iniTurma!G36,References!A$3:J$78,F36,0))","v":""},{"$f":"IF(OR(F36=\"\",iniTurma!H36=\"\"),\"\",IF(iniTurma!D36=\"Menino\",VLOOKUP(iniTurma!H36,References!A$103:J$208,F36,0),VLOOKUP(iniTurma!H36,References!A$303:J$413,F36,0)))","v":""},{"$f":"IF(OR(F36=\"\",iniTurma!I36=\"\"),\"\",VLOOKUP(iniTurma!I36,References!A$503:J$575,F36,0))","v":""},{"$f":"IF(OR(F36=\"\",iniTurma!J36=\"\"),\"\",IF(iniTurma!D36=\"Menino\",VLOOKUP(iniTurma!J36,References!A$603:J$681,F36,0),VLOOKUP(iniTurma!J36,References!A$803:J$881,F36,0)))","v":""},"",{"$f":"IF(K36=\"\",\"\",VLOOKUP(K36,References!A$903:B$1362,2,))","v":""},"",{"$f":"IF(L36=\"\",\"\",VLOOKUP(L36,References!A$1403:B$1903,2,0))","v":""},"",""]
[{"$f":"IF(iniTurma!B37<>\"\",iniTurma!B37,\"\")","v":""},{"$f":"iniTurma!A37","v":34},{"$f":"IF(iniTurma!C37=0,\"\",iniTurma!C37)","v":""},{"$f":"IF(OR(iniTurma!E37=\"\",iniTurma!F37=\"\"),\"\",(iniTurma!F37-iniTurma!E37)/365.25)","v":""},{"$f":"IF(OR(iniTurma!E37=\"\",iniTurma!F37=\"\"),\"\",iniTurma!F37-iniTurma!E37)","v":""},"",{"$f":"IF(OR(F37=\"\",iniTurma!G37=\"\"),\"\",VLOOKUP(iniTurma!G37,References!A$3:J$78,F37,0))","v":""},{"$f":"IF(OR(F37=\"\",iniTurma!H37=\"\"),\"\",IF(iniTurma!D37=\"Menino\",VLOOKUP(iniTurma!H37,References!A$103:J$208,F37,0),VLOOKUP(iniTurma!H37,References!A$303:J$413,F37,0)))","v":""},{"$f":"IF(OR(F37=\"\",iniTurma!I37=\"\"),\"\",VLOOKUP(iniTurma!I37,References!A$503:J$575,F37,0))","v":""},{"$f":"IF(OR(F37=\"\",iniTurma!J37=\"\"),\"\",IF(iniTurma!D37=\"Menino\",VLOOKUP(iniTurma!J37,References!A$603:J$681,F37,0),VLOOKUP(iniTurma!J37,References!A$803:J$881,F37,0)))","v":""},"",{"$f":"IF(K37=\"\",\"\",VLOOKUP(K37,References!A$903:B$1362,2,))","v":""},"",{"$f":"IF(L37=\"\",\"\",VLOOKUP(L37,References!A$1403:B$1903,2,0))","v":""},"",""]
[{"$f":"IF(iniTurma!B38<>\"\",iniTurma!B38,\"\")","v":""},{"$f":"iniTurma!A38","v":35},{"$f":"IF(iniTurma!C38=0,\"\",iniTurma!C38)","v":""},{"$f":"IF(OR(iniTurma!E38=\"\",iniTurma!F38=\"\"),\"\",(iniTurma!F38-iniTurma!E38)/365.25)","v":""},{"$f":"IF(OR(iniTurma!E38=\"\",iniTurma!F38=\"\"),\"\",iniTurma!F38-iniTurma!E38)","v":""},"",{"$f":"IF(OR(F38=\"\",iniTurma!G38=\"\"),\"\",VLOOKUP(iniTurma!G38,References!A$3:J$78,F38,0))","v":""},{"$f":"IF(OR(F38=\"\",iniTurma!H38=\"\"),\"\",IF(iniTurma!D38=\"Menino\",VLOOKUP(iniTurma!H38,References!A$103:J$208,F38,0),VLOOKUP(iniTurma!H38,References!A$303:J$413,F38,0)))","v":""},{"$f":"IF(OR(F38=\"\",iniTurma!I38=\"\"),\"\",VLOOKUP(iniTurma!I38,References!A$503:J$575,F38,0))","v":""},{"$f":"IF(OR(F38=\"\",iniTurma!J38=\"\"),\"\",IF(iniTurma!D38=\"Menino\",VLOOKUP(iniTurma!J38,References!A$603:J$681,F38,0),VLOOKUP(iniTurma!J38,References!A$803:J$881,F38,0)))","v":""},"",{"$f":"IF(K38=\"\",\"\",VLOOKUP(K38,References!A$903:B$1362,2,))","v":""},"",{"$f":"IF(L38=\"\",\"\",VLOOKUP(L38,References!A$1403:B$1903,2,0))","v":""},"",""]
[{"$f":"IF(iniTurma!B39<>\"\",iniTurma!B39,\"\")","v":""},{"$f":"iniTurma!A39","v":36},{"$f":"IF(iniTurma!C39=0,\"\",iniTurma!C39)","v":""},{"$f":"IF(OR(iniTurma!E39=\"\",iniTurma!F39=\"\"),\"\",(iniTurma!F39-iniTurma!E39)/365.25)","v":""},{"$f":"IF(OR(iniTurma!E39=\"\",iniTurma!F39=\"\"),\"\",iniTurma!F39-iniTurma!E39)","v":""},"",{"$f":"IF(OR(F39=\"\",iniTurma!G39=\"\"),\"\",VLOOKUP(iniTurma!G39,References!A$3:J$78,F39,0))","v":""},{"$f":"IF(OR(F39=\"\",iniTurma!H39=\"\"),\"\",IF(iniTurma!D39=\"Menino\",VLOOKUP(iniTurma!H39,References!A$103:J$208,F39,0),VLOOKUP(iniTurma!H39,References!A$303:J$413,F39,0)))","v":""},{"$f":"IF(OR(F39=\"\",iniTurma!I39=\"\"),\"\",VLOOKUP(iniTurma!I39,References!A$503:J$575,F39,0))","v":""},{"$f":"IF(OR(F39=\"\",iniTurma!J39=\"\"),\"\",IF(iniTurma!D39=\"Menino\",VLOOKUP(iniTurma!J39,References!A$603:J$681,F39,0),VLOOKUP(iniTurma!J39,References!A$803:J$881,F39,0)))","v":""},"",{"$f":"IF(K39=\"\",\"\",VLOOKUP(K39,References!A$903:B$1362,2,))","v":""},"",{"$f":"IF(L39=\"\",\"\",VLOOKUP(L39,References!A$1403:B$1903,2,0))","v":""},"",""]
[{"$f":"IF(iniTurma!B40<>\"\",iniTurma!B40,\"\")","v":""},{"$f":"iniTurma!A40","v":37},{"$f":"IF(iniTurma!C40=0,\"\",iniTurma!C40)","v":""},{"$f":"IF(OR(iniTurma!E40=\"\",iniTurma!F40=\"\"),\"\",(iniTurma!F40-iniTurma!E40)/365.25)","v":""},{"$f":"IF(OR(iniTurma!E40=\"\",iniTurma!F40=\"\"),\"\",iniTurma!F40-iniTurma!E40)","v":""},"",{"$f":"IF(OR(F40=\"\",iniTurma!G40=\"\"),\"\",VLOOKUP(iniTurma!G40,References!A$3:J$78,F40,0))","v":""},{"$f":"IF(OR(F40=\"\",iniTurma!H40=\"\"),\"\",IF(iniTurma!D40=\"Menino\",VLOOKUP(iniTurma!H40,References!A$103:J$208,F40,0),VLOOKUP(iniTurma!H40,References!A$303:J$413,F40,0)))","v":""},{"$f":"IF(OR(F40=\"\",iniTurma!I40=\"\"),\"\",VLOOKUP(iniTurma!I40,References!A$503:J$575,F40,0))","v":""},{"$f":"IF(OR(F40=\"\",iniTurma!J40=\"\"),\"\",IF(iniTurma!D40=\"Menino\",VLOOKUP(iniTurma!J40,References!A$603:J$681,F40,0),VLOOKUP(iniTurma!J40,References!A$803:J$881,F40,0)))","v":""},"",{"$f":"IF(K40=\"\",\"\",VLOOKUP(K40,References!A$903:B$1362,2,))","v":""},"",{"$f":"IF(L40=\"\",\"\",VLOOKUP(L40,References!A$1403:B$1903,2,0))","v":""},"",""]
[{"$f":"IF(iniTurma!B41<>\"\",iniTurma!B41,\"\")","v":""},{"$f":"iniTurma!A41","v":38},{"$f":"IF(iniTurma!C41=0,\"\",iniTurma!C41)","v":""},{"$f":"IF(OR(iniTurma!E41=\"\",iniTurma!F41=\"\"),\"\",(iniTurma!F41-iniTurma!E41)/365.25)","v":""},{"$f":"IF(OR(iniTurma!E41=\"\",iniTurma!F41=\"\"),\"\",iniTurma!F41-iniTurma!E41)","v":""},"",{"$f":"IF(OR(F41=\"\",iniTurma!G41=\"\"),\"\",VLOOKUP(iniTurma!G41,References!A$3:J$78,F41,0))","v":""},{"$f":"IF(OR(F41=\"\",iniTurma!H41=\"\"),\"\",IF(iniTurma!D41=\"Menino\",VLOOKUP(iniTurma!H41,References!A$103:J$208,F41,0),VLOOKUP(iniTurma!H41,References!A$303:J$413,F41,0)))","v":""},{"$f":"IF(OR(F41=\"\",iniTurma!I41=\"\"),\"\",VLOOKUP(iniTurma!I41,References!A$503:J$575,F41,0))","v":""},{"$f":"IF(OR(F41=\"\",iniTurma!J41=\"\"),\"\",IF(iniTurma!D41=\"Menino\",VLOOKUP(iniTurma!J41,References!A$603:J$681,F41,0),VLOOKUP(iniTurma!J41,References!A$803:J$881,F41,0)))","v":""},"",{"$f":"IF(K41=\"\",\"\",VLOOKUP(K41,References!A$903:B$1362,2,))","v":""},"",{"$f":"IF(L41=\"\",\"\",VLOOKUP(L41,References!A$1403:B$1903,2,0))","v":""},"",""]
[{"$f":"IF(iniTurma!B42<>\"\",iniTurma!B42,\"\")","v":""},{"$f":"iniTurma!A42","v":39},{"$f":"IF(iniTurma!C42=0,\"\",iniTurma!C42)","v":""},{"$f":"IF(OR(iniTurma!E42=\"\",iniTurma!F42=\"\"),\"\",(iniTurma!F42-iniTurma!E42)/365.25)","v":""},{"$f":"IF(OR(iniTurma!E42=\"\",iniTurma!F42=\"\"),\"\",iniTurma!F42-iniTurma!E42)","v":""},"",{"$f":"IF(OR(F42=\"\",iniTurma!G42=\"\"),\"\",VLOOKUP(iniTurma!G42,References!A$3:J$78,F42,0))","v":""},{"$f":"IF(OR(F42=\"\",iniTurma!H42=\"\"),\"\",IF(iniTurma!D42=\"Menino\",VLOOKUP(iniTurma!H42,References!A$103:J$208,F42,0),VLOOKUP(iniTurma!H42,References!A$303:J$413,F42,0)))","v":""},{"$f":"IF(OR(F42=\"\",iniTurma!I42=\"\"),\"\",VLOOKUP(iniTurma!I42,References!A$503:J$575,F42,0))","v":""},{"$f":"IF(OR(F42=\"\",iniTurma!J42=\"\"),\"\",IF(iniTurma!D42=\"Menino\",VLOOKUP(iniTurma!J42,References!A$603:J$681,F42,0),VLOOKUP(iniTurma!J42,References!A$803:J$881,F42,0)))","v":""},"",{"$f":"IF(K42=\"\",\"\",VLOOKUP(K42,References!A$903:B$1362,2,))","v":""},"",{"$f":"IF(L42=\"\",\"\",VLOOKUP(L42,References!A$1403:B$1903,2,0))","v":""},"",""]
[{"$f":"IF(iniTurma!B43<>\"\",iniTurma!B43,\"\")","v":""},{"$f":"iniTurma!A43","v":40},{"$f":"IF(iniTurma!C43=0,\"\",iniTurma!C43)","v":""},{"$f":"IF(OR(iniTurma!E43=\"\",iniTurma!F43=\"\"),\"\",(iniTurma!F43-iniTurma!E43)/365.25)","v":""},{"$f":"IF(OR(iniTurma!E43=\"\",iniTurma!F43=\"\"),\"\",iniTurma!F43-iniTurma!E43)","v":""},"",{"$f":"IF(OR(F43=\"\",iniTurma!G43=\"\"),\"\",VLOOKUP(iniTurma!G43,References!A$3:J$78,F43,0))","v":""},{"$f":"IF(OR(F43=\"\",iniTurma!H43=\"\"),\"\",IF(iniTurma!D43=\"Menino\",VLOOKUP(iniTurma!H43,References!A$103:J$208,F43,0),VLOOKUP(iniTurma!H43,References!A$303:J$413,F43,0)))","v":""},{"$f":"IF(OR(F43=\"\",iniTurma!I43=\"\"),\"\",VLOOKUP(iniTurma!I43,References!A$503:J$575,F43,0))","v":""},{"$f":"IF(OR(F43=\"\",iniTurma!J43=\"\"),\"\",IF(iniTurma!D43=\"Menino\",VLOOKUP(iniTurma!J43,References!A$603:J$681,F43,0),VLOOKUP(iniTurma!J43,References!A$803:J$881,F43,0)))","v":""},"",{"$f":"IF(K43=\"\",\"\",VLOOKUP(K43,References!A$903:B$1362,2,))","v":""},"",{"$f":"IF(L43=\"\",\"\",VLOOKUP(L43,References!A$1403:B$1903,2,0))","v":""},"",""]
[{"$f":"IF(iniTurma!B44<>\"\",iniTurma!B44,\"\")","v":""},{"$f":"iniTurma!A44","v":41},{"$f":"IF(iniTurma!C44=0,\"\",iniTurma!C44)","v":""},{"$f":"IF(OR(iniTurma!E44=\"\",iniTurma!F44=\"\"),\"\",(iniTurma!F44-iniTurma!E44)/365.25)","v":""},{"$f":"IF(OR(iniTurma!E44=\"\",iniTurma!F44=\"\"),\"\",iniTurma!F44-iniTurma!E44)","v":""},"",{"$f":"IF(OR(F44=\"\",iniTurma!G44=\"\"),\"\",VLOOKUP(iniTurma!G44,References!A$3:J$78,F44,0))","v":""},{"$f":"IF(OR(F44=\"\",iniTurma!H44=\"\"),\"\",IF(iniTurma!D44=\"Menino\",VLOOKUP(iniTurma!H44,References!A$103:J$208,F44,0),VLOOKUP(iniTurma!H44,References!A$303:J$413,F44,0)))","v":""},{"$f":"IF(OR(F44=\"\",iniTurma!I44=\"\"),\"\",VLOOKUP(iniTurma!I44,References!A$503:J$575,F44,0))","v":""},{"$f":"IF(OR(F44=\"\",iniTurma!J44=\"\"),\"\",IF(iniTurma!D44=\"Menino\",VLOOKUP(iniTurma!J44,References!A$603:J$681,F44,0),VLOOKUP(iniTurma!J44,References!A$803:J$881,F44,0)))","v":""},"",{"$f":"IF(K44=\"\",\"\",VLOOKUP(K44,References!A$903:B$1362,2,))","v":""},"",{"$f":"IF(L44=\"\",\"\",VLOOKUP(L44,References!A$1403:B$1903,2,0))","v":""},"",""]
[{"$f":"IF(iniTurma!B45<>\"\",iniTurma!B45,\"\")","v":""},{"$f":"iniTurma!A45","v":42},{"$f":"IF(iniTurma!C45=0,\"\",iniTurma!C45)","v":""},{"$f":"IF(OR(iniTurma!E45=\"\",iniTurma!F45=\"\"),\"\",(iniTurma!F45-iniTurma!E45)/365.25)","v":""},{"$f":"IF(OR(iniTurma!E45=\"\",iniTurma!F45=\"\"),\"\",iniTurma!F45-iniTurma!E45)","v":""},"",{"$f":"IF(OR(F45=\"\",iniTurma!G45=\"\"),\"\",VLOOKUP(iniTurma!G45,References!A$3:J$78,F45,0))","v":""},{"$f":"IF(OR(F45=\"\",iniTurma!H45=\"\"),\"\",IF(iniTurma!D45=\"Menino\",VLOOKUP(iniTurma!H45,References!A$103:J$208,F45,0),VLOOKUP(iniTurma!H45,References!A$303:J$413,F45,0)))","v":""},{"$f":"IF(OR(F45=\"\",iniTurma!I45=\"\"),\"\",VLOOKUP(iniTurma!I45,References!A$503:J$575,F45,0))","v":""},{"$f":"IF(OR(F45=\"\",iniTurma!J45=\"\"),\"\",IF(iniTurma!D45=\"Menino\",VLOOKUP(iniTurma!J45,References!A$603:J$681,F45,0),VLOOKUP(iniTurma!J45,References!A$803:J$881,F45,0)))","v":""},"",{"$f":"IF(K45=\"\",\"\",VLOOKUP(K45,References!A$903:B$1362,2,))","v":""},"",{"$f":"IF(L45=\"\",\"\",VLOOKUP(L45,References!A$1403:B$1903,2,0))","v":""},"",""]
[{"$f":"IF(iniTurma!B46<>\"\",iniTurma!B46,\"\")","v":""},{"$f":"iniTurma!A46","v":43},{"$f":"IF(iniTurma!C46=0,\"\",iniTurma!C46)","v":""},{"$f":"IF(OR(iniTurma!E46=\"\",iniTurma!F46=\"\"),\"\",(iniTurma!F46-iniTurma!E46)/365.25)","v":""},{"$f":"IF(OR(iniTurma!E46=\"\",iniTurma!F46=\"\"),\"\",iniTurma!F46-iniTurma!E46)","v":""},"",{"$f":"IF(OR(F46=\"\",iniTurma!G46=\"\"),\"\",VLOOKUP(iniTurma!G46,References!A$3:J$78,F46,0))","v":""},{"$f":"IF(OR(F46=\"\",iniTurma!H46=\"\"),\"\",IF(iniTurma!D46=\"Menino\",VLOOKUP(iniTurma!H46,References!A$103:J$208,F46,0),VLOOKUP(iniTurma!H46,References!A$303:J$413,F46,0)))","v":""},{"$f":"IF(OR(F46=\"\",iniTurma!I46=\"\"),\"\",VLOOKUP(iniTurma!I46,References!A$503:J$575,F46,0))","v":""},{"$f":"IF(OR(F46=\"\",iniTurma!J46=\"\"),\"\",IF(iniTurma!D46=\"Menino\",VLOOKUP(iniTurma!J46,References!A$603:J$681,F46,0),VLOOKUP(iniTurma!J46,References!A$803:J$881,F46,0)))","v":""},"",{"$f":"IF(K46=\"\",\"\",VLOOKUP(K46,References!A$903:B$1362,2,))","v":""},"",{"$f":"IF(L46=\"\",\"\",VLOOKUP(L46,References!A$1403:B$1903,2,0))","v":""},"",""]
[{"$f":"IF(iniTurma!B47<>\"\",iniTurma!B47,\"\")","v":""},{"$f":"iniTurma!A47","v":44},{"$f":"IF(iniTurma!C47=0,\"\",iniTurma!C47)","v":""},{"$f":"IF(OR(iniTurma!E47=\"\",iniTurma!F47=\"\"),\"\",(iniTurma!F47-iniTurma!E47)/365.25)","v":""},{"$f":"IF(OR(iniTurma!E47=\"\",iniTurma!F47=\"\"),\"\",iniTurma!F47-iniTurma!E47)","v":""},"",{"$f":"IF(OR(F47=\"\",iniTurma!G47=\"\"),\"\",VLOOKUP(iniTurma!G47,References!A$3:J$78,F47,0))","v":""},{"$f":"IF(OR(F47=\"\",iniTurma!H47=\"\"),\"\",IF(iniTurma!D47=\"Menino\",VLOOKUP(iniTurma!H47,References!A$103:J$208,F47,0),VLOOKUP(iniTurma!H47,References!A$303:J$413,F47,0)))","v":""},{"$f":"IF(OR(F47=\"\",iniTurma!I47=\"\"),\"\",VLOOKUP(iniTurma!I47,References!A$503:J$575,F47,0))","v":""},{"$f":"IF(OR(F47=\"\",iniTurma!J47=\"\"),\"\",IF(iniTurma!D47=\"Menino\",VLOOKUP(iniTurma!J47,References!A$603:J$681,F47,0),VLOOKUP(iniTurma!J47,References!A$803:J$881,F47,0)))","v":""},"",{"$f":"IF(K47=\"\",\"\",VLOOKUP(K47,References!A$903:B$1362,2,))","v":""},"",{"$f":"IF(L47=\"\",\"\",VLOOKUP(L47,References!A$1403:B$1903,2,0))","v":""},"",""]
[{"$f":"IF(iniTurma!B48<>\"\",iniTurma!B48,\"\")","v":""},{"$f":"iniTurma!A48","v":45},{"$f":"IF(iniTurma!C48=0,\"\",iniTurma!C48)","v":""},{"$f":"IF(OR(iniTurma!E48=\"\",iniTurma!F48=\"\"),\"\",(iniTurma!F48-iniTurma!E48)/365.25)","v":""},{"$f":"IF(OR(iniTurma!E48=\"\",iniTurma!F48=\"\"),\"\",iniTurma!F48-iniTurma!E48)","v":""},"",{"$f":"IF(OR(F48=\"\",iniTurma!G48=\"\"),\"\",VLOOKUP(iniTurma!G48,References!A$3:J$78,F48,0))","v":""},{"$f":"IF(OR(F48=\"\",iniTurma!H48=\"\"),\"\",IF(iniTurma!D48=\"Menino\",VLOOKUP(iniTurma!H48,References!A$103:J$208,F48,0),VLOOKUP(iniTurma!H48,References!A$303:J$413,F48,0)))","v":""},{"$f":"IF(OR(F48=\"\",iniTurma!I48=\"\"),\"\",VLOOKUP(iniTurma!I48,References!A$503:J$575,F48,0))","v":""},{"$f":"IF(OR(F48=\"\",iniTurma!J48=\"\"),\"\",IF(iniTurma!D48=\"Menino\",VLOOKUP(iniTurma!J48,References!A$603:J$681,F48,0),VLOOKUP(iniTurma!J48,References!A$803:J$881,F48,0)))","v":""},"",{"$f":"IF(K48=\"\",\"\",VLOOKUP(K48,References!A$903:B$1362,2,))","v":""},"",{"$f":"IF(L48=\"\",\"\",VLOOKUP(L48,References!A$1403:B$1903,2,0))","v":""},"",""]
[{"$f":"IF(iniTurma!B49<>\"\",iniTurma!B49,\"\")","v":""},{"$f":"iniTurma!A49","v":46},{"$f":"IF(iniTurma!C49=0,\"\",iniTurma!C49)","v":""},{"$f":"IF(OR(iniTurma!E49=\"\",iniTurma!F49=\"\"),\"\",(iniTurma!F49-iniTurma!E49)/365.25)","v":""},{"$f":"IF(OR(iniTurma!E49=\"\",iniTurma!F49=\"\"),\"\",iniTurma!F49-iniTurma!E49)","v":""},"",{"$f":"IF(OR(F49=\"\",iniTurma!G49=\"\"),\"\",VLOOKUP(iniTurma!G49,References!A$3:J$78,F49,0))","v":""},{"$f":"IF(OR(F49=\"\",iniTurma!H49=\"\"),\"\",IF(iniTurma!D49=\"Menino\",VLOOKUP(iniTurma!H49,References!A$103:J$208,F49,0),VLOOKUP(iniTurma!H49,References!A$303:J$413,F49,0)))","v":""},{"$f":"IF(OR(F49=\"\",iniTurma!I49=\"\"),\"\",VLOOKUP(iniTurma!I49,References!A$503:J$575,F49,0))","v":""},{"$f":"IF(OR(F49=\"\",iniTurma!J49=\"\"),\"\",IF(iniTurma!D49=\"Menino\",VLOOKUP(iniTurma!J49,References!A$603:J$681,F49,0),VLOOKUP(iniTurma!J49,References!A$803:J$881,F49,0)))","v":""},"",{"$f":"IF(K49=\"\",\"\",VLOOKUP(K49,References!A$903:B$1362,2,))","v":""},"",{"$f":"IF(L49=\"\",\"\",VLOOKUP(L49,References!A$1403:B$1903,2,0))","v":""},"",""]
[{"$f":"IF(iniTurma!B50<>\"\",iniTurma!B50,\"\")","v":""},{"$f":"iniTurma!A50","v":47},{"$f":"IF(iniTurma!C50=0,\"\",iniTurma!C50)","v":""},{"$f":"IF(OR(iniTurma!E50=\"\",iniTurma!F50=\"\"),\"\",(iniTurma!F50-iniTurma!E50)/365.25)","v":""},{"$f":"IF(OR(iniTurma!E50=\"\",iniTurma!F50=\"\"),\"\",iniTurma!F50-iniTurma!E50)","v":""},"",{"$f":"IF(OR(F50=\"\",iniTurma!G50=\"\"),\"\",VLOOKUP(iniTurma!G50,References!A$3:J$78,F50,0))","v":""},{"$f":"IF(OR(F50=\"\",iniTurma!H50=\"\"),\"\",IF(iniTurma!D50=\"Menino\",VLOOKUP(iniTurma!H50,References!A$103:J$208,F50,0),VLOOKUP(iniTurma!H50,References!A$303:J$413,F50,0)))","v":""},{"$f":"IF(OR(F50=\"\",iniTurma!I50=\"\"),\"\",VLOOKUP(iniTurma!I50,References!A$503:J$575,F50,0))","v":""},{"$f":"IF(OR(F50=\"\",iniTurma!J50=\"\"),\"\",IF(iniTurma!D50=\"Menino\",VLOOKUP(iniTurma!J50,References!A$603:J$681,F50,0),VLOOKUP(iniTurma!J50,References!A$803:J$881,F50,0)))","v":""},"",{"$f":"IF(K50=\"\",\"\",VLOOKUP(K50,References!A$903:B$1362,2,))","v":""},"",{"$f":"IF(L50=\"\",\"\",VLOOKUP(L50,References!A$1403:B$1903,2,0))","v":""},"",""]
[{"$f":"IF(iniTurma!B51<>\"\",iniTurma!B51,\"\")","v":""},{"$f":"iniTurma!A51","v":48},{"$f":"IF(iniTurma!C51=0,\"\",iniTurma!C51)","v":""},{"$f":"IF(OR(iniTurma!E51=\"\",iniTurma!F51=\"\"),\"\",(iniTurma!F51-iniTurma!E51)/365.25)","v":""},{"$f":"IF(OR(iniTurma!E51=\"\",iniTurma!F51=\"\"),\"\",iniTurma!F51-iniTurma!E51)","v":""},"",{"$f":"IF(OR(F51=\"\",iniTurma!G51=\"\"),\"\",VLOOKUP(iniTurma!G51,References!A$3:J$78,F51,0))","v":""},{"$f":"IF(OR(F51=\"\",iniTurma!H51=\"\"),\"\",IF(iniTurma!D51=\"Menino\",VLOOKUP(iniTurma!H51,References!A$103:J$208,F51,0),VLOOKUP(iniTurma!H51,References!A$303:J$413,F51,0)))","v":""},{"$f":"IF(OR(F51=\"\",iniTurma!I51=\"\"),\"\",VLOOKUP(iniTurma!I51,References!A$503:J$575,F51,0))","v":""},{"$f":"IF(OR(F51=\"\",iniTurma!J51=\"\"),\"\",IF(iniTurma!D51=\"Menino\",VLOOKUP(iniTurma!J51,References!A$603:J$681,F51,0),VLOOKUP(iniTurma!J51,References!A$803:J$881,F51,0)))","v":""},"",{"$f":"IF(K51=\"\",\"\",VLOOKUP(K51,References!A$903:B$1362,2,))","v":""},"",{"$f":"IF(L51=\"\",\"\",VLOOKUP(L51,References!A$1403:B$1903,2,0))","v":""},"",""]
[{"$f":"IF(iniTurma!B52<>\"\",iniTurma!B52,\"\")","v":""},{"$f":"iniTurma!A52","v":49},{"$f":"IF(iniTurma!C52=0,\"\",iniTurma!C52)","v":""},{"$f":"IF(OR(iniTurma!E52=\"\",iniTurma!F52=\"\"),\"\",(iniTurma!F52-iniTurma!E52)/365.25)","v":""},{"$f":"IF(OR(iniTurma!E52=\"\",iniTurma!F52=\"\"),\"\",iniTurma!F52-iniTurma!E52)","v":""},"",{"$f":"IF(OR(F52=\"\",iniTurma!G52=\"\"),\"\",VLOOKUP(iniTurma!G52,References!A$3:J$78,F52,0))","v":""},{"$f":"IF(OR(F52=\"\",iniTurma!H52=\"\"),\"\",IF(iniTurma!D52=\"Menino\",VLOOKUP(iniTurma!H52,References!A$103:J$208,F52,0),VLOOKUP(iniTurma!H52,References!A$303:J$413,F52,0)))","v":""},{"$f":"IF(OR(F52=\"\",iniTurma!I52=\"\"),\"\",VLOOKUP(iniTurma!I52,References!A$503:J$575,F52,0))","v":""},{"$f":"IF(OR(F52=\"\",iniTurma!J52=\"\"),\"\",IF(iniTurma!D52=\"Menino\",VLOOKUP(iniTurma!J52,References!A$603:J$681,F52,0),VLOOKUP(iniTurma!J52,References!A$803:J$881,F52,0)))","v":""},"",{"$f":"IF(K52=\"\",\"\",VLOOKUP(K52,References!A$903:B$1362,2,))","v":""},"",{"$f":"IF(L52=\"\",\"\",VLOOKUP(L52,References!A$1403:B$1903,2,0))","v":""},"",""]
[{"$f":"IF(iniTurma!B53<>\"\",iniTurma!B53,\"\")","v":""},{"$f":"iniTurma!A53","v":50},{"$f":"IF(iniTurma!C53=0,\"\",iniTurma!C53)","v":""},{"$f":"IF(OR(iniTurma!E53=\"\",iniTurma!F53=\"\"),\"\",(iniTurma!F53-iniTurma!E53)/365.25)","v":""},{"$f":"IF(OR(iniTurma!E53=\"\",iniTurma!F53=\"\"),\"\",iniTurma!F53-iniTurma!E53)","v":""},"",{"$f":"IF(OR(F53=\"\",iniTurma!G53=\"\"),\"\",VLOOKUP(iniTurma!G53,References!A$3:J$78,F53,0))","v":""},{"$f":"IF(OR(F53=\"\",iniTurma!H53=\"\"),\"\",IF(iniTurma!D53=\"Menino\",VLOOKUP(iniTurma!H53,References!A$103:J$208,F53,0),VLOOKUP(iniTurma!H53,References!A$303:J$413,F53,0)))","v":""},{"$f":"IF(OR(F53=\"\",iniTurma!I53=\"\"),\"\",VLOOKUP(iniTurma!I53,References!A$503:J$575,F53,0))","v":""},{"$f":"IF(OR(F53=\"\",iniTurma!J53=\"\"),\"\",IF(iniTurma!D53=\"Menino\",VLOOKUP(iniTurma!J53,References!A$603:J$681,F53,0),VLOOKUP(iniTurma!J53,References!A$803:J$881,F53,0)))","v":""},"",{"$f":"IF(K53=\"\",\"\",VLOOKUP(K53,References!A$903:B$1362,2,))","v":""},"",{"$f":"IF(L53=\"\",\"\",VLOOKUP(L53,References!A$1403:B$1903,2,0))","v":""},"",""]

{"sheet":"References","index":3,"n_rows":2007,"n_cols":10,"rows_kept":2007,"cut":false,"hidden":true,"merged":[[800,1,800,9],[0,1,0,9],[100,1,100,9],[300,1,300,9],[500,1,500,9],[600,1,600,9]]}
[null,"Meninas ou Meninos"]
["TL_Ponto","< 6 anos","6 anos","7 anos","8 anos","9 anos","10 anos","11 anos","12 anos","> 12 anos"]
[1,50,44,39,35,31,27,23,20,16]
[2,51,45,40,36,32,28,24,21,18]
[3,52,46,41,37,33,29,26,22,19]
[4,53,47,42,38,34,31,27,24,20]
[5,54,48,43,39,35,32,28,25,21]
[6,55,49,45,40,36,33,29,26,23]
[7,56,50,46,42,38,34,31,27,24]
[8,58,51,47,43,39,36,32,28,25]
[9,60,52,48,44,40,37,33,29,26]
[10,62,53,49,45,41,38,34,30,27]
[11,65,54,50,46,42,39,35,32,28]
[12,67,55,51,47,43,40,36,33,29]
[13,69,57,53,48,45,41,37,34,30]
[14,70,60,54,49,46,42,38,35,32]
[15,73,62,55,50,47,43,39,36,33]
[16,75,63,57,51,48,44,40,37,34]
[17,78,64,58,52,49,46,41,38,35]
[18,80,65,59,53,50,47,42,39,36]
[19,82,68,60,54,51,48,44,40,37]
[20,84,71,62,56,52,49,45,41,38]
[21,86,73,65,57,54,50,46,42,39]
[22,89,75,67,58,55,52,47,43,40]
[23,91,77,69,60,56,54,48,45,42]
[24,93,80,72,61,58,56,49,46,43]
[25,95,82,74,63,60,58,50,47,44]
[26,97,85,76,66,62,60,53,48,45]
[27,99,87,79,69,64,62,55,49,46]
[28,102,90,81,71,67,64,57,50,48]
[29,104,92,84,74,69,66,59,52,49]
[30,106,94,86,76,71,67,61,53,50]
[31,108,97,88,79,73,69,63,55,52]
[32,110,99,91,81,75,70,66,56,55]
[33,112,102,93,84,77,71,68,57,57]
[34,115,104,96,86,79,72,70,59,59]
[35,117,106,98,89,82,73,72,61,61]
[36,119,109,100,91,84,74,75,64,63]
[37,121,111,103,94,86,76,77,67,65]
[38,123,114,105,96,88,77,79,69,68]
[39,125,116,107,99,90,79,81,71,70]
[40,128,119,110,101,92,82,83,74,72]
[41,129,121,112,104,94,84,86,76,74]
[42,130,123,115,106,96,87,88,79,77]
[43,132,126,117,109,99,89,90,81,79]
[44,133,128,119,111,101,92,92,84,82]
[45,135,131,122,113,103,95,95,86,84]
[46,137,132,124,116,105,97,97,88,87]
[47,139,133,127,118,107,100,99,91,89]
[48,141,135,129,121,109,102,101,93,89]
[49,142,136,131,123,111,105,104,96,93]
[50,144,138,134,126,114,107,106,98,95]
[51,145,139,136,128,116,110,108,101,98]
[52,null,141,138,131,118,112,110,103,101]
[53,null,143,141,133,120,115,112,105,103]
[54,null,145,143,136,122,117,115,108,105]
[55,null,null,144,138,124,120,117,110,108]
[56,null,null,145,140,126,122,119,113,110]
[57,null,null,null,143,129,125,121,115,113]
[58,null,null,null,144,131,127,124,118,115]
[59,null,null,null,145,133,130,126,120,117]
[60,null,null,null,null,135,132,129,122,120]
[61,null,null,null,null,137,135,131,125,122]
[62,null,null,null,null,139,138,133,127,125]
[63,null,null,null,null,141,140,135,130,127]
[64,null,null,null,null,143,143,137,132,129]
[65,null,null,null,null,145,144,138,135,130]
[66,null,null,null,null,null,145,140,137,131]
[67,null,null,null,null,null,null,141,139,132]
[68,null,null,null,null,null,null,143,140,133]
[69,null,null,null,null,null,null,145,141,134]
[70,null,null,null,null,null,null,null,143,136]
[71,null,null,null,null,null,null,null,144,137]
[72,null,null,null,null,null,null,null,145,139]
[73,null,null,null,null,null,null,null,null,140]
[74,null,null,null,null,null,null,null,null,142]
[75,null,null,null,null,null,null,null,null,143]
[76,null,null,null,null,null,null,null,null,145]
[]
[]
[]
[]
[]
[]
[]
[]
[]
[]
[]
[]
[]
[]
[]
[]
[]
[]
[]
[]
[]
[]
[null,"Meninos"]
["SL_Ponto","< 6 anos","6 anos","7 anos","8 anos","9 anos","10 anos","11 anos","12 anos","> 12 anos"]
[0,54,50,47,43,37,29,24,20,16]
[1,55,51,48,44,38,30,25,21,17]
[2,56,52,49,45,39,31,26,22,18]
[3,57,53,50,46,40,32,27,24,19]
[4,58,54,52,47,41,33,29,25,20]
[5,60,55,53,48,42,34,30,26,21]
[6,61,57,55,49,43,35,31,27,23]
[7,62,59,56,50,44,36,32,28,24]
[8,63,60,57,51,45,37,33,30,25]
[9,65,62,59,52,46,38,34,31,26]
[10,66,64,60,53,47,39,35,32,27]
[11,67,66,62,55,48,40,36,33,28]
[12,70,67,63,56,49,41,37,35,29]
[13,72,69,64,57,50,42,38,36,30]
[14,74,70,65,59,52,43,40,37,31]
[15,76,72,67,60,53,44,41,38,32]
[16,78,74,68,61,55,45,42,39,33]
[17,80,76,70,63,57,46,43,40,34]
[18,83,77,72,64,58,47,44,41,35]
[19,85,78,74,65,60,48,46,42,36]
[20,87,80,75,67,62,49,47,43,37]
[21,89,82,77,68,64,50,48,45,38]
[22,92,84,78,70,65,52,49,46,39]
[23,93,86,80,71,67,53,50,47,40]
[24,97,88,81,72,69,54,51,48,42]
[25,99,89,83,73,70,56,52,49,43]
[26,101,90,84,75,72,57,53,50,45]
[27,103,93,86,76,73,58,55,51,45]
[28,106,96,87,77,74,59,56,52,46]
[29,108,97,89,78,76,61,57,53,47]
[30,110,98,90,80,77,63,58,54,48]
[31,112,100,92,81,78,63,59,55,49]
[32,115,101,93,82,79,65,61,56,50]
[33,117,102,95,83,80,66,62,57,51]
[34,120,103,96,85,81,67,63,58,52]
[35,122,104,98,85,82,68,63,59,54]
[36,125,106,99,87,84,70,66,60,55]
[37,127,107,101,89,85,71,67,61,58]
[38,129,108,102,90,86,72,68,62,58]
[39,131,109,104,91,87,74,69,63,59]
[40,134,110,105,92,88,75,71,64,60]
[41,136,112,107,94,89,76,72,65,61]
[42,138,113,108,95,90,77,73,66,63]
[43,139,114,110,95,92,79,75,67,64]
[44,140,115,111,98,93,80,76,68,66]
[45,141,116,113,99,94,81,77,69,67]
[46,142,118,114,100,95,83,78,70,68]
[47,143,115,116,102,96,84,80,72,69]
[48,144,120,117,103,97,85,81,73,70]
[49,145,122,119,104,98,87,82,75,71]
[50,null,123,120,105,100,88,84,76,73]
[51,null,124,122,107,101,89,85,78,74]
[52,null,125,123,108,102,90,86,79,76]
[53,null,126,124,109,103,92,88,80,77]
[54,null,127,125,111,104,93,89,81,79]
[55,null,128,126,112,105,94,90,83,80]
[56,null,130,127,113,106,96,91,84,81]
[57,null,132,128,114,108,97,93,85,83]
[58,null,133,129,116,109,98,94,87,85]
[59,null,135,130,117,110,99,95,88,86]
[60,null,136,131,119,111,101,97,89,88]
[61,null,137,132,120,112,102,98,91,89]
[62,null,139,133,121,113,103,99,92,91]
[63,null,140,135,123,114,105,100,94,92]
[64,null,141,136,124,115,106,102,95,93]
[65,null,143,137,125,117,107,103,96,95]
[66,null,144,139,126,118,109,104,98,96]
[67,null,145,140,127,119,110,106,99,98]
[68,null,null,141,129,120,111,107,100,99]
[69,null,null,142,130,121,113,108,102,101]
[70,null,null,143,131,123,114,109,103,103]
[71,null,null,144,132,124,115,110,104,104]
[72,null,null,145,134,125,116,112,106,105]
[73,null,null,null,135,126,118,113,107,107]
[74,null,null,null,136,127,119,115,109,109]
[75,null,null,null,138,129,120,116,110,109]
[76,null,null,null,139,130,121,117,111,110]
[77,null,null,null,141,131,123,118,113,112]
[78,null,null,null,142,132,124,120,114,113]
[79,null,null,null,143,133,125,121,115,114]
[80,null,null,null,144,134,127,117,116,115]
[81,null,null,null,145,135,128,123,118,117]
[82,null,null,null,null,136,129,125,119,118]
[83,null,null,null,null,137,130,126,121,120]
[84,null,null,null,null,138,132,127,122,121]
[85,null,null,null,null,139,133,129,123,122]
[86,null,null,null,null,140,135,130,125,121]
[87,null,null,null,null,141,136,131,126,125]
[88,null,null,null,null,143,137,132,127,126]
[89,null,null,null,null,144,139,134,128,127]
[90,null,null,null,null,145,140,135,130,128]
[91,null,null,null,null,null,142,136,131,129]
[92,null,null,null,null,null,143,137,133,130]
[93,null,null,null,null,null,145,138,134,131]
[94,null,null,null,null,null,null,140,135,133]
[95,null,null,null,null,null,null,141,137,134]
[96,null,null,null,null,null,null,143,138,135]
[97,null,null,null,null,null,null,144,140,136]
[98,null,null,null,null,null,null,145,141,137]
[99,null,null,null,null,null,null,null,143,138]
[100,null,null,null,null,null,null,null,144,139]
[101,null,null,null,null,null,null,null,145,140]
[102,null,null,null,null,null,null,null,null,141]
[103,null,null,null,null,null,null,null,null,143]
[104,null,null,null,null,null,null,null,null,144]
[105,null,null,null,null,null,null,null,null,145]
[]
[]
[]
[]
[]
[]
[]
[]
[]
[]
[]
[]
[]
[]
[]
[]
[]
[]
[]
[]
[]
[]
[]
[]
[]
[]
[]
[]
[]
[]
[]
[]
[]
[]
[]
[]
[]
[]
[]
[]
[]
[]
[]
[]
[]
[]
[]
[]
[]
[]
[]
[]
[]
[]
[]
[]
[]
[]
[]
[]
[]
[]
[]
[]
[]
[]
[]
[]
[]
[]
[]
[]
[]
[]
[]
[]
[]
[]
[]
[]
[]
[]
[]
[]
[]
[]
[]
[]
[]
[]
[]
[]
[null,"Meninas"]
["SL_Ponto","< 6 anos","6 anos","7 anos","8 anos","9 anos","10 anos","11 anos","12 anos","> 12 anos"]
[0,59,51,42,36,28,21,16,11,6]
[1,60,52,43,37,29,22,17,12,7]
[2,61,53,44,39,30,23,18,13,8]
[3,62,55,45,40,31,24,19,14,9]
[4,64,56,46,42,32,25,20,15,10]
[5,65,57,47,43,33,26,21,16,11]
[6,66,59,48,44,34,27,22,17,12]
[7,68,60,49,45,35,28,23,18,13]
[8,69,61,50,47,36,30,24,20,14]
[9,70,62,51,48,37,31,25,21,15]
[10,71,63,52,49,38,32,36,22,16]
[11,72,64,53,50,39,33,27,23,17]
[12,73,65,55,51,40,34,28,24,18]
[13,74,66,56,53,41,35,30,25,20]
[14,75,67,57,55,42,36,31,26,21]
[15,76,68,59,56,43,37,32,27,22]
[16,78,69,60,57,44,38,33,28,23]
[17,80,70,62,59,45,39,34,29,24]
[18,82,72,63,60,46,40,35,30,25]
[19,83,74,65,61,47,41,36,31,26]
[20,85,75,66,63,48,42,37,32,27]
[21,87,76,67,65,49,43,38,33,28]
[22,89,77,69,67,50,44,39,34,30]
[23,91,78,70,68,51,45,40,35,31]
[24,93,79,72,69,52,46,42,36,32]
[25,95,80,73,70,53,47,43,37,33]
[26,97,81,75,71,54,48,44,38,34]
[27,99,83,76,73,55,49,45,39,35]
[28,101,85,78,74,56,50,46,40,36]
[29,103,86,79,76,57,51,47,41,37]
[30,105,88,81,77,58,53,48,43,38]
[31,106,90,82,78,59,54,49,44,39]
[32,108,91,84,79,60,55,50,45,41]
[33,110,93,85,81,61,56,51,46,42]
[34,112,95,86,82,62,58,53,47,43]
[35,114,96,88,83,63,59,55,48,44]
[36,116,98,89,85,64,60,57,49,45]
[37,118,100,91,86,66,62,60,50,46]
[38,120,101,92,87,67,63,62,51,47]
[39,122,103,92,88,69,65,64,52,48]
[40,124,104,95,90,70,67,66,53,49]
[41,126,106,97,91,71,68,67,54,50]
[42,127,107,98,92,73,69,68,55,51]
[43,129,109,100,94,74,70,69,56,52]
[44,131,111,101,95,76,71,71,57,54]
[45,133,113,103,96,77,72,72,59,55]
[46,135,114,104,97,78,73,73,60,57]
[47,131,116,106,99,80,75,74,61,59]
[48,138,118,107,100,81,76,76,63,60]
[49,139,120,109,101,83,77,77,64,61]
[50,140,121,110,103,84,80,79,65,63]
[51,141,123,112,104,85,81,80,66,64]
[52,142,124,113,105,87,82,81,68,66]
[53,143,126,115,106,88,83,82,70,67]
[54,144,127,116,108,90,84,84,71,69]
[55,145,129,117,109,92,85,85,73,70]
[56,null,131,119,110,93,87,86,74,72]
[57,null,132,120,112,95,88,87,76,73]
[58,null,134,121,113,96,89,89,77,74]
[59,null,135,123,114,97,91,90,79,76]
[60,null,137,125,115,99,92,91,80,77]
[61,null,139,126,116,100,93,92,82,79]
[62,null,140,128,118,102,94,94,83,80]
[63,null,141,129,119,103,95,95,85,81]
[64,null,142,131,121,105,97,96,86,82]
[65,null,143,132,122,106,98,97,88,83]
[66,null,144,133,123,108,99,99,90,84]
[67,null,145,135,124,109,101,100,91,85]
[68,null,null,136,126,110,102,101,93,86]
[69,null,null,138,127,112,103,103,95,87]
[70,null,null,139,128,113,104,104,96,88]
[71,null,null,141,129,115,105,105,98,89]
[72,null,null,142,130,116,107,106,99,91]
[73,null,null,144,131,118,108,108,101,92]
[74,null,null,145,132,119,110,109,103,94]
[75,null,null,null,133,121,111,110,104,95]
[76,null,null,null,134,122,112,111,106,96]
[77,null,null,null,135,125,114,113,107,97]
[78,null,null,null,136,125,115,114,109,98]
[79,null,null,null,137,126,117,115,111,99]
[80,null,null,null,138,127,118,116,112,100]
[81,null,null,null,139,128,119,117,114,101]
[82,null,null,null,140,129,121,118,115,103]
[83,null,null,null,141,130,122,120,117,104]
[84,null,null,null,143,131,124,121,119,105]
[85,null,null,null,144,132,125,122,120,107]
[86,null,null,null,145,133,127,123,122,108]
[87,null,null,null,null,135,128,125,123,109]
[88,null,null,null,null,136,129,127,125,110]
[89,null,null,null,null,137,130,128,126,111]
[90,null,null,null,null,139,132,129,128,112]
[91,null,null,null,null,140,133,130,130,112]
[92,null,null,null,null,141,135,131,131,114]
[93,null,null,null,null,142,136,132,132,115]
[94,null,null,null,null,143,138,133,133,116]
[95,null,null,null,null,144,139,135,134,117]
[96,null,null,null,null,145,140,136,135,118]
[97,null,null,null,null,null,141,138,136,119]
[98,null,null,null,null,null,142,139,137,120]
[99,null,null,null,null,null,143,140,138,122]
[100,null,null,null,null,null,144,141,139,123]
[101,null,null,null,null,null,145,142,140,124]
[102,null,null,null,null,null,null,143,141,125]
[103,null,null,null,null,null,null,145,143,127]
[104,null,null,null,null,null,null,null,144,128]
[105,null,null,null,null,null,null,null,145,130]
[106,null,null,null,null,null,null,null,null,131]
[107,null,null,null,null,null,null,null,null,133]
[108,null,null,null,null,null,null,null,null,134]
[109,null,null,null,null,null,null,null,null,136]
[110,null,null,null,null,null,null,null,null,137]
[]
[]
[]
[]
[]
[]
[]
[]
[]
[]
[]
[]
[]
[]
[]
[]
[]
[]
[]
[]
[]
[]
[]
[]
[]
[]
[]
[]
[]
[]
[]
[]
[]
[]
[]
[]
[]
[]
[]
[]
[]
[]
[]
[]
[]
[]
[]
[]
[]
[]
[]
[]
[]
[]
[]
[]
[]
[]
[]
[]
[]
[]
[]
[]
[]
[]
[]
[]
[]
[]
[]
[]
[]
[]
[]
[]
[]
[]
[]
[]
[]
[]
[]
[]
[]
[]
[]
[null,"Meninas ou Meninos"]
["EQ_Ponto","< 6 anos","6 anos","7 anos","8 anos","9 anos","10 anos","11 anos","12 anos","> 12 anos"]
[0,65,60,54,49,45,41,36,31,27]
[1,66,62,55,50,46,42,37,32,28]
[2,68,63,57,51,47,43,38,33,29]
[3,70,64,58,52,49,44,40,34,30]
[4,72,65,59,53,50,45,41,35,32]
[5,73,66,60,54,51,47,42,36,33]
[6,74,67,61,55,52,48,43,37,34]
[7,75,68,62,56,53,49,44,38,35]
[8,76,69,63,57,54,50,45,39,36]
[9,78,70,64,58,55,51,47,40,37]
[10,79,72,65,59,56,52,48,41,38]
[11,80,73,66,60,57,53,49,43,39]
[12,81,74,68,61,58,54,50,44,40]
[13,82,75,69,62,59,55,51,45,42]
[14,84,76,70,63,60,56,52,46,43]
[15,85,78,71,64,61,58,53,47,44]
[16,86,79,72,65,62,59,54,48,45]
[17,87,80,73,67,63,60,56,49,46]
[18,88,81,74,68,64,62,57,50,47]
[19,89,82,75,69,65,63,58,51,48]
[20,91,83,76,70,66,64,59,52,49]
[21,92,84,78,71,67,65,60,52,50]
[22,93,85,79,72,68,66,61,53,51]
[23,94,87,80,73,69,67,63,54,52]
[24,95,88,81,74,70,68,64,56,53]
[25,97,89,82,75,71,69,65,57,54]
[26,98,90,83,76,72,70,66,59,56]
[27,99,91,84,77,74,72,68,61,58]
[28,100,92,85,79,75,73,69,62,60]
[29,101,93,86,80,76,74,70,63,61]
[30,103,95,88,81,77,76,71,64,63]
[31,104,96,89,82,78,77,72,66,64]
[32,105,97,90,83,79,77,73,67,65]
[33,106,98,91,84,80,78,75,69,67]
[34,107,99,92,85,81,79,76,70,68]
[35,109,100,93,86,82,80,77,72,70]
[36,110,102,94,87,84,81,78,73,71]
[37,111,103,95,88,85,82,79,74,72]
[38,112,104,96,90,86,82,80,75,73]
[39,113,105,97,91,87,84,82,77,75]
[40,115,106,99,92,88,85,83,78,76]
[41,116,107,100,93,89,87,84,79,77]
[42,117,108,101,94,90,88,85,81,78]
[43,118,110,102,95,91,90,86,82,80]
[44,120,111,103,96,92,91,88,84,82]
[45,121,112,104,97,93,92,89,85,83]
[46,122,113,105,98,94,93,90,86,84]
[47,123,114,106,99,95,93,91,88,85]
[48,124,115,107,100,96,94,92,89,87]
[49,125,117,109,102,97,95,93,91,88]
[50,127,118,110,103,98,96,95,92,90]
[51,128,119,111,104,99,97,96,93,91]
[52,129,120,112,105,100,98,97,95,92]
[53,130,121,113,106,101,99,98,96,94]
[54,131,122,114,107,103,100,99,97,95]
[55,132,124,115,108,104,101,101,99,96]
[56,133,125,116,109,105,102,102,100,98]
[57,134,126,117,110,106,103,103,102,99]
[58,135,128,119,111,107,104,104,103,100]
[59,136,129,120,112,108,105,105,104,102]
[60,137,130,121,114,109,106,106,106,103]
[61,138,131,122,115,110,107,108,107,105]
[62,139,132,123,116,111,108,109,109,106]
[63,140,133,124,117,112,109,110,110,107]
[64,141,134,125,118,113,110,111,111,109]
[65,142,135,126,119,114,111,112,113,110]
[66,143,137,128,120,115,112,113,114,111]
[67,144,139,129,121,116,114,115,115,113]
[68,145,139,130,122,117,116,116,117,114]
[69,null,140,131,123,118,117,117,118,115]
[70,null,141,132,124,119,118,118,120,117]
[71,null,142,133,135,121,119,119,121,118]
[72,null,143,134,126,122,121,121,122,119]
[]
[]
[]
[]
[]
[]
[]
[]
[]
[]
[]
[]
[]
[]
[]
[]
[]
[]
[]
[]
[]
[]
[]
[]
[]
[null,"Meninos"]
["SM_Ponto","< 6 anos","6 anos","7 anos","8 anos","9 anos","10 anos","11 anos","12 anos","> 12 anos"]
[0,77,75,62,52,48,41,27,21,10]
[1,79,76,63,53,49,42,28,22,11]
[2,80,77,64,54,50,43,29,23,12]
[3,82,78,65,55,51,44,30,24,13]
[4,83,79,66,56,52,45,31,25,14]
[5,85,80,68,57,53,46,32,26,15]
[6,87,81,69,58,54,47,33,27,16]
[7,89,82,70,60,55,48,34,28,17]
[8,91,83,71,61,56,49,35,29,18]
[9,93,84,72,62,57,50,36,30,19]
[10,94,85,73,63,58,51,37,31,20]
[11,96,86,74,64,59,51,38,32,21]
[12,98,88,75,65,60,52,39,34,22]
[13,99,89,77,66,61,53,40,35,23]
[14,101,90,78,67,62,54,41,36,24]
[15,103,91,78,67,63,55,42,37,35]
[16,104,92,80,69,64,56,43,38,26]
[17,106,93,81,70,65,57,44,39,27]
[18,108,94,82,71,66,58,45,40,28]
[19,110,95,83,72,67,59,46,41,29]
[20,112,96,84,73,68,60,47,42,30]
[21,113,97,85,74,69,61,48,43,31]
[22,115,98,86,75,70,62,49,45,32]
[23,116,99,87,76,71,63,50,46,33]
[24,118,100,88,77,72,64,51,47,34]
[25,120,101,90,78,73,66,52,48,35]
[26,122,102,91,79,74,67,53,49,36]
[27,124,103,93,80,75,68,54,50,37]
[28,125,104,93,82,76,69,56,51,38]
[29,127,105,94,83,77,70,57,53,39]
[30,128,106,95,84,78,71,58,54,40]
[31,129,108,96,85,79,72,59,55,41]
[32,130,109,97,86,80,73,60,56,42]
[33,132,110,98,87,81,74,62,58,43]
[34,133,111,100,88,82,75,63,59,44]
[35,134,112,101,89,83,76,64,60,45]
[36,135,113,102,90,84,77,65,61,46]
[37,135,114,103,91,85,78,67,63,47]
[38,136,115,104,92,86,79,68,64,48]
[39,137,116,105,93,87,80,69,65,49]
[40,137,117,106,94,88,81,71,66,50]
[41,138,118,107,95,88,82,72,67,51]
[42,139,119,108,97,89,83,73,68,52]
[43,140,120,109,98,90,84,74,70,53]
[44,141,121,111,99,91,85,76,71,54]
[45,142,122,112,100,92,86,77,72,55]
[46,143,124,113,101,93,87,78,74,56]
[47,145,125,114,102,94,88,80,75,57]
[48,146,126,115,103,95,89,81,77,58]
[49,147,127,117,104,96,90,82,78,60]
[50,148,128,117,105,97,91,83,79,61]
[51,149,129,118,106,98,92,85,80,63]
[52,150,130,119,107,99,93,86,82,64]
[{"$f":"A655+1","v":53},null,131,121,108,100,94,87,83,66]
[{"$f":"A656+1","v":54},null,132,122,109,101,95,89,84,68]
[55,null,133,123,110,102,96,90,85,70]
[56,null,134,124,111,103,97,91,87,72]
[57,null,135,125,113,104,98,92,88,74]
[58,null,136,126,114,105,99,94,89,76]
[59,null,137,127,115,106,100,95,91,77]
[60,null,138,128,116,107,101,96,92,79]
[61,null,139,129,117,108,102,98,93,81]
[62,null,140,130,118,109,103,99,94,83]
[63,null,141,132,119,110,104,100,96,85]
[64,null,142,133,120,111,105,101,97,86]
[65,null,143,134,121,112,106,103,98,88]
[66,null,144,135,122,113,107,104,99,90]
[67,null,145,136,123,114,109,105,101,92]
[68,null,146,138,124,115,110,107,102,93]
[69,null,147,138,125,116,111,108,103,95]
[70,null,148,139,127,117,112,109,104,97]
[71,null,149,140,128,118,113,110,106,99]
[72,null,150,141,129,119,114,112,107,101]
[73,null,null,142,130,120,115,113,108,103]
[74,null,null,143,131,121,116,114,110,104]
[75,null,null,144,132,122,117,116,111,106]
[76,null,null,145,133,123,118,117,112,108]
[77,null,null,146,134,124,119,118,113,110]
[78,null,null,147,135,125,120,119,115,111]
[]
[]
[]
[]
[]
[]
[]
[]
[]
[]
[]
[]
[]
[]
[]
[]
[]
[]
[]
[]
[]
[]
[]
[]
[]
[]
[]
[]
[]
[]
[]
[]
[]
[]
[]
[]
[]
[]
[]
[]
[]
[]
[]
[]
[]
[]
[]
[]
[]
[]
[]
[]
[]
[]
[]
[]
[]
[]
[]
[]
[]
[]
[]
[]
[]
[]
[]
[]
[]
[]
[]
[]
[]
[]
[]
[]
[]
[]
[]
[]
[]
[]
[]
[]
[]
[]
[]
[]
[]
[]
[]
[]
[]
[]
[]
[]
[]
[]
[]
[]
[]
[]
[]
[]
[]
[]
[]
[]
[]
[]
[]
[]
[]
[]
[]
[]
[]
[]
[]
[null,"Meninas"]
["SM_Ponto","< 6 anos","6 anos","7 anos","8 anos","9 anos","10 anos","11 anos","12 anos","> 12 anos"]
[0,70,55,53,51,43,35,31,22,11]
[1,71,56,54,52,44,36,32,23,12]
[2,72,57,55,53,45,37,33,24,13]
[3,73,58,56,54,46,38,34,25,14]
[4,75,59,57,55,47,39,36,26,15]
[5,77,60,59,57,48,40,37,27,16]
[6,78,61,60,58,49,41,38,28,17]
[7,80,62,61,60,50,42,39,29,18]
[8,81,63,62,61,51,43,40,30,19]
[9,83,64,63,62,52,44,42,31,20]
[10,84,65,65,63,53,45,43,32,21]
[11,86,66,66,64,54,46,44,33,22]
[12,87,67,68,65,55,47,45,34,23]
[13,89,69,69,66,56,48,46,35,24]
[14,90,70,70,67,57,49,47,36,25]
[15,92,72,71,68,58,50,48,37,26]
[16,93,73,73,69,59,51,49,38,27]
[17,95,75,74,72,60,52,50,39,28]
[18,96,76,75,72,61,53,51,40,29]
[19,98,78,77,73,62,54,52,41,30]
[20,99,79,78,74,63,55,53,42,31]
[21,101,80,79,75,64,56,64,43,32]
[22,103,82,81,76,65,57,55,44,33]
[23,104,83,82,77,66,59,55,45,34]
[24,106,85,83,79,68,59,56,46,35]
[25,107,87,84,80,69,60,57,47,36]
[26,109,88,86,81,70,61,58,48,37]
[27,110,89,87,82,71,62,59,49,38]
[28,112,91,88,83,72,63,60,50,39]
[29,113,92,89,84,73,64,61,50,40]
[30,114,94,91,85,74,65,62,51,41]
[31,115,95,92,87,75,66,63,51,42]
[32,117,97,93,88,76,67,64,52,43]
[33,118,98,95,89,77,68,66,53,44]
[34,120,99,96,90,78,69,67,53,45]
[35,122,101,97,91,79,70,68,54,46]
[36,123,102,98,92,80,71,69,54,47]
[37,125,104,100,94,81,72,70,55,48]
[38,126,105,101,95,82,73,71,55,49]
[39,128,107,102,96,83,74,72,55,50]
[40,129,108,103,97,84,75,73,55,51]
[41,131,110,105,98,85,76,75,56,51]
[42,132,111,106,99,86,77,75,56,52]
[43,134,113,107,100,88,78,77,57,53]
[44,135,114,109,102,89,79,78,57,54]
[45,137,115,110,103,90,80,79,58,54]
[46,138,117,111,104,91,82,81,58,55]
[47,139,118,112,105,92,83,82,59,56]
[48,140,120,114,106,93,84,83,60,56]
[49,141,121,115,107,94,85,84,60,57]
[50,143,123,116,109,95,86,85,61,58]
[51,144,125,117,110,96,87,86,63,59]
[52,146,126,119,111,97,88,87,65,60]
[53,147,128,121,113,98,89,88,67,61]
[54,148,128,121,113,99,90,90,69,62]
[55,150,130,123,114,100,92,91,71,63]
[56,null,131,125,115,101,93,92,73,64]
[57,null,133,127,117,102,94,93,75,65]
[58,null,134,127,118,103,95,94,77,68]
[59,null,136,128,119,104,96,96,79,70]
[60,null,137,129,120,105,97,97,81,72]
[61,null,138,130,121,107,99,98,83,75]
[62,null,139,131,122,108,100,99,85,78]
[63,null,140,132,124,109,101,100,87,80]
[64,null,142,134,125,110,102,101,89,82]
[65,null,143,134,126,111,103,102,92,85]
[66,null,144,136,127,112,104,103,94,87]
[67,null,145,137,128,113,106,104,96,90]
[68,null,146,139,129,114,107,106,98,92]
[69,null,147,140,131,115,109,107,100,92]
[70,null,148,141,132,116,110,108,102,97]
[71,null,149,142,133,117,112,109,104,99]
[72,null,150,143,134,118,113,110,106,102]
[73,null,null,144,135,119,115,111,108,104]
[74,null,null,145,136,120,116,113,110,106]
[75,null,null,147,138,121,118,114,112,109]
[76,null,null,148,139,122,119,115,114,111]
[77,null,null,149,140,123,121,116,116,114]
[78,null,null,150,141,124,122,117,117,116]
[]
[]
[]
[]
[]
[]
[]
[]
[]
[]
[]
[]
[]
[]
[]
[]
[]
[]
[]
[]
["MQ_KTK","Menina ou Menino"]
[100,40]
[{"$f":"A903+1","v":101},40]
[{"$f":"A904+1","v":102},40]
[103,40]
[104,40]
[105,40]
[106,40]
[107,40]
[108,40]
[109,40]
[110,40]
[111,40]
[112,40]
[113,40]
[114,40]
[115,40]
[116,40]
[117,40]
[118,40]
[119,40]
[120,40]
[121,40]
[122,40]
[123,40]
[124,40]
[125,40]
[126,40]
[127,40]
[128,40]
[129,40]
[130,40]
[131,40]
[132,40]
[133,40]
[134,40]
[135,40]
[136,40]
[137,40]
[138,40]
[139,40]
[140,40]
[141,40]
[142,40]
[143,40]
[144,40]
[145,40]
[146,40]
[147,40]
[148,40]
[149,40]
[150,40]
[151,40]
[152,40]
[153,40]
[154,40]
[155,40]
[156,40]
[157,40]
[158,40]
[159,40]
[160,40]
[161,40]
[162,40]
[163,40]
[164,40]
[165,40]
[{"$f":"A968+1","v":166},40]
[167,40]
[168,40]
[169,40]
[170,40]
[171,40]
[172,40]
[173,40]
[174,40]
[175,40]
[176,40]
[177,40]
[178,40]
[179,40]
[180,40]
[181,40]
[182,40]
[183,40]
[184,40]
[185,40]
[186,40]
[187,40]
[188,40]
[189,40]
[190,40]
[191,40]
[192,40]
[193,40]
[194,40]
[195,40]
[196,40]
[197,40]
[198,40]
[199,40]
[200,40]
[201,40]
[202,40]
[203,40]
[204,40]
[205,40]
[206,40]
[207,40]
[208,40]
[209,40]
[210,40]
[211,40]
[212,40]
[213,40]
[214,40]
[215,40]
[216,40]
[217,40]
[218,41]
[219,41]
[220,41]
[221,42]
[222,42]
[223,42]
[224,43]
[225,43]
[226,43]
[227,44]
[228,44]
[229,44]
[{"$f":"A1032+1","v":230},45]
[231,45]
[232,45]
[233,46]
[234,46]
[235,46]
[236,47]
[237,47]
[238,47]
[239,48]
[240,48]
[241,48]
[242,49]
[243,49]
[244,49]
[245,50]
[246,50]
[247,50]
[248,50]
[249,51]
[250,51]
[251,51]
[252,52]
[253,52]
[254,53]
[255,53]
[256,53]
[257,54]
[258,54]
[259,54]
[260,55]
[261,55]
[262,55]
[263,56]
[264,56]
[265,56]
[266,57]
[267,57]
[268,57]
[269,58]
[270,58]
[271,58]
[272,59]
[273,59]
[274,59]
[275,60]
[276,{"$f":"B1078","v":60}]
[277,{"$f":"B1079","v":60}]
[278,60]
[279,61]
[280,61]
[281,61]
[282,62]
[283,62]
[284,62]
[285,63]
[286,63]
[287,63]
[288,64]
[289,64]
[290,64]
[291,65]
[292,65]
[293,65]
[{"$f":"A1096+1","v":294},66]
[295,66]
[296,66]
[297,67]
[298,67]
[299,67]
[300,68]
[301,68]
[302,68]
[303,69]
[304,69]
[305,69]
[306,70]
[307,70]
[308,70]
[309,70]
[310,71]
[311,71]
[312,71]
[313,72]
[314,72]
[315,72]
[316,73]
[317,73]
[318,73]
[319,74]
[320,74]
[321,74]
[322,75]
[323,75]
[324,75]
[325,76]
[326,76]
[327,76]
[328,77]
[329,77]
[330,77]
[331,78]
[332,78]
[333,78]
[334,79]
[335,79]
[336,79]
[337,80]
[338,80]
[339,80]
[340,81]
[341,{"$f":"B1143","v":81}]
[342,81]
[343,81]
[344,82]
[345,82]
[346,82]
[347,83]
[348,83]
[349,83]
[350,84]
[351,84]
[352,84]
[353,85]
[354,85]
[355,85]
[356,86]
[357,86]
[{"$f":"A1160+1","v":358},86]
[359,87]
[360,87]
[361,87]
[362,88]
[363,88]
[364,88]
[365,89]
[366,89]
[367,89]
[368,90]
[369,90]
[370,90]
[371,90]
[372,91]
[373,91]
[374,91]
[375,92]
[376,92]
[377,92]
[378,93]
[379,93]
[380,93]
[381,94]
[382,94]
[383,94]
[384,95]
[385,95]
[386,95]
[387,96]
[388,96]
[389,96]
[390,97]
[391,97]
[392,97]
[393,98]
[394,98]
[395,98]
[396,99]
[397,99]
[398,99]
[399,100]
[400,100]
[401,100]
[402,100]
[403,101]
[404,101]
[405,{"$f":"B1207","v":101}]
[406,102]
[407,102]
[408,102]
[409,103]
[410,103]
[411,104]
[412,104]
[413,104]
[414,105]
[415,105]
[416,105]
[417,105]
[418,106]
[419,106]
[420,106]
[421,107]
[{"$f":"A1224+1","v":422},107]
[423,107]
[424,108]
[425,108]
[426,108]
[427,109]
[428,109]
[429,109]
[430,110]
[431,110]
[432,110]
[433,110]
[434,111]
[435,111]
[436,111]
[437,112]
[438,112]
[439,112]
[440,113]
[441,113]
[442,113]
[443,114]
[444,114]
[445,114]
[446,115]
[447,115]
[448,115]
[449,116]
[450,116]
[451,116]
[452,117]
[453,117]
[454,117]
[455,118]
[456,118]
[457,118]
[458,119]
[459,119]
[460,119]
[461,120]
[462,120]
[463,120]
[464,120]
[465,121]
[466,121]
[467,121]
[468,122]
[469,{"$f":"B1271","v":122}]
[470,122]
[471,123]
[472,123]
[473,123]
[474,124]
[475,124]
[476,124]
[477,125]
[478,125]
[479,125]
[480,126]
[481,126]
[482,126]
[483,127]
[484,127]
[485,127]
[{"$f":"A1288+1","v":486},128]
[487,128]
[488,128]
[489,129]
[490,129]
[491,129]
[492,130]
[493,130]
[494,130]
[495,130]
[496,131]
[497,131]
[498,131]
[499,132]
[500,132]
[501,132]
[502,133]
[503,133]
[504,133]
[505,134]
[506,134]
[507,134]
[508,135]
[509,135]
[510,135]
[511,136]
[512,136]
[513,136]
[514,137]
[515,137]
[516,137]
[517,138]
[518,138]
[519,138]
[520,139]
[521,139]
[522,139]
[523,140]
[524,140]
[525,140]
[526,140]
[527,141]
[528,141]
[529,141]
[530,142]
[531,142]
[532,142]
[533,{"$f":"B1335","v":142}]
[534,143]
[535,143]
[536,143]
[537,144]
[538,144]
[539,144]
[540,144]
[541,145]
[542,145]
[543,145]
[544,146]
[545,146]
[546,146]
[547,147]
[548,147]
[549,147]
[{"$f":"A1352+1","v":550},148]
[551,148]
[552,148]
[553,149]
[554,149]
[555,149]
[556,150]
[557,150]
[558,150]
[559,150]
[]
[]
[]
[]
[]
[]
[]
[]
[]
[]
[]
[]
[]
[]
[]
[]
[]
[]
[]
[]
[]
[]
[]
[]
[]
[]
[]
[]
[]
[]
[]
[]
[]
[]
[]
[]
[]
[]
[]
["Percentil_KTK"]
[0,0]
[{"$f":"A1403+1","v":1},{"$f":"B1403","v":0}]
[{"$f":"A1404+1","v":2},{"$f":"B1404","v":0}]
[3,0]
[4,0]
[5,0]
[6,0]
[7,0]
[8,0]
[9,0]
[10,0]
[11,0]
[12,0]
[13,0]
[14,0]
[15,0]
[16,0]
[17,0]
[18,0]
[19,0]
[20,0]
[21,0]
[22,0]
[23,0]
[24,0]
[25,0]
[26,0]
[27,0]
[28,0]
[29,0]
[30,0]
[31,0]
[32,0]
[33,0]
[34,0]
[35,0]
[36,0]
[37,0]
[38,0]
[39,0]
[40,0]
[41,0]
[42,0]
[43,0]
[44,0]
[45,0]
[46,0]
[47,0]
[48,0]
[49,0]
[50,0]
[51,0]
[52,0]
[53,0]
[54,0]
[55,0]
[56,0]
[57,0]
[58,0]
[59,0]
[60,0]
[61,0]
[62,0]
[63,1]
[64,1]
[65,1]
[{"$f":"A1468+1","v":66},{"$f":"B1468","v":1}]
[67,1]
[68,2]
[69,2]
[70,2]
[71,3]
[72,3]
[73,3]
[74,4]
[75,4]
[76,5]
[77,7]
[78,7]
[79,8]
[80,9]
[81,10]
[82,12]
[83,13]
[84,15]
[85,16]
[86,18]
[87,20]
[88,21]
[89,22]
[90,24]
[91,27]
[92,29]
[93,31]
[94,34]
[95,36]
[96,39]
[97,42]
[98,45]
[99,48]
[100,50]
[101,53]
[102,56]
[103,58]
[104,60]
[105,63]
[106,66]
[107,69]
[108,71]
[109,73]
[110,75]
[111,77]
[112,79]
[113,81]
[114,82]
[115,84]
[116,85]
[117,87]
[118,88]
[119,89]
[120,91]
[121,92]
[122,93]
[123,94]
[124,95]
[125,95]
[126,96]
[127,96]
[128,97]
[129,97]
[{"$f":"A1532+1","v":130},98]
[131,{"$f":"B1533","v":98}]
[132,99]
[133,99]
[134,99]
[135,99]
[136,99]
[137,100]
[138,100]
[139,100]
[140,100]
[141,100]
[142,100]
[143,100]
[144,100]
[145,100]
[146,100]
[147,100]
[148,100]
[149,100]
[150,100]
[151,100]
[152,100]
[153,100]
[154,100]
[155,100]
[156,100]
[157,100]
[158,100]
[159,100]
[160,100]
[161,100]
[162,100]
[163,100]
[164,100]
[165,100]
[166,100]
[167,100]
[168,100]
[169,100]
[170,100]
[171,100]
[172,100]
[173,100]
[174,100]
[175,100]
[176,100]
[177,100]
[178,100]
[179,100]
[180,100]
[181,100]
[182,100]
[183,100]
[184,100]
[185,100]
[186,100]
[187,100]
[188,100]
[189,100]
[190,100]
[191,100]
[192,100]
[193,100]
[{"$f":"A1596+1","v":194},{"$f":"B1596","v":100}]
[195,100]
[196,100]
[197,100]
[198,100]
[199,100]
[200,100]
[201,100]
[202,100]
[203,100]
[204,100]
[205,100]
[206,100]
[207,100]
[208,100]
[209,100]
[210,100]
[211,100]
[212,100]
[213,100]
[214,100]
[215,100]
[216,100]
[217,100]
[218,100]
[219,100]
[220,100]
[221,100]
[222,100]
[223,100]
[224,100]
[225,100]
[226,100]
[227,100]
[228,100]
[229,100]
[230,100]
[231,100]
[232,100]
[233,100]
[234,100]
[235,100]
[236,100]
[237,100]
[238,100]
[239,100]
[240,100]
[241,100]
[242,100]
[243,100]
[244,100]
[245,100]
[246,100]
[247,100]
[248,100]
[249,100]
[250,100]
[251,100]
[252,100]
[253,100]
[254,100]
[255,100]
[256,100]
[257,100]
[{"$f":"A1660+1","v":258},{"$f":"B1660","v":100}]
[259,100]
[260,100]
[261,100]
[262,100]
[263,100]
[264,100]
[265,100]
[266,100]
[267,100]
[268,100]
[269,100]
[270,100]
[271,100]
[272,100]
[273,100]
[274,100]
[275,100]
[276,100]
[277,100]
[278,100]
[279,100]
[280,100]
[281,100]
[282,100]
[283,100]
[284,100]
[285,100]
[286,100]
[287,100]
[288,100]
[289,100]
[290,100]
[291,100]
[292,100]
[293,100]
[294,100]
[295,100]
[296,100]
[297,100]
[298,100]
[299,100]
[300,100]
[301,100]
[302,100]
[303,100]
[304,100]
[305,100]
[306,100]
[307,100]
[308,100]
[309,100]
[310,100]
[311,100]
[312,100]
[313,100]
[314,100]
[315,100]
[316,100]
[317,100]
[318,100]
[319,100]
[320,100]
[321,100]
[{"$f":"A1724+1","v":322},{"$f":"B1724","v":100}]
[323,100]
[324,100]
[325,100]
[326,100]
[327,100]
[328,100]
[329,100]
[330,100]
[331,100]
[332,100]
[333,100]
[334,100]
[335,100]
[336,100]
[337,100]
[338,100]
[339,100]
[340,100]
[341,100]
[342,100]
[343,100]
[344,100]
[345,100]
[346,100]
[347,100]
[348,100]
[349,100]
[350,100]
[351,100]
[352,100]
[353,100]
[354,100]
[355,100]
[356,100]
[357,100]
[358,100]
[359,100]
[360,100]
[361,100]
[362,100]
[363,100]
[364,100]
[365,100]
[366,100]
[367,100]
[368,100]
[369,100]
[370,100]
[371,100]
[372,100]
[373,100]
[374,100]
[375,100]
[376,100]
[377,100]
[378,100]
[379,100]
[380,100]
[381,100]
[382,100]
[383,100]
[384,100]
[385,100]
[{"$f":"A1788+1","v":386},{"$f":"B1788","v":100}]
[387,100]
[388,100]
[389,100]
[390,100]
[391,100]
[392,100]
[393,100]
[394,100]
[395,100]
[396,100]
[397,100]
[398,100]
[399,100]
[400,100]
[401,100]
[402,100]
[403,100]
[404,100]
[405,100]
[406,100]
[407,100]
[408,100]
[409,100]
[410,100]
[411,100]
[412,100]
[413,100]
[414,100]
[415,100]
[416,100]
[417,100]
[418,100]
[419,100]
[420,100]
[421,100]
[422,100]
[423,100]
[424,100]
[425,100]
[426,100]
[427,100]
[428,100]
[429,100]
[430,100]
[431,100]
[432,100]
[433,100]
[434,100]
[435,100]
[436,100]
[437,100]
[438,100]
[439,100]
[440,100]
[441,100]
[442,100]
[443,100]
[444,100]
[445,100]
[446,100]
[447,100]
[448,100]
[449,100]
[{"$f":"A1852+1","v":450},{"$f":"B1852","v":100}]
[451,100]
[452,100]
[453,100]
[454,100]
[455,100]
[456,100]
[457,100]
[458,100]
[459,100]
[460,100]
[461,100]
[462,100]
[463,100]
[464,100]
[465,100]
[466,100]
[467,100]
[468,100]
[469,100]
[470,100]
[471,100]
[472,100]
[473,100]
[474,100]
[475,100]
[476,100]
[477,100]
[478,100]
[479,100]
[480,100]
[481,100]
[482,100]
[483,100]
[484,100]
[485,100]
[486,100]
[487,100]
[488,100]
[489,100]
[490,100]
[491,100]
[492,100]
[493,100]
[494,100]
[495,100]
[496,100]
[497,100]
[498,100]
[499,100]
[500,100]
[]
[]
[]
[]
[]
[]
[]
[]
[]
[]
[]
[]
[]
[]
[]
[]
[]
[]
[]
[]
[]
[]
[]
[]
[]
[]
[]
[]
[]
[]
[]
[]
[]
[]
[]
[]
[]
[]
[]
[]
[]
[]
[]
[]
[]
[]
[]
[]
[]
[]
[]
[]
[]
[]
[]
[]
[]
[]
[]
[]
[]
[]
[]
[]
[]
[]
[]
[]
[]
[]
[]
[]
[]
[]
[]
[]
[]
[]
[]
[]
[]
[]
[]
[]
[]
[]
[]
[]
[]
[]
[]
[]
[]
[]
[]
[]
[]
["Total","Esquerda","Direita","Designação"]
["Categorias"]
[{"$f":"LEN(D2003)","v":26},11,{"$f":"A2003-B2003","v":15},"Perturbação da coordenação"]
[{"$f":"LEN(D2004)","v":24},11,{"$f":"A2004-B2004","v":13},"Coordenação insuficiente"]
[{"$f":"LEN(D2005)","v":6},6,0,"Normal"]
[{"$f":"LEN(D2006)","v":3},3,0,"Boa"]
[7,7,0,"Elevado"]

{"sheet":"Auxiliar","index":4,"n_rows":6,"n_cols":21,"rows_kept":6,"cut":false,"hidden":true,"merged":[]}
["Número","Ordem","Teste","iniCriança","iniMédia","iniMínimo","iniMáximo",null,"Nome Gráfico","fimCriança","fimMédia","fimMínimo","fimMáximo","Melhor","Desvio","Padrão","DifMédia","Teste T","Conclusão","Num Suj","Num Suj"]
[null,0,null,null,null,null,null,null,null,null,null,null,null,null,"ini","fim",null,null,null,"ini","fim"]
[null,4,"Transposição lateral",{"$f":"IF(iniTurma!$A$2=1,VLOOKUP(\"x\",iniTurma!$B$4:$J$53,6,0),\"\")","v":40},{"$f":"IF(iniTurma!$A$2=1,iniTurma!$G$1,\"\")","v":43.4},{"$f":"IF(iniTurma!$A$2=1,SMALL(iniTurma!$G$4:$G53,1),\"\")","v":35},{"$f":"IF(iniTurma!$A$2=1,LARGE(iniTurma!$G$4:$G53,1),\"\")","v":55},null,"Transposição lateral",{"$f":"IF(fimTurma!$A$2=1,VLOOKUP(\"x\",fimTurma!$B$4:$J$53,6,0),\"\")","v":50},{"$f":"IF(fimTurma!$A$2=1,fimTurma!$G$1,\"\")","v":37.5},{"$f":"IF(fimTurma!$A$2=1,SMALL(fimTurma!$G$4:$G53,1),\"\")","v":32},{"$f":"IF(fimTurma!$A$2=1,LARGE(fimTurma!$G$4:$G53,1),\"\")","v":50},1,{"$f":"IF(iniTurma!$A$2=1,iniTurma!$G$2,\"\")","v":6.6513156593263565},{"$f":"IF(fimTurma!$A$2=1,fimTurma!$G$2,\"\")","v":7.2972597596632118},{"$f":"IF(AND(E3<>\"\",K3<>\"\"),K3-E3,\"\")","v":-5.8999999999999986},{"$f":"IF(AND(K3<>\"\",E3<>\"\"),IFERROR(_xlfn.T.TEST(iniTurma!G$4:G$53,fimTurma!G$4:G$53,1,1),_xlfn.T.TEST(iniTurma!G$4:G$53,fimTurma!G$4:G$53,1,2)),\"\")","v":5.1329175200286077E-2},{"$f":"IF(AND(E3<>\"\",K3<>\"\"),IF(N3*Q3<=0,\"Não\",IF(R3>=0.05,\"Não\",\"Sim\")),\"\")","v":"Não"},{"$f":"IF(iniTurma!$A$2=1,COUNTIF(iniTurma!G4:G53,\">0\"),\"\")","v":5},{"$f":"IF(fimTurma!$A$2=1,COUNTIF(fimTurma!G4:G53,\">0\"),\"\")","v":4}]
[null,3,"Saltos laterais",{"$f":"IF(iniTurma!$A$2=1,VLOOKUP(\"x\",iniTurma!$B$4:$J$53,7,0),\"\")","v":45},{"$f":"IF(iniTurma!$A$2=1,iniTurma!$H$1,\"\")","v":37},{"$f":"IF(iniTurma!$A$2=1,SMALL(iniTurma!$H$4:$H53,1),\"\")","v":8},{"$f":"IF(iniTurma!$A$2=1,LARGE(iniTurma!$H$4:$H53,1),\"\")","v":75},null,"Saltos laterais",{"$f":"IF(fimTurma!$A$2=1,VLOOKUP(\"x\",fimTurma!$B$4:$J$53,7,0),\"\")","v":74},{"$f":"IF(fimTurma!$A$2=1,fimTurma!$H$1,\"\")","v":39.6},{"$f":"IF(fimTurma!$A$2=1,SMALL(fimTurma!$H$4:$H54,1),\"\")","v":8},{"$f":"IF(fimTurma!$A$2=1,LARGE(fimTurma!$H$4:$H54,1),\"\")","v":74},1,{"$f":"IF(iniTurma!$A$2=1,iniTurma!$H$2,\"\")","v":25.680732076792516},{"$f":"IF(fimTurma!$A$2=1,fimTurma!$H$2,\"\")","v":22.222511109233356},{"$f":"IF(AND(E4<>\"\",K4<>\"\"),K4-E4,\"\")","v":2.6000000000000014},{"$f":"IF(AND(K3<>\"\",E3<>\"\"),IFERROR(_xlfn.T.TEST(iniTurma!H$4:H$53,fimTurma!H$4:H$53,1,1),_xlfn.T.TEST(iniTurma!H$4:H$53,fimTurma!H$4:H$53,1,2)),\"\")","v":0.318809045700302},{"$f":"IF(AND(E4<>\"\",K4<>\"\"),IF(N4*Q4<=0,\"Não\",IF(R4>=0.05,\"Não\",\"Sim\")),\"\")","v":"Não"},{"$f":"IF(iniTurma!$A$2=1,COUNTIF(iniTurma!H4:H53,\">0\"),\"\")","v":4},{"$f":"IF(fimTurma!$A$2=1,COUNTIF(fimTurma!H4:H53,\">0\"),\"\")","v":5}]
[null,2,"Equilíbrio à retaguarda",{"$f":"IF(iniTurma!$A$2=1,VLOOKUP(\"x\",iniTurma!$B$4:$J$53,8,0),\"\")","v":22},{"$f":"IF(iniTurma!$A$2=1,iniTurma!$I$1,\"\")","v":32.799999999999997},{"$f":"IF(iniTurma!$A$2=1,SMALL(iniTurma!$I$4:$I53,1),\"\")","v":21},{"$f":"IF(iniTurma!$A$2=1,LARGE(iniTurma!$I$4:$I53,1),\"\")","v":54},null,"Equilíbrio à retaguarda",{"$f":"IF(fimTurma!$A$2=1,VLOOKUP(\"x\",fimTurma!$B$4:$J$53,8,0),\"\")","v":70},{"$f":"IF(fimTurma!$A$2=1,fimTurma!$I$1,\"\")","v":59.8},{"$f":"IF(fimTurma!$A$2=1,SMALL(fimTurma!$I$4:$I55,1),\"\")","v":50},{"$f":"IF(fimTurma!$A$2=1,LARGE(fimTurma!$I$4:$I55,1),\"\")","v":70},1,{"$f":"IF(iniTurma!$A$2=1,iniTurma!$I$2,\"\")","v":13.044539087296261},{"$f":"IF(fimTurma!$A$2=1,fimTurma!$I$2,\"\")","v":7.0823724838503095},27,{"$f":"IF(AND(K3<>\"\",E3<>\"\"),IFERROR(_xlfn.T.TEST(iniTurma!I$4:I$53,fimTurma!I$4:I$53,1,1),_xlfn.T.TEST(iniTurma!I$4:I$53,fimTurma!I$4:I$53,1,2)),\"\")","v":1.4572962461334698E-2},"Sim",{"$f":"IF(iniTurma!$A$2=1,COUNTIF(iniTurma!I4:I53,\">0\"),\"\")","v":5},{"$f":"IF(fimTurma!$A$2=1,COUNTIF(fimTurma!I4:I53,\">0\"),\"\")","v":5}]
[null,1,"Saltos monopedais",{"$f":"IF(iniTurma!$A$2=1,VLOOKUP(\"x\",iniTurma!$B$4:$J$53,9,0),\"\")","v":18},{"$f":"IF(iniTurma!$A$2=1,iniTurma!$J$1,\"\")","v":36},{"$f":"IF(iniTurma!$A$2=1,SMALL(iniTurma!$J$4:$J53,1),\"\")","v":17},{"$f":"IF(iniTurma!$A$2=1,LARGE(iniTurma!$J$4:$J53,1),\"\")","v":63},null,"Saltos monopedais",{"$f":"IF(fimTurma!$A$2=1,VLOOKUP(\"x\",fimTurma!$B$4:$J$53,9,0),\"\")","v":58},{"$f":"IF(fimTurma!$A$2=1,fimTurma!$J$1,\"\")","v":56},{"$f":"IF(fimTurma!$A$2=1,SMALL(fimTurma!$J$4:$J56,1),\"\")","v":50},{"$f":"IF(fimTurma!$A$2=1,LARGE(fimTurma!$J$4:$J56,1),\"\")","v":60},1,{"$f":"IF(iniTurma!$A$2=1,iniTurma!$J$2,\"\")","v":22.054478003344354},{"$f":"IF(fimTurma!$A$2=1,fimTurma!$J$2,\"\")","v":3.40587727318528},20,{"$f":"IF(AND(K3<>\"\",E3<>\"\"),IFERROR(_xlfn.T.TEST(iniTurma!J$4:J$53,fimTurma!J$4:J$53,1,1),_xlfn.T.TEST(iniTurma!J$4:J$53,fimTurma!J$4:J$53,1,2)),\"\")","v":7.9311466325716493E-2},"Não",{"$f":"IF(iniTurma!$A$2=1,COUNTIF(iniTurma!J4:J53,\">0\"),\"\")","v":5},{"$f":"IF(fimTurma!$A$2=1,COUNTIF(fimTurma!I4:I53,\">0\"),\"\")","v":5}]

{"sheet":"fimTurma","index":5,"n_rows":53,"n_cols":10,"rows_kept":53,"cut":false,"hidden":false,"merged":[]}
[null,"Ano:",{"$f":"IF(iniTurma!C1=\"\",\"\",iniTurma!C1)","v":3},null,null,"Média:",{"$f":"IF(COUNTA(G4:G53)>0,AVERAGE(G4:G53),\"\")","v":37.5},{"$f":"IF(COUNTA(H4:H53)>0,AVERAGE(H4:H53),\"\")","v":39.6},59.8,56]
[{"$f":"COUNTIF(B4:B53,\"x\")","v":1},"Turma:",{"$f":"IF(iniTurma!C2=\"\",\"\",iniTurma!C2)","v":"B"},null,null,"Desvio-padrão:",{"$f":"IF(COUNTA(G4:G53)>0,_xlfn.STDEV.P(G4:G53),\"\")","v":7.2972597596632118},{"$f":"IF(COUNTA(H4:H53)>0,_xlfn.STDEV.P(H4:H53),\"\")","v":22.222511109233356},7.0823724838503095,3.40587727318528]
["ID Aluno",{"$f":"_xlfn.CONCAT(\"Ver: \",COUNTIF(B4:B53,\"x\"))","v":"Ver: 1"},"Nome","Género","Data Nascimento","Data Avaliação","TL_Ponto","SL_Ponto","EQ_Ponto","SM_Ponto"]
[1,null,{"$f":"IF(iniTurma!C4=0,\"\",iniTurma!C4)","v":"Maria Adelaide"},{"$f":"IF(iniTurma!D4=0,\"\",iniTurma!D4)","v":"Menina"},{"$f":"IF(iniTurma!E4=0,\"\",iniTurma!E4)","v":"2000-01-01"},"2007-05-01",35,8,59,50]
[{"$f":"A4+1","v":2},null,{"$f":"IF(iniTurma!C5=0,\"\",iniTurma!C5)","v":"Manuel Silva"},{"$f":"IF(iniTurma!D5=0,\"\",iniTurma!D5)","v":"Menino"},{"$f":"IF(iniTurma!E5=0,\"\",iniTurma!E5)","v":"2000-01-01"},"2007-05-01",32,47,50,60]
[{"$f":"A5+1","v":3},null,{"$f":"IF(iniTurma!C6=0,\"\",iniTurma!C6)","v":"Pedro Silva"},{"$f":"IF(iniTurma!D6=0,\"\",iniTurma!D6)","v":"Menino"},{"$f":"IF(iniTurma!E6=0,\"\",iniTurma!E6)","v":"2015-03-11"},"2022-08-30",33,44,65,55]
[4,null,{"$f":"IF(iniTurma!C7=0,\"\",iniTurma!C7)","v":"António Ferreira"},{"$f":"IF(iniTurma!D7=0,\"\",iniTurma!D7)","v":"Menino"},{"$f":"IF(iniTurma!E7=0,\"\",iniTurma!E7)","v":"2014-08-23"},"2021-05-12",null,25,55,57]
[5,"x",{"$f":"IF(iniTurma!C8=0,\"\",iniTurma!C8)","v":"Teresa Martinho"},{"$f":"IF(iniTurma!D8=0,\"\",iniTurma!D8)","v":"Menina"},{"$f":"IF(iniTurma!E8=0,\"\",iniTurma!E8)","v":"2012-07-10"},"2022-08-11",50,74,70,58]
[6,null,{"$f":"IF(iniTurma!C9=0,\"\",iniTurma!C9)","v":""},{"$f":"IF(iniTurma!D9=0,\"\",iniTurma!D9)","v":""},{"$f":"IF(iniTurma!E9=0,\"\",iniTurma!E9)","v":""}]
[7,null,{"$f":"IF(iniTurma!C10=0,\"\",iniTurma!C10)","v":""},{"$f":"IF(iniTurma!D10=0,\"\",iniTurma!D10)","v":""},{"$f":"IF(iniTurma!E10=0,\"\",iniTurma!E10)","v":""}]
[8,null,{"$f":"IF(iniTurma!C11=0,\"\",iniTurma!C11)","v":""},{"$f":"IF(iniTurma!D11=0,\"\",iniTurma!D11)","v":""},{"$f":"IF(iniTurma!E11=0,\"\",iniTurma!E11)","v":""}]
[9,null,{"$f":"IF(iniTurma!C12=0,\"\",iniTurma!C12)","v":""},{"$f":"IF(iniTurma!D12=0,\"\",iniTurma!D12)","v":""},{"$f":"IF(iniTurma!E12=0,\"\",iniTurma!E12)","v":""}]
[10,null,{"$f":"IF(iniTurma!C13=0,\"\",iniTurma!C13)","v":""},{"$f":"IF(iniTurma!D13=0,\"\",iniTurma!D13)","v":""},{"$f":"IF(iniTurma!E13=0,\"\",iniTurma!E13)","v":""}]
[11,null,{"$f":"IF(iniTurma!C14=0,\"\",iniTurma!C14)","v":""},{"$f":"IF(iniTurma!D14=0,\"\",iniTurma!D14)","v":""},{"$f":"IF(iniTurma!E14=0,\"\",iniTurma!E14)","v":""}]
[12,null,{"$f":"IF(iniTurma!C15=0,\"\",iniTurma!C15)","v":""},{"$f":"IF(iniTurma!D15=0,\"\",iniTurma!D15)","v":""},{"$f":"IF(iniTurma!E15=0,\"\",iniTurma!E15)","v":""}]
[13,null,{"$f":"IF(iniTurma!C16=0,\"\",iniTurma!C16)","v":""},{"$f":"IF(iniTurma!D16=0,\"\",iniTurma!D16)","v":""},{"$f":"IF(iniTurma!E16=0,\"\",iniTurma!E16)","v":""}]
[14,null,{"$f":"IF(iniTurma!C17=0,\"\",iniTurma!C17)","v":""},{"$f":"IF(iniTurma!D17=0,\"\",iniTurma!D17)","v":""},{"$f":"IF(iniTurma!E17=0,\"\",iniTurma!E17)","v":""}]
[15,null,{"$f":"IF(iniTurma!C18=0,\"\",iniTurma!C18)","v":""},{"$f":"IF(iniTurma!D18=0,\"\",iniTurma!D18)","v":""},{"$f":"IF(iniTurma!E18=0,\"\",iniTurma!E18)","v":""}]
[16,null,{"$f":"IF(iniTurma!C19=0,\"\",iniTurma!C19)","v":""},{"$f":"IF(iniTurma!D19=0,\"\",iniTurma!D19)","v":""},{"$f":"IF(iniTurma!E19=0,\"\",iniTurma!E19)","v":""}]
[17,null,{"$f":"IF(iniTurma!C20=0,\"\",iniTurma!C20)","v":""},{"$f":"IF(iniTurma!D20=0,\"\",iniTurma!D20)","v":""},{"$f":"IF(iniTurma!E20=0,\"\",iniTurma!E20)","v":""}]
[18,null,{"$f":"IF(iniTurma!C21=0,\"\",iniTurma!C21)","v":""},{"$f":"IF(iniTurma!D21=0,\"\",iniTurma!D21)","v":""},{"$f":"IF(iniTurma!E21=0,\"\",iniTurma!E21)","v":""}]
[19,null,{"$f":"IF(iniTurma!C22=0,\"\",iniTurma!C22)","v":""},{"$f":"IF(iniTurma!D22=0,\"\",iniTurma!D22)","v":""},{"$f":"IF(iniTurma!E22=0,\"\",iniTurma!E22)","v":""}]
[20,null,{"$f":"IF(iniTurma!C23=0,\"\",iniTurma!C23)","v":""},{"$f":"IF(iniTurma!D23=0,\"\",iniTurma!D23)","v":""},{"$f":"IF(iniTurma!E23=0,\"\",iniTurma!E23)","v":""}]
[21,null,{"$f":"IF(iniTurma!C24=0,\"\",iniTurma!C24)","v":""},{"$f":"IF(iniTurma!D24=0,\"\",iniTurma!D24)","v":""},{"$f":"IF(iniTurma!E24=0,\"\",iniTurma!E24)","v":""}]
[22,null,{"$f":"IF(iniTurma!C25=0,\"\",iniTurma!C25)","v":""},{"$f":"IF(iniTurma!D25=0,\"\",iniTurma!D25)","v":""},{"$f":"IF(iniTurma!E25=0,\"\",iniTurma!E25)","v":""}]
[23,null,{"$f":"IF(iniTurma!C26=0,\"\",iniTurma!C26)","v":""},{"$f":"IF(iniTurma!D26=0,\"\",iniTurma!D26)","v":""},{"$f":"IF(iniTurma!E26=0,\"\",iniTurma!E26)","v":""}]
[24,null,{"$f":"IF(iniTurma!C27=0,\"\",iniTurma!C27)","v":""},{"$f":"IF(iniTurma!D27=0,\"\",iniTurma!D27)","v":""},{"$f":"IF(iniTurma!E27=0,\"\",iniTurma!E27)","v":""}]
[25,null,{"$f":"IF(iniTurma!C28=0,\"\",iniTurma!C28)","v":""},{"$f":"IF(iniTurma!D28=0,\"\",iniTurma!D28)","v":""},{"$f":"IF(iniTurma!E28=0,\"\",iniTurma!E28)","v":""}]
[26,null,{"$f":"IF(iniTurma!C29=0,\"\",iniTurma!C29)","v":""},{"$f":"IF(iniTurma!D29=0,\"\",iniTurma!D29)","v":""},{"$f":"IF(iniTurma!E29=0,\"\",iniTurma!E29)","v":""}]
[27,null,{"$f":"IF(iniTurma!C30=0,\"\",iniTurma!C30)","v":""},{"$f":"IF(iniTurma!D30=0,\"\",iniTurma!D30)","v":""},{"$f":"IF(iniTurma!E30=0,\"\",iniTurma!E30)","v":""}]
[28,null,{"$f":"IF(iniTurma!C31=0,\"\",iniTurma!C31)","v":""},{"$f":"IF(iniTurma!D31=0,\"\",iniTurma!D31)","v":""},{"$f":"IF(iniTurma!E31=0,\"\",iniTurma!E31)","v":""}]
[29,null,{"$f":"IF(iniTurma!C32=0,\"\",iniTurma!C32)","v":""},{"$f":"IF(iniTurma!D32=0,\"\",iniTurma!D32)","v":""},{"$f":"IF(iniTurma!E32=0,\"\",iniTurma!E32)","v":""}]
[30,null,{"$f":"IF(iniTurma!C33=0,\"\",iniTurma!C33)","v":""},{"$f":"IF(iniTurma!D33=0,\"\",iniTurma!D33)","v":""},{"$f":"IF(iniTurma!E33=0,\"\",iniTurma!E33)","v":""}]
[31,null,{"$f":"IF(iniTurma!C34=0,\"\",iniTurma!C34)","v":""},{"$f":"IF(iniTurma!D34=0,\"\",iniTurma!D34)","v":""},{"$f":"IF(iniTurma!E34=0,\"\",iniTurma!E34)","v":""}]
[32,null,{"$f":"IF(iniTurma!C35=0,\"\",iniTurma!C35)","v":""},{"$f":"IF(iniTurma!D35=0,\"\",iniTurma!D35)","v":""},{"$f":"IF(iniTurma!E35=0,\"\",iniTurma!E35)","v":""}]
[33,null,{"$f":"IF(iniTurma!C36=0,\"\",iniTurma!C36)","v":""},{"$f":"IF(iniTurma!D36=0,\"\",iniTurma!D36)","v":""},{"$f":"IF(iniTurma!E36=0,\"\",iniTurma!E36)","v":""}]
[34,null,{"$f":"IF(iniTurma!C37=0,\"\",iniTurma!C37)","v":""},{"$f":"IF(iniTurma!D37=0,\"\",iniTurma!D37)","v":""},{"$f":"IF(iniTurma!E37=0,\"\",iniTurma!E37)","v":""}]
[35,null,{"$f":"IF(iniTurma!C38=0,\"\",iniTurma!C38)","v":""},{"$f":"IF(iniTurma!D38=0,\"\",iniTurma!D38)","v":""},{"$f":"IF(iniTurma!E38=0,\"\",iniTurma!E38)","v":""}]
[36,null,{"$f":"IF(iniTurma!C39=0,\"\",iniTurma!C39)","v":""},{"$f":"IF(iniTurma!D39=0,\"\",iniTurma!D39)","v":""},{"$f":"IF(iniTurma!E39=0,\"\",iniTurma!E39)","v":""}]
[37,null,{"$f":"IF(iniTurma!C40=0,\"\",iniTurma!C40)","v":""},{"$f":"IF(iniTurma!D40=0,\"\",iniTurma!D40)","v":""},{"$f":"IF(iniTurma!E40=0,\"\",iniTurma!E40)","v":""}]
[38,null,{"$f":"IF(iniTurma!C41=0,\"\",iniTurma!C41)","v":""},{"$f":"IF(iniTurma!D41=0,\"\",iniTurma!D41)","v":""},{"$f":"IF(iniTurma!E41=0,\"\",iniTurma!E41)","v":""}]
[39,null,{"$f":"IF(iniTurma!C42=0,\"\",iniTurma!C42)","v":""},{"$f":"IF(iniTurma!D42=0,\"\",iniTurma!D42)","v":""},{"$f":"IF(iniTurma!E42=0,\"\",iniTurma!E42)","v":""}]
[40,null,{"$f":"IF(iniTurma!C43=0,\"\",iniTurma!C43)","v":""},{"$f":"IF(iniTurma!D43=0,\"\",iniTurma!D43)","v":""},{"$f":"IF(iniTurma!E43=0,\"\",iniTurma!E43)","v":""}]
[41,null,{"$f":"IF(iniTurma!C44=0,\"\",iniTurma!C44)","v":""},{"$f":"IF(iniTurma!D44=0,\"\",iniTurma!D44)","v":""},{"$f":"IF(iniTurma!E44=0,\"\",iniTurma!E44)","v":""}]
[42,null,{"$f":"IF(iniTurma!C45=0,\"\",iniTurma!C45)","v":""},{"$f":"IF(iniTurma!D45=0,\"\",iniTurma!D45)","v":""},{"$f":"IF(iniTurma!E45=0,\"\",iniTurma!E45)","v":""}]
[43,null,{"$f":"IF(iniTurma!C46=0,\"\",iniTurma!C46)","v":""},{"$f":"IF(iniTurma!D46=0,\"\",iniTurma!D46)","v":""},{"$f":"IF(iniTurma!E46=0,\"\",iniTurma!E46)","v":""}]
[44,null,{"$f":"IF(iniTurma!C47=0,\"\",iniTurma!C47)","v":""},{"$f":"IF(iniTurma!D47=0,\"\",iniTurma!D47)","v":""},{"$f":"IF(iniTurma!E47=0,\"\",iniTurma!E47)","v":""}]
[45,null,{"$f":"IF(iniTurma!C48=0,\"\",iniTurma!C48)","v":""},{"$f":"IF(iniTurma!D48=0,\"\",iniTurma!D48)","v":""},{"$f":"IF(iniTurma!E48=0,\"\",iniTurma!E48)","v":""}]
[46,null,{"$f":"IF(iniTurma!C49=0,\"\",iniTurma!C49)","v":""},{"$f":"IF(iniTurma!D49=0,\"\",iniTurma!D49)","v":""},{"$f":"IF(iniTurma!E49=0,\"\",iniTurma!E49)","v":""}]
[47,null,{"$f":"IF(iniTurma!C50=0,\"\",iniTurma!C50)","v":""},{"$f":"IF(iniTurma!D50=0,\"\",iniTurma!D50)","v":""},{"$f":"IF(iniTurma!E50=0,\"\",iniTurma!E50)","v":""}]
[48,null,{"$f":"IF(iniTurma!C51=0,\"\",iniTurma!C51)","v":""},{"$f":"IF(iniTurma!D51=0,\"\",iniTurma!D51)","v":""},{"$f":"IF(iniTurma!E51=0,\"\",iniTurma!E51)","v":""}]
[49,null,{"$f":"IF(iniTurma!C52=0,\"\",iniTurma!C52)","v":""},{"$f":"IF(iniTurma!D52=0,\"\",iniTurma!D52)","v":""},{"$f":"IF(iniTurma!E52=0,\"\",iniTurma!E52)","v":""}]
[50,null,{"$f":"IF(iniTurma!C53=0,\"\",iniTurma!C53)","v":""},{"$f":"IF(iniTurma!D53=0,\"\",iniTurma!D53)","v":""},{"$f":"IF(iniTurma!E53=0,\"\",iniTurma!E53)","v":""}]

{"sheet":"fimKTK","index":6,"n_rows":53,"n_cols":16,"rows_kept":53,"cut":false,"hidden":true,"merged":[]}
[null,"Ano:",{"$f":"IF(fimTurma!C1=0,\"\",fimTurma!C1)","v":3}]
[null,"Turma:",{"$f":"IF(fimTurma!C2=0,\"\",fimTurma!C2)","v":"B"}]
[{"$f":"fimTurma!B3","v":"Ver: 1"},"ID Aluno","Nome","Idade decimal","Idade KTK","Coluna Idade","TL_Cof","SL_Cof","EQ_Cof","SM_Cof","Soma_KTK","MQ_KTK","Nível_KTK","Percentil_KTK"]
[{"$f":"IF(fimTurma!B4<>\"\",fimTurma!B4,\"\")","v":""},{"$f":"fimTurma!A4","v":1},{"$f":"IF(fimTurma!C4=0,\"\",fimTurma!C4)","v":"Maria Adelaide"},{"$f":"IF(OR(fimTurma!E4=\"\",fimTurma!F4=\"\"),\"\",(fimTurma!F4-fimTurma!E4)/365.25)","v":7.3292265571526354},{"$f":"IF(OR(fimTurma!E4=\"\",fimTurma!F4=\"\"),\"\",fimTurma!F4-fimTurma!E4)","v":2677},{"$f":"IF(AND(E4>1000,E4<2192),2, IF(AND(E4>= 2192,E4<2557),3, IF(AND(E4>=2557,E4<2922),4, IF(AND(E4>=2922,E4<3287),5, IF(AND(E4>=3287,E4<3653),6, IF(AND(E4>=3653,E4<4018),7, IF(AND(E4>=4018,E4<4383),8, IF(AND(E4>=4383,E4<4748),9, IF(AND(E4>=4748,E4<5478),10,\"\") ) ) ) ) ) ) ) )","v":4},{"$f":"IF(OR(F4=\"\",fimTurma!G4=\"\"),\"\",VLOOKUP(fimTurma!G4,References!A$3:J$78,F4,0))","v":98},{"$f":"IF(OR(F4=\"\",fimTurma!H4=\"\"),\"\",IF(fimTurma!D4=\"Menino\",VLOOKUP(fimTurma!H4,References!A$103:J$208,F4,0),VLOOKUP(fimTurma!H4,References!A$303:J$413,F4,0)))","v":50},{"$f":"IF(OR(F4=\"\",fimTurma!I4=\"\"),\"\",VLOOKUP(fimTurma!I4,References!A$503:J$575,F4,0))","v":120},{"$f":"IF(OR(F4=\"\",fimTurma!J4=\"\"),\"\",IF(fimTurma!D4=\"Menino\",VLOOKUP(fimTurma!J4,References!A$603:J$681,F4,0),VLOOKUP(fimTurma!J4,References!A$803:J$881,F4,0)))","v":116},{"$f":"IF(OR(G4=\"\",OR(H4=\"\",OR(I4=\"\",J4=\"\"))),\"\",G4+H4+I4+J4)","v":384},{"$f":"IF(K4=\"\",\"\",VLOOKUP(K4,References!A$903:B$1362,2,))","v":95},{"$f":"IF(L4=\"\",\"\",IF(AND(40<=L4,L4<=70),\"Perturbação da coordenação\", IF(AND(71<=L4,L4<=85),\"Desempenho coordenativo insuficiente\", IF(AND(86<=L4,L4<=115),\"Desempenho coordenativo típico ou normal\", IF(AND(116<=L4,L4<=130),\"Bom desempenho coordenativo\", IF(AND(131<=L4,L4<=145),\"Elevado desempenho coordenativo\", \"\") ) ) )))","v":"Desempenho coordenativo típico ou normal"},{"$f":"IF(L4=\"\",\"\",VLOOKUP(L4,References!A$1403:B$1903,2,0))","v":36},{"$f":"IF(L4=\"\",\"\",IF(AND(40<=L4,L4<=70),\"Perturbação da\", IF(AND(71<=L4,L4<=85),\"Desempenho\", IF(AND(86<=L4,L4<=115),\"Desempenho\", IF(AND(116<=L4,L4<=130),\"Bom desempenho\", IF(AND(131<=L4,L4<=145),\"Elevado\", \"\") ) ) )))","v":"Desempenho"},{"$f":"IF(L4=\"\",\"\",IF(AND(40<=L4,L4<=70),\"coordenação\", IF(AND(71<=L4,L4<=85),\"insuficiente\", IF(AND(86<=L4,L4<=115),\"típico ou normal\", IF(AND(116<=L4,L4<=130),\"coordenativo\", IF(AND(131<=L4,L4<=145),\"desempenho\", \"\") ) ) )))","v":"típico ou normal"}]
[{"$f":"IF(fimTurma!B5<>\"\",fimTurma!B5,\"\")","v":""},{"$f":"fimTurma!A5","v":2},{"$f":"IF(fimTurma!C5=0,\"\",fimTurma!C5)","v":"Manuel Silva"},{"$f":"IF(OR(fimTurma!E5=\"\",fimTurma!F5=\"\"),\"\",(fimTurma!F5-fimTurma!E5)/365.25)","v":7.3292265571526354},{"$f":"IF(OR(fimTurma!E5=\"\",fimTurma!F5=\"\"),\"\",fimTurma!F5-fimTurma!E5)","v":2677},{"$f":"IF(AND(E5>1000,E5<2192),2, IF(AND(E5>= 2192,E5<2557),3, IF(AND(E5>=2557,E5<2922),4, IF(AND(E5>=2922,E5<3287),5, IF(AND(E5>=3287,E5<3653),6, IF(AND(E5>=3653,E5<4018),7, IF(AND(E5>=4018,E5<4383),8, IF(AND(E5>=4383,E5<4748),9, IF(AND(E5>=4748,E5<5478),10,\"\") ) ) ) ) ) ) ) )","v":4},{"$f":"IF(OR(F5=\"\",fimTurma!G5=\"\"),\"\",VLOOKUP(fimTurma!G5,References!A$3:J$78,F5,0))","v":91},{"$f":"IF(OR(F5=\"\",fimTurma!H5=\"\"),\"\",IF(fimTurma!D5=\"Menino\",VLOOKUP(fimTurma!H5,References!A$103:J$208,F5,0),VLOOKUP(fimTurma!H5,References!A$303:J$413,F5,0)))","v":116},{"$f":"IF(OR(F5=\"\",fimTurma!I5=\"\"),\"\",VLOOKUP(fimTurma!I5,References!A$503:J$575,F5,0))","v":110},{"$f":"IF(OR(F5=\"\",fimTurma!J5=\"\"),\"\",IF(fimTurma!D5=\"Menino\",VLOOKUP(fimTurma!J5,References!A$603:J$681,F5,0),VLOOKUP(fimTurma!J5,References!A$803:J$881,F5,0)))","v":128},{"$f":"IF(OR(G5=\"\",OR(H5=\"\",OR(I5=\"\",J5=\"\"))),\"\",G5+H5+I5+J5)","v":445},{"$f":"IF(K5=\"\",\"\",VLOOKUP(K5,References!A$903:B$1362,2,))","v":114},{"$f":"IF(L5=\"\",\"\",IF(AND(40<=L5,L5<=70),\"Perturbação da coordenação\", IF(AND(71<=L5,L5<=85),\"Desempenho coordenativo insuficiente\", IF(AND(86<=L5,L5<=115),\"Desempenho coordenativo típico ou normal\", IF(AND(116<=L5,L5<=130),\"Bom desempenho coordenativo\", IF(AND(131<=L5,L5<=145),\"Elevado desempenho coordenativo\", \"\") ) ) )))","v":"Desempenho coordenativo típico ou normal"},{"$f":"IF(L5=\"\",\"\",VLOOKUP(L5,References!A$1403:B$1903,2,0))","v":82},{"$f":"IF(L5=\"\",\"\",IF(AND(40<=L5,L5<=70),\"Perturbação da\", IF(AND(71<=L5,L5<=85),\"Desempenho\", IF(AND(86<=L5,L5<=115),\"Desempenho\", IF(AND(116<=L5,L5<=130),\"Bom desempenho\", IF(AND(131<=L5,L5<=145),\"Elevado\", \"\") ) ) )))","v":"Desempenho"},{"$f":"IF(L5=\"\",\"\",IF(AND(40<=L5,L5<=70),\"coordenação\", IF(AND(71<=L5,L5<=85),\"insuficiente\", IF(AND(86<=L5,L5<=115),\"típico ou normal\", IF(AND(116<=L5,L5<=130),\"coordenativo\", IF(AND(131<=L5,L5<=145),\"desempenho\", \"\") ) ) )))","v":"típico ou normal"}]
[{"$f":"IF(fimTurma!B6<>\"\",fimTurma!B6,\"\")","v":""},{"$f":"fimTurma!A6","v":3},{"$f":"IF(fimTurma!C6=0,\"\",fimTurma!C6)","v":"Pedro Silva"},{"$f":"IF(OR(fimTurma!E6=\"\",fimTurma!F6=\"\"),\"\",(fimTurma!F6-fimTurma!E6)/365.25)","v":7.4715947980835047},{"$f":"IF(OR(fimTurma!E6=\"\",fimTurma!F6=\"\"),\"\",fimTurma!F6-fimTurma!E6)","v":2729},4,{"$f":"IF(OR(F6=\"\",fimTurma!G6=\"\"),\"\",VLOOKUP(fimTurma!G6,References!A$3:J$78,F6,0))","v":93},{"$f":"IF(OR(F6=\"\",fimTurma!H6=\"\"),\"\",IF(fimTurma!D6=\"Menino\",VLOOKUP(fimTurma!H6,References!A$103:J$208,F6,0),VLOOKUP(fimTurma!H6,References!A$303:J$413,F6,0)))","v":111},{"$f":"IF(OR(F6=\"\",fimTurma!I6=\"\"),\"\",VLOOKUP(fimTurma!I6,References!A$503:J$575,F6,0))","v":126},{"$f":"IF(OR(F6=\"\",fimTurma!J6=\"\"),\"\",IF(fimTurma!D6=\"Menino\",VLOOKUP(fimTurma!J6,References!A$603:J$681,F6,0),VLOOKUP(fimTurma!J6,References!A$803:J$881,F6,0)))","v":123},453,{"$f":"IF(K6=\"\",\"\",VLOOKUP(K6,References!A$903:B$1362,2,))","v":117},"Bom desempenho coordenativo",{"$f":"IF(L6=\"\",\"\",VLOOKUP(L6,References!A$1403:B$1903,2,0))","v":87},"Bom desempenho","coordenativo"]
[{"$f":"IF(fimTurma!B7<>\"\",fimTurma!B7,\"\")","v":""},{"$f":"fimTurma!A7","v":4},{"$f":"IF(fimTurma!C7=0,\"\",fimTurma!C7)","v":"António Ferreira"},{"$f":"IF(OR(fimTurma!E7=\"\",fimTurma!F7=\"\"),\"\",(fimTurma!F7-fimTurma!E7)/365.25)","v":6.7186858316221763},{"$f":"IF(OR(fimTurma!E7=\"\",fimTurma!F7=\"\"),\"\",fimTurma!F7-fimTurma!E7)","v":2454},3,{"$f":"IF(OR(F7=\"\",fimTurma!G7=\"\"),\"\",VLOOKUP(fimTurma!G7,References!A$3:J$78,F7,0))","v":""},{"$f":"IF(OR(F7=\"\",fimTurma!H7=\"\"),\"\",IF(fimTurma!D7=\"Menino\",VLOOKUP(fimTurma!H7,References!A$103:J$208,F7,0),VLOOKUP(fimTurma!H7,References!A$303:J$413,F7,0)))","v":89},{"$f":"IF(OR(F7=\"\",fimTurma!I7=\"\"),\"\",VLOOKUP(fimTurma!I7,References!A$503:J$575,F7,0))","v":124},{"$f":"IF(OR(F7=\"\",fimTurma!J7=\"\"),\"\",IF(fimTurma!D7=\"Menino\",VLOOKUP(fimTurma!J7,References!A$603:J$681,F7,0),VLOOKUP(fimTurma!J7,References!A$803:J$881,F7,0)))","v":135},"",{"$f":"IF(K7=\"\",\"\",VLOOKUP(K7,References!A$903:B$1362,2,))","v":""},"",{"$f":"IF(L7=\"\",\"\",VLOOKUP(L7,References!A$1403:B$1903,2,0))","v":""},"",""]
[{"$f":"IF(fimTurma!B8<>\"\",fimTurma!B8,\"\")","v":"x"},{"$f":"fimTurma!A8","v":5},{"$f":"IF(fimTurma!C8=0,\"\",fimTurma!C8)","v":"Teresa Martinho"},{"$f":"IF(OR(fimTurma!E8=\"\",fimTurma!F8=\"\"),\"\",(fimTurma!F8-fimTurma!E8)/365.25)","v":10.086242299794661},{"$f":"IF(OR(fimTurma!E8=\"\",fimTurma!F8=\"\"),\"\",fimTurma!F8-fimTurma!E8)","v":3684},7,{"$f":"IF(OR(F8=\"\",fimTurma!G8=\"\"),\"\",VLOOKUP(fimTurma!G8,References!A$3:J$78,F8,0))","v":107},{"$f":"IF(OR(F8=\"\",fimTurma!H8=\"\"),\"\",IF(fimTurma!D8=\"Menino\",VLOOKUP(fimTurma!H8,References!A$103:J$208,F8,0),VLOOKUP(fimTurma!H8,References!A$303:J$413,F8,0)))","v":110},{"$f":"IF(OR(F8=\"\",fimTurma!I8=\"\"),\"\",VLOOKUP(fimTurma!I8,References!A$503:J$575,F8,0))","v":118},{"$f":"IF(OR(F8=\"\",fimTurma!J8=\"\"),\"\",IF(fimTurma!D8=\"Menino\",VLOOKUP(fimTurma!J8,References!A$603:J$681,F8,0),VLOOKUP(fimTurma!J8,References!A$803:J$881,F8,0)))","v":95},430,{"$f":"IF(K8=\"\",\"\",VLOOKUP(K8,References!A$903:B$1362,2,))","v":110},"Desempenho coordenativo típico ou normal",{"$f":"IF(L8=\"\",\"\",VLOOKUP(L8,References!A$1403:B$1903,2,0))","v":75},"Desempenho","típico ou normal"]
[{"$f":"IF(fimTurma!B9<>\"\",fimTurma!B9,\"\")","v":""},{"$f":"fimTurma!A9","v":6},{"$f":"IF(fimTurma!C9=0,\"\",fimTurma!C9)","v":""},{"$f":"IF(OR(fimTurma!E9=\"\",fimTurma!F9=\"\"),\"\",(fimTurma!F9-fimTurma!E9)/365.25)","v":""},{"$f":"IF(OR(fimTurma!E9=\"\",fimTurma!F9=\"\"),\"\",fimTurma!F9-fimTurma!E9)","v":""},"",{"$f":"IF(OR(F9=\"\",fimTurma!G9=\"\"),\"\",VLOOKUP(fimTurma!G9,References!A$3:J$78,F9,0))","v":""},{"$f":"IF(OR(F9=\"\",fimTurma!H9=\"\"),\"\",IF(fimTurma!D9=\"Menino\",VLOOKUP(fimTurma!H9,References!A$103:J$208,F9,0),VLOOKUP(fimTurma!H9,References!A$303:J$413,F9,0)))","v":""},{"$f":"IF(OR(F9=\"\",fimTurma!I9=\"\"),\"\",VLOOKUP(fimTurma!I9,References!A$503:J$575,F9,0))","v":""},{"$f":"IF(OR(F9=\"\",fimTurma!J9=\"\"),\"\",IF(fimTurma!D9=\"Menino\",VLOOKUP(fimTurma!J9,References!A$603:J$681,F9,0),VLOOKUP(fimTurma!J9,References!A$803:J$881,F9,0)))","v":""},"",{"$f":"IF(K9=\"\",\"\",VLOOKUP(K9,References!A$903:B$1362,2,))","v":""},"",{"$f":"IF(L9=\"\",\"\",VLOOKUP(L9,References!A$1403:B$1903,2,0))","v":""},"",""]
[{"$f":"IF(fimTurma!B10<>\"\",fimTurma!B10,\"\")","v":""},{"$f":"fimTurma!A10","v":7},{"$f":"IF(fimTurma!C10=0,\"\",fimTurma!C10)","v":""},{"$f":"IF(OR(fimTurma!E10=\"\",fimTurma!F10=\"\"),\"\",(fimTurma!F10-fimTurma!E10)/365.25)","v":""},{"$f":"IF(OR(fimTurma!E10=\"\",fimTurma!F10=\"\"),\"\",fimTurma!F10-fimTurma!E10)","v":""},"",{"$f":"IF(OR(F10=\"\",fimTurma!G10=\"\"),\"\",VLOOKUP(fimTurma!G10,References!A$3:J$78,F10,0))","v":""},{"$f":"IF(OR(F10=\"\",fimTurma!H10=\"\"),\"\",IF(fimTurma!D10=\"Menino\",VLOOKUP(fimTurma!H10,References!A$103:J$208,F10,0),VLOOKUP(fimTurma!H10,References!A$303:J$413,F10,0)))","v":""},{"$f":"IF(OR(F10=\"\",fimTurma!I10=\"\"),\"\",VLOOKUP(fimTurma!I10,References!A$503:J$575,F10,0))","v":""},{"$f":"IF(OR(F10=\"\",fimTurma!J10=\"\"),\"\",IF(fimTurma!D10=\"Menino\",VLOOKUP(fimTurma!J10,References!A$603:J$681,F10,0),VLOOKUP(fimTurma!J10,References!A$803:J$881,F10,0)))","v":""},"",{"$f":"IF(K10=\"\",\"\",VLOOKUP(K10,References!A$903:B$1362,2,))","v":""},"",{"$f":"IF(L10=\"\",\"\",VLOOKUP(L10,References!A$1403:B$1903,2,0))","v":""},"",""]
[{"$f":"IF(fimTurma!B11<>\"\",fimTurma!B11,\"\")","v":""},{"$f":"fimTurma!A11","v":8},{"$f":"IF(fimTurma!C11=0,\"\",fimTurma!C11)","v":""},{"$f":"IF(OR(fimTurma!E11=\"\",fimTurma!F11=\"\"),\"\",(fimTurma!F11-fimTurma!E11)/365.25)","v":""},{"$f":"IF(OR(fimTurma!E11=\"\",fimTurma!F11=\"\"),\"\",fimTurma!F11-fimTurma!E11)","v":""},"",{"$f":"IF(OR(F11=\"\",fimTurma!G11=\"\"),\"\",VLOOKUP(fimTurma!G11,References!A$3:J$78,F11,0))","v":""},{"$f":"IF(OR(F11=\"\",fimTurma!H11=\"\"),\"\",IF(fimTurma!D11=\"Menino\",VLOOKUP(fimTurma!H11,References!A$103:J$208,F11,0),VLOOKUP(fimTurma!H11,References!A$303:J$413,F11,0)))","v":""},{"$f":"IF(OR(F11=\"\",fimTurma!I11=\"\"),\"\",VLOOKUP(fimTurma!I11,References!A$503:J$575,F11,0))","v":""},{"$f":"IF(OR(F11=\"\",fimTurma!J11=\"\"),\"\",IF(fimTurma!D11=\"Menino\",VLOOKUP(fimTurma!J11,References!A$603:J$681,F11,0),VLOOKUP(fimTurma!J11,References!A$803:J$881,F11,0)))","v":""},"",{"$f":"IF(K11=\"\",\"\",VLOOKUP(K11,References!A$903:B$1362,2,))","v":""},"",{"$f":"IF(L11=\"\",\"\",VLOOKUP(L11,References!A$1403:B$1903,2,0))","v":""},"",""]
[{"$f":"IF(fimTurma!B12<>\"\",fimTurma!B12,\"\")","v":""},{"$f":"fimTurma!A12","v":9},{"$f":"IF(fimTurma!C12=0,\"\",fimTurma!C12)","v":""},{"$f":"IF(OR(fimTurma!E12=\"\",fimTurma!F12=\"\"),\"\",(fimTurma!F12-fimTurma!E12)/365.25)","v":""},{"$f":"IF(OR(fimTurma!E12=\"\",fimTurma!F12=\"\"),\"\",fimTurma!F12-fimTurma!E12)","v":""},"",{"$f":"IF(OR(F12=\"\",fimTurma!G12=\"\"),\"\",VLOOKUP(fimTurma!G12,References!A$3:J$78,F12,0))","v":""},{"$f":"IF(OR(F12=\"\",fimTurma!H12=\"\"),\"\",IF(fimTurma!D12=\"Menino\",VLOOKUP(fimTurma!H12,References!A$103:J$208,F12,0),VLOOKUP(fimTurma!H12,References!A$303:J$413,F12,0)))","v":""},{"$f":"IF(OR(F12=\"\",fimTurma!I12=\"\"),\"\",VLOOKUP(fimTurma!I12,References!A$503:J$575,F12,0))","v":""},{"$f":"IF(OR(F12=\"\",fimTurma!J12=\"\"),\"\",IF(fimTurma!D12=\"Menino\",VLOOKUP(fimTurma!J12,References!A$603:J$681,F12,0),VLOOKUP(fimTurma!J12,References!A$803:J$881,F12,0)))","v":""},"",{"$f":"IF(K12=\"\",\"\",VLOOKUP(K12,References!A$903:B$1362,2,))","v":""},"",{"$f":"IF(L12=\"\",\"\",VLOOKUP(L12,References!A$1403:B$1903,2,0))","v":""},"",""]
[{"$f":"IF(fimTurma!B13<>\"\",fimTurma!B13,\"\")","v":""},{"$f":"fimTurma!A13","v":10},{"$f":"IF(fimTurma!C13=0,\"\",fimTurma!C13)","v":""},{"$f":"IF(OR(fimTurma!E13=\"\",fimTurma!F13=\"\"),\"\",(fimTurma!F13-fimTurma!E13)/365.25)","v":""},{"$f":"IF(OR(fimTurma!E13=\"\",fimTurma!F13=\"\"),\"\",fimTurma!F13-fimTurma!E13)","v":""},"",{"$f":"IF(OR(F13=\"\",fimTurma!G13=\"\"),\"\",VLOOKUP(fimTurma!G13,References!A$3:J$78,F13,0))","v":""},{"$f":"IF(OR(F13=\"\",fimTurma!H13=\"\"),\"\",IF(fimTurma!D13=\"Menino\",VLOOKUP(fimTurma!H13,References!A$103:J$208,F13,0),VLOOKUP(fimTurma!H13,References!A$303:J$413,F13,0)))","v":""},{"$f":"IF(OR(F13=\"\",fimTurma!I13=\"\"),\"\",VLOOKUP(fimTurma!I13,References!A$503:J$575,F13,0))","v":""},{"$f":"IF(OR(F13=\"\",fimTurma!J13=\"\"),\"\",IF(fimTurma!D13=\"Menino\",VLOOKUP(fimTurma!J13,References!A$603:J$681,F13,0),VLOOKUP(fimTurma!J13,References!A$803:J$881,F13,0)))","v":""},"",{"$f":"IF(K13=\"\",\"\",VLOOKUP(K13,References!A$903:B$1362,2,))","v":""},"",{"$f":"IF(L13=\"\",\"\",VLOOKUP(L13,References!A$1403:B$1903,2,0))","v":""},"",""]
[{"$f":"IF(fimTurma!B14<>\"\",fimTurma!B14,\"\")","v":""},{"$f":"fimTurma!A14","v":11},{"$f":"IF(fimTurma!C14=0,\"\",fimTurma!C14)","v":""},{"$f":"IF(OR(fimTurma!E14=\"\",fimTurma!F14=\"\"),\"\",(fimTurma!F14-fimTurma!E14)/365.25)","v":""},{"$f":"IF(OR(fimTurma!E14=\"\",fimTurma!F14=\"\"),\"\",fimTurma!F14-fimTurma!E14)","v":""},"",{"$f":"IF(OR(F14=\"\",fimTurma!G14=\"\"),\"\",VLOOKUP(fimTurma!G14,References!A$3:J$78,F14,0))","v":""},{"$f":"IF(OR(F14=\"\",fimTurma!H14=\"\"),\"\",IF(fimTurma!D14=\"Menino\",VLOOKUP(fimTurma!H14,References!A$103:J$208,F14,0),VLOOKUP(fimTurma!H14,References!A$303:J$413,F14,0)))","v":""},{"$f":"IF(OR(F14=\"\",fimTurma!I14=\"\"),\"\",VLOOKUP(fimTurma!I14,References!A$503:J$575,F14,0))","v":""},{"$f":"IF(OR(F14=\"\",fimTurma!J14=\"\"),\"\",IF(fimTurma!D14=\"Menino\",VLOOKUP(fimTurma!J14,References!A$603:J$681,F14,0),VLOOKUP(fimTurma!J14,References!A$803:J$881,F14,0)))","v":""},"",{"$f":"IF(K14=\"\",\"\",VLOOKUP(K14,References!A$903:B$1362,2,))","v":""},"",{"$f":"IF(L14=\"\",\"\",VLOOKUP(L14,References!A$1403:B$1903,2,0))","v":""},"",""]
[{"$f":"IF(fimTurma!B15<>\"\",fimTurma!B15,\"\")","v":""},{"$f":"fimTurma!A15","v":12},{"$f":"IF(fimTurma!C15=0,\"\",fimTurma!C15)","v":""},{"$f":"IF(OR(fimTurma!E15=\"\",fimTurma!F15=\"\"),\"\",(fimTurma!F15-fimTurma!E15)/365.25)","v":""},{"$f":"IF(OR(fimTurma!E15=\"\",fimTurma!F15=\"\"),\"\",fimTurma!F15-fimTurma!E15)","v":""},"",{"$f":"IF(OR(F15=\"\",fimTurma!G15=\"\"),\"\",VLOOKUP(fimTurma!G15,References!A$3:J$78,F15,0))","v":""},{"$f":"IF(OR(F15=\"\",fimTurma!H15=\"\"),\"\",IF(fimTurma!D15=\"Menino\",VLOOKUP(fimTurma!H15,References!A$103:J$208,F15,0),VLOOKUP(fimTurma!H15,References!A$303:J$413,F15,0)))","v":""},{"$f":"IF(OR(F15=\"\",fimTurma!I15=\"\"),\"\",VLOOKUP(fimTurma!I15,References!A$503:J$575,F15,0))","v":""},{"$f":"IF(OR(F15=\"\",fimTurma!J15=\"\"),\"\",IF(fimTurma!D15=\"Menino\",VLOOKUP(fimTurma!J15,References!A$603:J$681,F15,0),VLOOKUP(fimTurma!J15,References!A$803:J$881,F15,0)))","v":""},"",{"$f":"IF(K15=\"\",\"\",VLOOKUP(K15,References!A$903:B$1362,2,))","v":""},"",{"$f":"IF(L15=\"\",\"\",VLOOKUP(L15,References!A$1403:B$1903,2,0))","v":""},"",""]
[{"$f":"IF(fimTurma!B16<>\"\",fimTurma!B16,\"\")","v":""},{"$f":"fimTurma!A16","v":13},{"$f":"IF(fimTurma!C16=0,\"\",fimTurma!C16)","v":""},{"$f":"IF(OR(fimTurma!E16=\"\",fimTurma!F16=\"\"),\"\",(fimTurma!F16-fimTurma!E16)/365.25)","v":""},{"$f":"IF(OR(fimTurma!E16=\"\",fimTurma!F16=\"\"),\"\",fimTurma!F16-fimTurma!E16)","v":""},"",{"$f":"IF(OR(F16=\"\",fimTurma!G16=\"\"),\"\",VLOOKUP(fimTurma!G16,References!A$3:J$78,F16,0))","v":""},{"$f":"IF(OR(F16=\"\",fimTurma!H16=\"\"),\"\",IF(fimTurma!D16=\"Menino\",VLOOKUP(fimTurma!H16,References!A$103:J$208,F16,0),VLOOKUP(fimTurma!H16,References!A$303:J$413,F16,0)))","v":""},{"$f":"IF(OR(F16=\"\",fimTurma!I16=\"\"),\"\",VLOOKUP(fimTurma!I16,References!A$503:J$575,F16,0))","v":""},{"$f":"IF(OR(F16=\"\",fimTurma!J16=\"\"),\"\",IF(fimTurma!D16=\"Menino\",VLOOKUP(fimTurma!J16,References!A$603:J$681,F16,0),VLOOKUP(fimTurma!J16,References!A$803:J$881,F16,0)))","v":""},"",{"$f":"IF(K16=\"\",\"\",VLOOKUP(K16,References!A$903:B$1362,2,))","v":""},"",{"$f":"IF(L16=\"\",\"\",VLOOKUP(L16,References!A$1403:B$1903,2,0))","v":""},"",""]
[{"$f":"IF(fimTurma!B17<>\"\",fimTurma!B17,\"\")","v":""},{"$f":"fimTurma!A17","v":14},{"$f":"IF(fimTurma!C17=0,\"\",fimTurma!C17)","v":""},{"$f":"IF(OR(fimTurma!E17=\"\",fimTurma!F17=\"\"),\"\",(fimTurma!F17-fimTurma!E17)/365.25)","v":""},{"$f":"IF(OR(fimTurma!E17=\"\",fimTurma!F17=\"\"),\"\",fimTurma!F17-fimTurma!E17)","v":""},"",{"$f":"IF(OR(F17=\"\",fimTurma!G17=\"\"),\"\",VLOOKUP(fimTurma!G17,References!A$3:J$78,F17,0))","v":""},{"$f":"IF(OR(F17=\"\",fimTurma!H17=\"\"),\"\",IF(fimTurma!D17=\"Menino\",VLOOKUP(fimTurma!H17,References!A$103:J$208,F17,0),VLOOKUP(fimTurma!H17,References!A$303:J$413,F17,0)))","v":""},{"$f":"IF(OR(F17=\"\",fimTurma!I17=\"\"),\"\",VLOOKUP(fimTurma!I17,References!A$503:J$575,F17,0))","v":""},{"$f":"IF(OR(F17=\"\",fimTurma!J17=\"\"),\"\",IF(fimTurma!D17=\"Menino\",VLOOKUP(fimTurma!J17,References!A$603:J$681,F17,0),VLOOKUP(fimTurma!J17,References!A$803:J$881,F17,0)))","v":""},"",{"$f":"IF(K17=\"\",\"\",VLOOKUP(K17,References!A$903:B$1362,2,))","v":""},"",{"$f":"IF(L17=\"\",\"\",VLOOKUP(L17,References!A$1403:B$1903,2,0))","v":""},"",""]
[{"$f":"IF(fimTurma!B18<>\"\",fimTurma!B18,\"\")","v":""},{"$f":"fimTurma!A18","v":15},{"$f":"IF(fimTurma!C18=0,\"\",fimTurma!C18)","v":""},{"$f":"IF(OR(fimTurma!E18=\"\",fimTurma!F18=\"\"),\"\",(fimTurma!F18-fimTurma!E18)/365.25)","v":""},{"$f":"IF(OR(fimTurma!E18=\"\",fimTurma!F18=\"\"),\"\",fimTurma!F18-fimTurma!E18)","v":""},"",{"$f":"IF(OR(F18=\"\",fimTurma!G18=\"\"),\"\",VLOOKUP(fimTurma!G18,References!A$3:J$78,F18,0))","v":""},{"$f":"IF(OR(F18=\"\",fimTurma!H18=\"\"),\"\",IF(fimTurma!D18=\"Menino\",VLOOKUP(fimTurma!H18,References!A$103:J$208,F18,0),VLOOKUP(fimTurma!H18,References!A$303:J$413,F18,0)))","v":""},{"$f":"IF(OR(F18=\"\",fimTurma!I18=\"\"),\"\",VLOOKUP(fimTurma!I18,References!A$503:J$575,F18,0))","v":""},{"$f":"IF(OR(F18=\"\",fimTurma!J18=\"\"),\"\",IF(fimTurma!D18=\"Menino\",VLOOKUP(fimTurma!J18,References!A$603:J$681,F18,0),VLOOKUP(fimTurma!J18,References!A$803:J$881,F18,0)))","v":""},"",{"$f":"IF(K18=\"\",\"\",VLOOKUP(K18,References!A$903:B$1362,2,))","v":""},"",{"$f":"IF(L18=\"\",\"\",VLOOKUP(L18,References!A$1403:B$1903,2,0))","v":""},"",""]
[{"$f":"IF(fimTurma!B19<>\"\",fimTurma!B19,\"\")","v":""},{"$f":"fimTurma!A19","v":16},{"$f":"IF(fimTurma!C19=0,\"\",fimTurma!C19)","v":""},{"$f":"IF(OR(fimTurma!E19=\"\",fimTurma!F19=\"\"),\"\",(fimTurma!F19-fimTurma!E19)/365.25)","v":""},{"$f":"IF(OR(fimTurma!E19=\"\",fimTurma!F19=\"\"),\"\",fimTurma!F19-fimTurma!E19)","v":""},"",{"$f":"IF(OR(F19=\"\",fimTurma!G19=\"\"),\"\",VLOOKUP(fimTurma!G19,References!A$3:J$78,F19,0))","v":""},{"$f":"IF(OR(F19=\"\",fimTurma!H19=\"\"),\"\",IF(fimTurma!D19=\"Menino\",VLOOKUP(fimTurma!H19,References!A$103:J$208,F19,0),VLOOKUP(fimTurma!H19,References!A$303:J$413,F19,0)))","v":""},{"$f":"IF(OR(F19=\"\",fimTurma!I19=\"\"),\"\",VLOOKUP(fimTurma!I19,References!A$503:J$575,F19,0))","v":""},{"$f":"IF(OR(F19=\"\",fimTurma!J19=\"\"),\"\",IF(fimTurma!D19=\"Menino\",VLOOKUP(fimTurma!J19,References!A$603:J$681,F19,0),VLOOKUP(fimTurma!J19,References!A$803:J$881,F19,0)))","v":""},"",{"$f":"IF(K19=\"\",\"\",VLOOKUP(K19,References!A$903:B$1362,2,))","v":""},"",{"$f":"IF(L19=\"\",\"\",VLOOKUP(L19,References!A$1403:B$1903,2,0))","v":""},"",""]
[{"$f":"IF(fimTurma!B20<>\"\",fimTurma!B20,\"\")","v":""},{"$f":"fimTurma!A20","v":17},{"$f":"IF(fimTurma!C20=0,\"\",fimTurma!C20)","v":""},{"$f":"IF(OR(fimTurma!E20=\"\",fimTurma!F20=\"\"),\"\",(fimTurma!F20-fimTurma!E20)/365.25)","v":""},{"$f":"IF(OR(fimTurma!E20=\"\",fimTurma!F20=\"\"),\"\",fimTurma!F20-fimTurma!E20)","v":""},"",{"$f":"IF(OR(F20=\"\",fimTurma!G20=\"\"),\"\",VLOOKUP(fimTurma!G20,References!A$3:J$78,F20,0))","v":""},{"$f":"IF(OR(F20=\"\",fimTurma!H20=\"\"),\"\",IF(fimTurma!D20=\"Menino\",VLOOKUP(fimTurma!H20,References!A$103:J$208,F20,0),VLOOKUP(fimTurma!H20,References!A$303:J$413,F20,0)))","v":""},{"$f":"IF(OR(F20=\"\",fimTurma!I20=\"\"),\"\",VLOOKUP(fimTurma!I20,References!A$503:J$575,F20,0))","v":""},{"$f":"IF(OR(F20=\"\",fimTurma!J20=\"\"),\"\",IF(fimTurma!D20=\"Menino\",VLOOKUP(fimTurma!J20,References!A$603:J$681,F20,0),VLOOKUP(fimTurma!J20,References!A$803:J$881,F20,0)))","v":""},"",{"$f":"IF(K20=\"\",\"\",VLOOKUP(K20,References!A$903:B$1362,2,))","v":""},"",{"$f":"IF(L20=\"\",\"\",VLOOKUP(L20,References!A$1403:B$1903,2,0))","v":""},"",""]
[{"$f":"IF(fimTurma!B21<>\"\",fimTurma!B21,\"\")","v":""},{"$f":"fimTurma!A21","v":18},{"$f":"IF(fimTurma!C21=0,\"\",fimTurma!C21)","v":""},{"$f":"IF(OR(fimTurma!E21=\"\",fimTurma!F21=\"\"),\"\",(fimTurma!F21-fimTurma!E21)/365.25)","v":""},{"$f":"IF(OR(fimTurma!E21=\"\",fimTurma!F21=\"\"),\"\",fimTurma!F21-fimTurma!E21)","v":""},"",{"$f":"IF(OR(F21=\"\",fimTurma!G21=\"\"),\"\",VLOOKUP(fimTurma!G21,References!A$3:J$78,F21,0))","v":""},{"$f":"IF(OR(F21=\"\",fimTurma!H21=\"\"),\"\",IF(fimTurma!D21=\"Menino\",VLOOKUP(fimTurma!H21,References!A$103:J$208,F21,0),VLOOKUP(fimTurma!H21,References!A$303:J$413,F21,0)))","v":""},{"$f":"IF(OR(F21=\"\",fimTurma!I21=\"\"),\"\",VLOOKUP(fimTurma!I21,References!A$503:J$575,F21,0))","v":""},{"$f":"IF(OR(F21=\"\",fimTurma!J21=\"\"),\"\",IF(fimTurma!D21=\"Menino\",VLOOKUP(fimTurma!J21,References!A$603:J$681,F21,0),VLOOKUP(fimTurma!J21,References!A$803:J$881,F21,0)))","v":""},"",{"$f":"IF(K21=\"\",\"\",VLOOKUP(K21,References!A$903:B$1362,2,))","v":""},"",{"$f":"IF(L21=\"\",\"\",VLOOKUP(L21,References!A$1403:B$1903,2,0))","v":""},"",""]
[{"$f":"IF(fimTurma!B22<>\"\",fimTurma!B22,\"\")","v":""},{"$f":"fimTurma!A22","v":19},{"$f":"IF(fimTurma!C22=0,\"\",fimTurma!C22)","v":""},{"$f":"IF(OR(fimTurma!E22=\"\",fimTurma!F22=\"\"),\"\",(fimTurma!F22-fimTurma!E22)/365.25)","v":""},{"$f":"IF(OR(fimTurma!E22=\"\",fimTurma!F22=\"\"),\"\",fimTurma!F22-fimTurma!E22)","v":""},"",{"$f":"IF(OR(F22=\"\",fimTurma!G22=\"\"),\"\",VLOOKUP(fimTurma!G22,References!A$3:J$78,F22,0))","v":""},{"$f":"IF(OR(F22=\"\",fimTurma!H22=\"\"),\"\",IF(fimTurma!D22=\"Menino\",VLOOKUP(fimTurma!H22,References!A$103:J$208,F22,0),VLOOKUP(fimTurma!H22,References!A$303:J$413,F22,0)))","v":""},{"$f":"IF(OR(F22=\"\",fimTurma!I22=\"\"),\"\",VLOOKUP(fimTurma!I22,References!A$503:J$575,F22,0))","v":""},{"$f":"IF(OR(F22=\"\",fimTurma!J22=\"\"),\"\",IF(fimTurma!D22=\"Menino\",VLOOKUP(fimTurma!J22,References!A$603:J$681,F22,0),VLOOKUP(fimTurma!J22,References!A$803:J$881,F22,0)))","v":""},"",{"$f":"IF(K22=\"\",\"\",VLOOKUP(K22,References!A$903:B$1362,2,))","v":""},"",{"$f":"IF(L22=\"\",\"\",VLOOKUP(L22,References!A$1403:B$1903,2,0))","v":""},"",""]
[{"$f":"IF(fimTurma!B23<>\"\",fimTurma!B23,\"\")","v":""},{"$f":"fimTurma!A23","v":20},{"$f":"IF(fimTurma!C23=0,\"\",fimTurma!C23)","v":""},{"$f":"IF(OR(fimTurma!E23=\"\",fimTurma!F23=\"\"),\"\",(fimTurma!F23-fimTurma!E23)/365.25)","v":""},{"$f":"IF(OR(fimTurma!E23=\"\",fimTurma!F23=\"\"),\"\",fimTurma!F23-fimTurma!E23)","v":""},"",{"$f":"IF(OR(F23=\"\",fimTurma!G23=\"\"),\"\",VLOOKUP(fimTurma!G23,References!A$3:J$78,F23,0))","v":""},{"$f":"IF(OR(F23=\"\",fimTurma!H23=\"\"),\"\",IF(fimTurma!D23=\"Menino\",VLOOKUP(fimTurma!H23,References!A$103:J$208,F23,0),VLOOKUP(fimTurma!H23,References!A$303:J$413,F23,0)))","v":""},{"$f":"IF(OR(F23=\"\",fimTurma!I23=\"\"),\"\",VLOOKUP(fimTurma!I23,References!A$503:J$575,F23,0))","v":""},{"$f":"IF(OR(F23=\"\",fimTurma!J23=\"\"),\"\",IF(fimTurma!D23=\"Menino\",VLOOKUP(fimTurma!J23,References!A$603:J$681,F23,0),VLOOKUP(fimTurma!J23,References!A$803:J$881,F23,0)))","v":""},"",{"$f":"IF(K23=\"\",\"\",VLOOKUP(K23,References!A$903:B$1362,2,))","v":""},"",{"$f":"IF(L23=\"\",\"\",VLOOKUP(L23,References!A$1403:B$1903,2,0))","v":""},"",""]
[{"$f":"IF(fimTurma!B24<>\"\",fimTurma!B24,\"\")","v":""},{"$f":"fimTurma!A24","v":21},{"$f":"IF(fimTurma!C24=0,\"\",fimTurma!C24)","v":""},{"$f":"IF(OR(fimTurma!E24=\"\",fimTurma!F24=\"\"),\"\",(fimTurma!F24-fimTurma!E24)/365.25)","v":""},{"$f":"IF(OR(fimTurma!E24=\"\",fimTurma!F24=\"\"),\"\",fimTurma!F24-fimTurma!E24)","v":""},"",{"$f":"IF(OR(F24=\"\",fimTurma!G24=\"\"),\"\",VLOOKUP(fimTurma!G24,References!A$3:J$78,F24,0))","v":""},{"$f":"IF(OR(F24=\"\",fimTurma!H24=\"\"),\"\",IF(fimTurma!D24=\"Menino\",VLOOKUP(fimTurma!H24,References!A$103:J$208,F24,0),VLOOKUP(fimTurma!H24,References!A$303:J$413,F24,0)))","v":""},{"$f":"IF(OR(F24=\"\",fimTurma!I24=\"\"),\"\",VLOOKUP(fimTurma!I24,References!A$503:J$575,F24,0))","v":""},{"$f":"IF(OR(F24=\"\",fimTurma!J24=\"\"),\"\",IF(fimTurma!D24=\"Menino\",VLOOKUP(fimTurma!J24,References!A$603:J$681,F24,0),VLOOKUP(fimTurma!J24,References!A$803:J$881,F24,0)))","v":""},"",{"$f":"IF(K24=\"\",\"\",VLOOKUP(K24,References!A$903:B$1362,2,))","v":""},"",{"$f":"IF(L24=\"\",\"\",VLOOKUP(L24,References!A$1403:B$1903,2,0))","v":""},"",""]
[{"$f":"IF(fimTurma!B25<>\"\",fimTurma!B25,\"\")","v":""},{"$f":"fimTurma!A25","v":22},{"$f":"IF(fimTurma!C25=0,\"\",fimTurma!C25)","v":""},{"$f":"IF(OR(fimTurma!E25=\"\",fimTurma!F25=\"\"),\"\",(fimTurma!F25-fimTurma!E25)/365.25)","v":""},{"$f":"IF(OR(fimTurma!E25=\"\",fimTurma!F25=\"\"),\"\",fimTurma!F25-fimTurma!E25)","v":""},"",{"$f":"IF(OR(F25=\"\",fimTurma!G25=\"\"),\"\",VLOOKUP(fimTurma!G25,References!A$3:J$78,F25,0))","v":""},{"$f":"IF(OR(F25=\"\",fimTurma!H25=\"\"),\"\",IF(fimTurma!D25=\"Menino\",VLOOKUP(fimTurma!H25,References!A$103:J$208,F25,0),VLOOKUP(fimTurma!H25,References!A$303:J$413,F25,0)))","v":""},{"$f":"IF(OR(F25=\"\",fimTurma!I25=\"\"),\"\",VLOOKUP(fimTurma!I25,References!A$503:J$575,F25,0))","v":""},{"$f":"IF(OR(F25=\"\",fimTurma!J25=\"\"),\"\",IF(fimTurma!D25=\"Menino\",VLOOKUP(fimTurma!J25,References!A$603:J$681,F25,0),VLOOKUP(fimTurma!J25,References!A$803:J$881,F25,0)))","v":""},"",{"$f":"IF(K25=\"\",\"\",VLOOKUP(K25,References!A$903:B$1362,2,))","v":""},"",{"$f":"IF(L25=\"\",\"\",VLOOKUP(L25,References!A$1403:B$1903,2,0))","v":""},"",""]
[{"$f":"IF(fimTurma!B26<>\"\",fimTurma!B26,\"\")","v":""},{"$f":"fimTurma!A26","v":23},{"$f":"IF(fimTurma!C26=0,\"\",fimTurma!C26)","v":""},{"$f":"IF(OR(fimTurma!E26=\"\",fimTurma!F26=\"\"),\"\",(fimTurma!F26-fimTurma!E26)/365.25)","v":""},{"$f":"IF(OR(fimTurma!E26=\"\",fimTurma!F26=\"\"),\"\",fimTurma!F26-fimTurma!E26)","v":""},"",{"$f":"IF(OR(F26=\"\",fimTurma!G26=\"\"),\"\",VLOOKUP(fimTurma!G26,References!A$3:J$78,F26,0))","v":""},{"$f":"IF(OR(F26=\"\",fimTurma!H26=\"\"),\"\",IF(fimTurma!D26=\"Menino\",VLOOKUP(fimTurma!H26,References!A$103:J$208,F26,0),VLOOKUP(fimTurma!H26,References!A$303:J$413,F26,0)))","v":""},{"$f":"IF(OR(F26=\"\",fimTurma!I26=\"\"),\"\",VLOOKUP(fimTurma!I26,References!A$503:J$575,F26,0))","v":""},{"$f":"IF(OR(F26=\"\",fimTurma!J26=\"\"),\"\",IF(fimTurma!D26=\"Menino\",VLOOKUP(fimTurma!J26,References!A$603:J$681,F26,0),VLOOKUP(fimTurma!J26,References!A$803:J$881,F26,0)))","v":""},"",{"$f":"IF(K26=\"\",\"\",VLOOKUP(K26,References!A$903:B$1362,2,))","v":""},"",{"$f":"IF(L26=\"\",\"\",VLOOKUP(L26,References!A$1403:B$1903,2,0))","v":""},"",""]
[{"$f":"IF(fimTurma!B27<>\"\",fimTurma!B27,\"\")","v":""},{"$f":"fimTurma!A27","v":24},{"$f":"IF(fimTurma!C27=0,\"\",fimTurma!C27)","v":""},{"$f":"IF(OR(fimTurma!E27=\"\",fimTurma!F27=\"\"),\"\",(fimTurma!F27-fimTurma!E27)/365.25)","v":""},{"$f":"IF(OR(fimTurma!E27=\"\",fimTurma!F27=\"\"),\"\",fimTurma!F27-fimTurma!E27)","v":""},"",{"$f":"IF(OR(F27=\"\",fimTurma!G27=\"\"),\"\",VLOOKUP(fimTurma!G27,References!A$3:J$78,F27,0))","v":""},{"$f":"IF(OR(F27=\"\",fimTurma!H27=\"\"),\"\",IF(fimTurma!D27=\"Menino\",VLOOKUP(fimTurma!H27,References!A$103:J$208,F27,0),VLOOKUP(fimTurma!H27,References!A$303:J$413,F27,0)))","v":""},{"$f":"IF(OR(F27=\"\",fimTurma!I27=\"\"),\"\",VLOOKUP(fimTurma!I27,References!A$503:J$575,F27,0))","v":""},{"$f":"IF(OR(F27=\"\",fimTurma!J27=\"\"),\"\",IF(fimTurma!D27=\"Menino\",VLOOKUP(fimTurma!J27,References!A$603:J$681,F27,0),VLOOKUP(fimTurma!J27,References!A$803:J$881,F27,0)))","v":""},"",{"$f":"IF(K27=\"\",\"\",VLOOKUP(K27,References!A$903:B$1362,2,))","v":""},"",{"$f":"IF(L27=\"\",\"\",VLOOKUP(L27,References!A$1403:B$1903,2,0))","v":""},"",""]
[{"$f":"IF(fimTurma!B28<>\"\",fimTurma!B28,\"\")","v":""},{"$f":"fimTurma!A28","v":25},{"$f":"IF(fimTurma!C28=0,\"\",fimTurma!C28)","v":""},{"$f":"IF(OR(fimTurma!E28=\"\",fimTurma!F28=\"\"),\"\",(fimTurma!F28-fimTurma!E28)/365.25)","v":""},{"$f":"IF(OR(fimTurma!E28=\"\",fimTurma!F28=\"\"),\"\",fimTurma!F28-fimTurma!E28)","v":""},"",{"$f":"IF(OR(F28=\"\",fimTurma!G28=\"\"),\"\",VLOOKUP(fimTurma!G28,References!A$3:J$78,F28,0))","v":""},{"$f":"IF(OR(F28=\"\",fimTurma!H28=\"\"),\"\",IF(fimTurma!D28=\"Menino\",VLOOKUP(fimTurma!H28,References!A$103:J$208,F28,0),VLOOKUP(fimTurma!H28,References!A$303:J$413,F28,0)))","v":""},{"$f":"IF(OR(F28=\"\",fimTurma!I28=\"\"),\"\",VLOOKUP(fimTurma!I28,References!A$503:J$575,F28,0))","v":""},{"$f":"IF(OR(F28=\"\",fimTurma!J28=\"\"),\"\",IF(fimTurma!D28=\"Menino\",VLOOKUP(fimTurma!J28,References!A$603:J$681,F28,0),VLOOKUP(fimTurma!J28,References!A$803:J$881,F28,0)))","v":""},"",{"$f":"IF(K28=\"\",\"\",VLOOKUP(K28,References!A$903:B$1362,2,))","v":""},"",{"$f":"IF(L28=\"\",\"\",VLOOKUP(L28,References!A$1403:B$1903,2,0))","v":""},"",""]
[{"$f":"IF(fimTurma!B29<>\"\",fimTurma!B29,\"\")","v":""},{"$f":"fimTurma!A29","v":26},{"$f":"IF(fimTurma!C29=0,\"\",fimTurma!C29)","v":""},{"$f":"IF(OR(fimTurma!E29=\"\",fimTurma!F29=\"\"),\"\",(fimTurma!F29-fimTurma!E29)/365.25)","v":""},{"$f":"IF(OR(fimTurma!E29=\"\",fimTurma!F29=\"\"),\"\",fimTurma!F29-fimTurma!E29)","v":""},"",{"$f":"IF(OR(F29=\"\",fimTurma!G29=\"\"),\"\",VLOOKUP(fimTurma!G29,References!A$3:J$78,F29,0))","v":""},{"$f":"IF(OR(F29=\"\",fimTurma!H29=\"\"),\"\",IF(fimTurma!D29=\"Menino\",VLOOKUP(fimTurma!H29,References!A$103:J$208,F29,0),VLOOKUP(fimTurma!H29,References!A$303:J$413,F29,0)))","v":""},{"$f":"IF(OR(F29=\"\",fimTurma!I29=\"\"),\"\",VLOOKUP(fimTurma!I29,References!A$503:J$575,F29,0))","v":""},{"$f":"IF(OR(F29=\"\",fimTurma!J29=\"\"),\"\",IF(fimTurma!D29=\"Menino\",VLOOKUP(fimTurma!J29,References!A$603:J$681,F29,0),VLOOKUP(fimTurma!J29,References!A$803:J$881,F29,0)))","v":""},"",{"$f":"IF(K29=\"\",\"\",VLOOKUP(K29,References!A$903:B$1362,2,))","v":""},"",{"$f":"IF(L29=\"\",\"\",VLOOKUP(L29,References!A$1403:B$1903,2,0))","v":""},"",""]
[{"$f":"IF(fimTurma!B30<>\"\",fimTurma!B30,\"\")","v":""},{"$f":"fimTurma!A30","v":27},{"$f":"IF(fimTurma!C30=0,\"\",fimTurma!C30)","v":""},{"$f":"IF(OR(fimTurma!E30=\"\",fimTurma!F30=\"\"),\"\",(fimTurma!F30-fimTurma!E30)/365.25)","v":""},{"$f":"IF(OR(fimTurma!E30=\"\",fimTurma!F30=\"\"),\"\",fimTurma!F30-fimTurma!E30)","v":""},"",{"$f":"IF(OR(F30=\"\",fimTurma!G30=\"\"),\"\",VLOOKUP(fimTurma!G30,References!A$3:J$78,F30,0))","v":""},{"$f":"IF(OR(F30=\"\",fimTurma!H30=\"\"),\"\",IF(fimTurma!D30=\"Menino\",VLOOKUP(fimTurma!H30,References!A$103:J$208,F30,0),VLOOKUP(fimTurma!H30,References!A$303:J$413,F30,0)))","v":""},{"$f":"IF(OR(F30=\"\",fimTurma!I30=\"\"),\"\",VLOOKUP(fimTurma!I30,References!A$503:J$575,F30,0))","v":""},{"$f":"IF(OR(F30=\"\",fimTurma!J30=\"\"),\"\",IF(fimTurma!D30=\"Menino\",VLOOKUP(fimTurma!J30,References!A$603:J$681,F30,0),VLOOKUP(fimTurma!J30,References!A$803:J$881,F30,0)))","v":""},"",{"$f":"IF(K30=\"\",\"\",VLOOKUP(K30,References!A$903:B$1362,2,))","v":""},"",{"$f":"IF(L30=\"\",\"\",VLOOKUP(L30,References!A$1403:B$1903,2,0))","v":""},"",""]
[{"$f":"IF(fimTurma!B31<>\"\",fimTurma!B31,\"\")","v":""},{"$f":"fimTurma!A31","v":28},{"$f":"IF(fimTurma!C31=0,\"\",fimTurma!C31)","v":""},{"$f":"IF(OR(fimTurma!E31=\"\",fimTurma!F31=\"\"),\"\",(fimTurma!F31-fimTurma!E31)/365.25)","v":""},{"$f":"IF(OR(fimTurma!E31=\"\",fimTurma!F31=\"\"),\"\",fimTurma!F31-fimTurma!E31)","v":""},"",{"$f":"IF(OR(F31=\"\",fimTurma!G31=\"\"),\"\",VLOOKUP(fimTurma!G31,References!A$3:J$78,F31,0))","v":""},{"$f":"IF(OR(F31=\"\",fimTurma!H31=\"\"),\"\",IF(fimTurma!D31=\"Menino\",VLOOKUP(fimTurma!H31,References!A$103:J$208,F31,0),VLOOKUP(fimTurma!H31,References!A$303:J$413,F31,0)))","v":""},{"$f":"IF(OR(F31=\"\",fimTurma!I31=\"\"),\"\",VLOOKUP(fimTurma!I31,References!A$503:J$575,F31,0))","v":""},{"$f":"IF(OR(F31=\"\",fimTurma!J31=\"\"),\"\",IF(fimTurma!D31=\"Menino\",VLOOKUP(fimTurma!J31,References!A$603:J$681,F31,0),VLOOKUP(fimTurma!J31,References!A$803:J$881,F31,0)))","v":""},"",{"$f":"IF(K31=\"\",\"\",VLOOKUP(K31,References!A$903:B$1362,2,))","v":""},"",{"$f":"IF(L31=\"\",\"\",VLOOKUP(L31,References!A$1403:B$1903,2,0))","v":""},"",""]
[{"$f":"IF(fimTurma!B32<>\"\",fimTurma!B32,\"\")","v":""},{"$f":"fimTurma!A32","v":29},{"$f":"IF(fimTurma!C32=0,\"\",fimTurma!C32)","v":""},{"$f":"IF(OR(fimTurma!E32=\"\",fimTurma!F32=\"\"),\"\",(fimTurma!F32-fimTurma!E32)/365.25)","v":""},{"$f":"IF(OR(fimTurma!E32=\"\",fimTurma!F32=\"\"),\"\",fimTurma!F32-fimTurma!E32)","v":""},"",{"$f":"IF(OR(F32=\"\",fimTurma!G32=\"\"),\"\",VLOOKUP(fimTurma!G32,References!A$3:J$78,F32,0))","v":""},{"$f":"IF(OR(F32=\"\",fimTurma!H32=\"\"),\"\",IF(fimTurma!D32=\"Menino\",VLOOKUP(fimTurma!H32,References!A$103:J$208,F32,0),VLOOKUP(fimTurma!H32,References!A$303:J$413,F32,0)))","v":""},{"$f":"IF(OR(F32=\"\",fimTurma!I32=\"\"),\"\",VLOOKUP(fimTurma!I32,References!A$503:J$575,F32,0))","v":""},{"$f":"IF(OR(F32=\"\",fimTurma!J32=\"\"),\"\",IF(fimTurma!D32=\"Menino\",VLOOKUP(fimTurma!J32,References!A$603:J$681,F32,0),VLOOKUP(fimTurma!J32,References!A$803:J$881,F32,0)))","v":""},"",{"$f":"IF(K32=\"\",\"\",VLOOKUP(K32,References!A$903:B$1362,2,))","v":""},"",{"$f":"IF(L32=\"\",\"\",VLOOKUP(L32,References!A$1403:B$1903,2,0))","v":""},"",""]
[{"$f":"IF(fimTurma!B33<>\"\",fimTurma!B33,\"\")","v":""},{"$f":"fimTurma!A33","v":30},{"$f":"IF(fimTurma!C33=0,\"\",fimTurma!C33)","v":""},{"$f":"IF(OR(fimTurma!E33=\"\",fimTurma!F33=\"\"),\"\",(fimTurma!F33-fimTurma!E33)/365.25)","v":""},{"$f":"IF(OR(fimTurma!E33=\"\",fimTurma!F33=\"\"),\"\",fimTurma!F33-fimTurma!E33)","v":""},"",{"$f":"IF(OR(F33=\"\",fimTurma!G33=\"\"),\"\",VLOOKUP(fimTurma!G33,References!A$3:J$78,F33,0))","v":""},{"$f":"IF(OR(F33=\"\",fimTurma!H33=\"\"),\"\",IF(fimTurma!D33=\"Menino\",VLOOKUP(fimTurma!H33,References!A$103:J$208,F33,0),VLOOKUP(fimTurma!H33,References!A$303:J$413,F33,0)))","v":""},{"$f":"IF(OR(F33=\"\",fimTurma!I33=\"\"),\"\",VLOOKUP(fimTurma!I33,References!A$503:J$575,F33,0))","v":""},{"$f":"IF(OR(F33=\"\",fimTurma!J33=\"\"),\"\",IF(fimTurma!D33=\"Menino\",VLOOKUP(fimTurma!J33,References!A$603:J$681,F33,0),VLOOKUP(fimTurma!J33,References!A$803:J$881,F33,0)))","v":""},"",{"$f":"IF(K33=\"\",\"\",VLOOKUP(K33,References!A$903:B$1362,2,))","v":""},"",{"$f":"IF(L33=\"\",\"\",VLOOKUP(L33,References!A$1403:B$1903,2,0))","v":""},"",""]
[{"$f":"IF(fimTurma!B34<>\"\",fimTurma!B34,\"\")","v":""},{"$f":"fimTurma!A34","v":31},{"$f":"IF(fimTurma!C34=0,\"\",fimTurma!C34)","v":""},{"$f":"IF(OR(fimTurma!E34=\"\",fimTurma!F34=\"\"),\"\",(fimTurma!F34-fimTurma!E34)/365.25)","v":""},{"$f":"IF(OR(fimTurma!E34=\"\",fimTurma!F34=\"\"),\"\",fimTurma!F34-fimTurma!E34)","v":""},"",{"$f":"IF(OR(F34=\"\",fimTurma!G34=\"\"),\"\",VLOOKUP(fimTurma!G34,References!A$3:J$78,F34,0))","v":""},{"$f":"IF(OR(F34=\"\",fimTurma!H34=\"\"),\"\",IF(fimTurma!D34=\"Menino\",VLOOKUP(fimTurma!H34,References!A$103:J$208,F34,0),VLOOKUP(fimTurma!H34,References!A$303:J$413,F34,0)))","v":""},{"$f":"IF(OR(F34=\"\",fimTurma!I34=\"\"),\"\",VLOOKUP(fimTurma!I34,References!A$503:J$575,F34,0))","v":""},{"$f":"IF(OR(F34=\"\",fimTurma!J34=\"\"),\"\",IF(fimTurma!D34=\"Menino\",VLOOKUP(fimTurma!J34,References!A$603:J$681,F34,0),VLOOKUP(fimTurma!J34,References!A$803:J$881,F34,0)))","v":""},"",{"$f":"IF(K34=\"\",\"\",VLOOKUP(K34,References!A$903:B$1362,2,))","v":""},"",{"$f":"IF(L34=\"\",\"\",VLOOKUP(L34,References!A$1403:B$1903,2,0))","v":""},"",""]
[{"$f":"IF(fimTurma!B35<>\"\",fimTurma!B35,\"\")","v":""},{"$f":"fimTurma!A35","v":32},{"$f":"IF(fimTurma!C35=0,\"\",fimTurma!C35)","v":""},{"$f":"IF(OR(fimTurma!E35=\"\",fimTurma!F35=\"\"),\"\",(fimTurma!F35-fimTurma!E35)/365.25)","v":""},{"$f":"IF(OR(fimTurma!E35=\"\",fimTurma!F35=\"\"),\"\",fimTurma!F35-fimTurma!E35)","v":""},"",{"$f":"IF(OR(F35=\"\",fimTurma!G35=\"\"),\"\",VLOOKUP(fimTurma!G35,References!A$3:J$78,F35,0))","v":""},{"$f":"IF(OR(F35=\"\",fimTurma!H35=\"\"),\"\",IF(fimTurma!D35=\"Menino\",VLOOKUP(fimTurma!H35,References!A$103:J$208,F35,0),VLOOKUP(fimTurma!H35,References!A$303:J$413,F35,0)))","v":""},{"$f":"IF(OR(F35=\"\",fimTurma!I35=\"\"),\"\",VLOOKUP(fimTurma!I35,References!A$503:J$575,F35,0))","v":""},{"$f":"IF(OR(F35=\"\",fimTurma!J35=\"\"),\"\",IF(fimTurma!D35=\"Menino\",VLOOKUP(fimTurma!J35,References!A$603:J$681,F35,0),VLOOKUP(fimTurma!J35,References!A$803:J$881,F35,0)))","v":""},"",{"$f":"IF(K35=\"\",\"\",VLOOKUP(K35,References!A$903:B$1362,2,))","v":""},"",{"$f":"IF(L35=\"\",\"\",VLOOKUP(L35,References!A$1403:B$1903,2,0))","v":""},"",""]
[{"$f":"IF(fimTurma!B36<>\"\",fimTurma!B36,\"\")","v":""},{"$f":"fimTurma!A36","v":33},{"$f":"IF(fimTurma!C36=0,\"\",fimTurma!C36)","v":""},{"$f":"IF(OR(fimTurma!E36=\"\",fimTurma!F36=\"\"),\"\",(fimTurma!F36-fimTurma!E36)/365.25)","v":""},{"$f":"IF(OR(fimTurma!E36=\"\",fimTurma!F36=\"\"),\"\",fimTurma!F36-fimTurma!E36)","v":""},"",{"$f":"IF(OR(F36=\"\",fimTurma!G36=\"\"),\"\",VLOOKUP(fimTurma!G36,References!A$3:J$78,F36,0))","v":""},{"$f":"IF(OR(F36=\"\",fimTurma!H36=\"\"),\"\",IF(fimTurma!D36=\"Menino\",VLOOKUP(fimTurma!H36,References!A$103:J$208,F36,0),VLOOKUP(fimTurma!H36,References!A$303:J$413,F36,0)))","v":""},{"$f":"IF(OR(F36=\"\",fimTurma!I36=\"\"),\"\",VLOOKUP(fimTurma!I36,References!A$503:J$575,F36,0))","v":""},{"$f":"IF(OR(F36=\"\",fimTurma!J36=\"\"),\"\",IF(fimTurma!D36=\"Menino\",VLOOKUP(fimTurma!J36,References!A$603:J$681,F36,0),VLOOKUP(fimTurma!J36,References!A$803:J$881,F36,0)))","v":""},"",{"$f":"IF(K36=\"\",\"\",VLOOKUP(K36,References!A$903:B$1362,2,))","v":""},"",{"$f":"IF(L36=\"\",\"\",VLOOKUP(L36,References!A$1403:B$1903,2,0))","v":""},"",""]
[{"$f":"IF(fimTurma!B37<>\"\",fimTurma!B37,\"\")","v":""},{"$f":"fimTurma!A37","v":34},{"$f":"IF(fimTurma!C37=0,\"\",fimTurma!C37)","v":""},{"$f":"IF(OR(fimTurma!E37=\"\",fimTurma!F37=\"\"),\"\",(fimTurma!F37-fimTurma!E37)/365.25)","v":""},{"$f":"IF(OR(fimTurma!E37=\"\",fimTurma!F37=\"\"),\"\",fimTurma!F37-fimTurma!E37)","v":""},"",{"$f":"IF(OR(F37=\"\",fimTurma!G37=\"\"),\"\",VLOOKUP(fimTurma!G37,References!A$3:J$78,F37,0))","v":""},{"$f":"IF(OR(F37=\"\",fimTurma!H37=\"\"),\"\",IF(fimTurma!D37=\"Menino\",VLOOKUP(fimTurma!H37,References!A$103:J$208,F37,0),VLOOKUP(fimTurma!H37,References!A$303:J$413,F37,0)))","v":""},{"$f":"IF(OR(F37=\"\",fimTurma!I37=\"\"),\"\",VLOOKUP(fimTurma!I37,References!A$503:J$575,F37,0))","v":""},{"$f":"IF(OR(F37=\"\",fimTurma!J37=\"\"),\"\",IF(fimTurma!D37=\"Menino\",VLOOKUP(fimTurma!J37,References!A$603:J$681,F37,0),VLOOKUP(fimTurma!J37,References!A$803:J$881,F37,0)))","v":""},"",{"$f":"IF(K37=\"\",\"\",VLOOKUP(K37,References!A$903:B$1362,2,))","v":""},"",{"$f":"IF(L37=\"\",\"\",VLOOKUP(L37,References!A$1403:B$1903,2,0))","v":""},"",""]
[{"$f":"IF(fimTurma!B38<>\"\",fimTurma!B38,\"\")","v":""},{"$f":"fimTurma!A38","v":35},{"$f":"IF(fimTurma!C38=0,\"\",fimTurma!C38)","v":""},{"$f":"IF(OR(fimTurma!E38=\"\",fimTurma!F38=\"\"),\"\",(fimTurma!F38-fimTurma!E38)/365.25)","v":""},{"$f":"IF(OR(fimTurma!E38=\"\",fimTurma!F38=\"\"),\"\",fimTurma!F38-fimTurma!E38)","v":""},"",{"$f":"IF(OR(F38=\"\",fimTurma!G38=\"\"),\"\",VLOOKUP(fimTurma!G38,References!A$3:J$78,F38,0))","v":""},{"$f":"IF(OR(F38=\"\",fimTurma!H38=\"\"),\"\",IF(fimTurma!D38=\"Menino\",VLOOKUP(fimTurma!H38,References!A$103:J$208,F38,0),VLOOKUP(fimTurma!H38,References!A$303:J$413,F38,0)))","v":""},{"$f":"IF(OR(F38=\"\",fimTurma!I38=\"\"),\"\",VLOOKUP(fimTurma!I38,References!A$503:J$575,F38,0))","v":""},{"$f":"IF(OR(F38=\"\",fimTurma!J38=\"\"),\"\",IF(fimTurma!D38=\"Menino\",VLOOKUP(fimTurma!J38,References!A$603:J$681,F38,0),VLOOKUP(fimTurma!J38,References!A$803:J$881,F38,0)))","v":""},"",{"$f":"IF(K38=\"\",\"\",VLOOKUP(K38,References!A$903:B$1362,2,))","v":""},"",{"$f":"IF(L38=\"\",\"\",VLOOKUP(L38,References!A$1403:B$1903,2,0))","v":""},"",""]
[{"$f":"IF(fimTurma!B39<>\"\",fimTurma!B39,\"\")","v":""},{"$f":"fimTurma!A39","v":36},{"$f":"IF(fimTurma!C39=0,\"\",fimTurma!C39)","v":""},{"$f":"IF(OR(fimTurma!E39=\"\",fimTurma!F39=\"\"),\"\",(fimTurma!F39-fimTurma!E39)/365.25)","v":""},{"$f":"IF(OR(fimTurma!E39=\"\",fimTurma!F39=\"\"),\"\",fimTurma!F39-fimTurma!E39)","v":""},"",{"$f":"IF(OR(F39=\"\",fimTurma!G39=\"\"),\"\",VLOOKUP(fimTurma!G39,References!A$3:J$78,F39,0))","v":""},{"$f":"IF(OR(F39=\"\",fimTurma!H39=\"\"),\"\",IF(fimTurma!D39=\"Menino\",VLOOKUP(fimTurma!H39,References!A$103:J$208,F39,0),VLOOKUP(fimTurma!H39,References!A$303:J$413,F39,0)))","v":""},{"$f":"IF(OR(F39=\"\",fimTurma!I39=\"\"),\"\",VLOOKUP(fimTurma!I39,References!A$503:J$575,F39,0))","v":""},{"$f":"IF(OR(F39=\"\",fimTurma!J39=\"\"),\"\",IF(fimTurma!D39=\"Menino\",VLOOKUP(fimTurma!J39,References!A$603:J$681,F39,0),VLOOKUP(fimTurma!J39,References!A$803:J$881,F39,0)))","v":""},"",{"$f":"IF(K39=\"\",\"\",VLOOKUP(K39,References!A$903:B$1362,2,))","v":""},"",{"$f":"IF(L39=\"\",\"\",VLOOKUP(L39,References!A$1403:B$1903,2,0))","v":""},"",""]
[{"$f":"IF(fimTurma!B40<>\"\",fimTurma!B40,\"\")","v":""},{"$f":"fimTurma!A40","v":37},{"$f":"IF(fimTurma!C40=0,\"\",fimTurma!C40)","v":""},{"$f":"IF(OR(fimTurma!E40=\"\",fimTurma!F40=\"\"),\"\",(fimTurma!F40-fimTurma!E40)/365.25)","v":""},{"$f":"IF(OR(fimTurma!E40=\"\",fimTurma!F40=\"\"),\"\",fimTurma!F40-fimTurma!E40)","v":""},"",{"$f":"IF(OR(F40=\"\",fimTurma!G40=\"\"),\"\",VLOOKUP(fimTurma!G40,References!A$3:J$78,F40,0))","v":""},{"$f":"IF(OR(F40=\"\",fimTurma!H40=\"\"),\"\",IF(fimTurma!D40=\"Menino\",VLOOKUP(fimTurma!H40,References!A$103:J$208,F40,0),VLOOKUP(fimTurma!H40,References!A$303:J$413,F40,0)))","v":""},{"$f":"IF(OR(F40=\"\",fimTurma!I40=\"\"),\"\",VLOOKUP(fimTurma!I40,References!A$503:J$575,F40,0))","v":""},{"$f":"IF(OR(F40=\"\",fimTurma!J40=\"\"),\"\",IF(fimTurma!D40=\"Menino\",VLOOKUP(fimTurma!J40,References!A$603:J$681,F40,0),VLOOKUP(fimTurma!J40,References!A$803:J$881,F40,0)))","v":""},"",{"$f":"IF(K40=\"\",\"\",VLOOKUP(K40,References!A$903:B$1362,2,))","v":""},"",{"$f":"IF(L40=\"\",\"\",VLOOKUP(L40,References!A$1403:B$1903,2,0))","v":""},"",""]
[{"$f":"IF(fimTurma!B41<>\"\",fimTurma!B41,\"\")","v":""},{"$f":"fimTurma!A41","v":38},{"$f":"IF(fimTurma!C41=0,\"\",fimTurma!C41)","v":""},{"$f":"IF(OR(fimTurma!E41=\"\",fimTurma!F41=\"\"),\"\",(fimTurma!F41-fimTurma!E41)/365.25)","v":""},{"$f":"IF(OR(fimTurma!E41=\"\",fimTurma!F41=\"\"),\"\",fimTurma!F41-fimTurma!E41)","v":""},"",{"$f":"IF(OR(F41=\"\",fimTurma!G41=\"\"),\"\",VLOOKUP(fimTurma!G41,References!A$3:J$78,F41,0))","v":""},{"$f":"IF(OR(F41=\"\",fimTurma!H41=\"\"),\"\",IF(fimTurma!D41=\"Menino\",VLOOKUP(fimTurma!H41,References!A$103:J$208,F41,0),VLOOKUP(fimTurma!H41,References!A$303:J$413,F41,0)))","v":""},{"$f":"IF(OR(F41=\"\",fimTurma!I41=\"\"),\"\",VLOOKUP(fimTurma!I41,References!A$503:J$575,F41,0))","v":""},{"$f":"IF(OR(F41=\"\",fimTurma!J41=\"\"),\"\",IF(fimTurma!D41=\"Menino\",VLOOKUP(fimTurma!J41,References!A$603:J$681,F41,0),VLOOKUP(fimTurma!J41,References!A$803:J$881,F41,0)))","v":""},"",{"$f":"IF(K41=\"\",\"\",VLOOKUP(K41,References!A$903:B$1362,2,))","v":""},"",{"$f":"IF(L41=\"\",\"\",VLOOKUP(L41,References!A$1403:B$1903,2,0))","v":""},"",""]
[{"$f":"IF(fimTurma!B42<>\"\",fimTurma!B42,\"\")","v":""},{"$f":"fimTurma!A42","v":39},{"$f":"IF(fimTurma!C42=0,\"\",fimTurma!C42)","v":""},{"$f":"IF(OR(fimTurma!E42=\"\",fimTurma!F42=\"\"),\"\",(fimTurma!F42-fimTurma!E42)/365.25)","v":""},{"$f":"IF(OR(fimTurma!E42=\"\",fimTurma!F42=\"\"),\"\",fimTurma!F42-fimTurma!E42)","v":""},"",{"$f":"IF(OR(F42=\"\",fimTurma!G42=\"\"),\"\",VLOOKUP(fimTurma!G42,References!A$3:J$78,F42,0))","v":""},{"$f":"IF(OR(F42=\"\",fimTurma!H42=\"\"),\"\",IF(fimTurma!D42=\"Menino\",VLOOKUP(fimTurma!H42,References!A$103:J$208,F42,0),VLOOKUP(fimTurma!H42,References!A$303:J$413,F42,0)))","v":""},{"$f":"IF(OR(F42=\"\",fimTurma!I42=\"\"),\"\",VLOOKUP(fimTurma!I42,References!A$503:J$575,F42,0))","v":""},{"$f":"IF(OR(F42=\"\",fimTurma!J42=\"\"),\"\",IF(fimTurma!D42=\"Menino\",VLOOKUP(fimTurma!J42,References!A$603:J$681,F42,0),VLOOKUP(fimTurma!J42,References!A$803:J$881,F42,0)))","v":""},"",{"$f":"IF(K42=\"\",\"\",VLOOKUP(K42,References!A$903:B$1362,2,))","v":""},"",{"$f":"IF(L42=\"\",\"\",VLOOKUP(L42,References!A$1403:B$1903,2,0))","v":""},"",""]
[{"$f":"IF(fimTurma!B43<>\"\",fimTurma!B43,\"\")","v":""},{"$f":"fimTurma!A43","v":40},{"$f":"IF(fimTurma!C43=0,\"\",fimTurma!C43)","v":""},{"$f":"IF(OR(fimTurma!E43=\"\",fimTurma!F43=\"\"),\"\",(fimTurma!F43-fimTurma!E43)/365.25)","v":""},{"$f":"IF(OR(fimTurma!E43=\"\",fimTurma!F43=\"\"),\"\",fimTurma!F43-fimTurma!E43)","v":""},"",{"$f":"IF(OR(F43=\"\",fimTurma!G43=\"\"),\"\",VLOOKUP(fimTurma!G43,References!A$3:J$78,F43,0))","v":""},{"$f":"IF(OR(F43=\"\",fimTurma!H43=\"\"),\"\",IF(fimTurma!D43=\"Menino\",VLOOKUP(fimTurma!H43,References!A$103:J$208,F43,0),VLOOKUP(fimTurma!H43,References!A$303:J$413,F43,0)))","v":""},{"$f":"IF(OR(F43=\"\",fimTurma!I43=\"\"),\"\",VLOOKUP(fimTurma!I43,References!A$503:J$575,F43,0))","v":""},{"$f":"IF(OR(F43=\"\",fimTurma!J43=\"\"),\"\",IF(fimTurma!D43=\"Menino\",VLOOKUP(fimTurma!J43,References!A$603:J$681,F43,0),VLOOKUP(fimTurma!J43,References!A$803:J$881,F43,0)))","v":""},"",{"$f":"IF(K43=\"\",\"\",VLOOKUP(K43,References!A$903:B$1362,2,))","v":""},"",{"$f":"IF(L43=\"\",\"\",VLOOKUP(L43,References!A$1403:B$1903,2,0))","v":""},"",""]
[{"$f":"IF(fimTurma!B44<>\"\",fimTurma!B44,\"\")","v":""},{"$f":"fimTurma!A44","v":41},{"$f":"IF(fimTurma!C44=0,\"\",fimTurma!C44)","v":""},{"$f":"IF(OR(fimTurma!E44=\"\",fimTurma!F44=\"\"),\"\",(fimTurma!F44-fimTurma!E44)/365.25)","v":""},{"$f":"IF(OR(fimTurma!E44=\"\",fimTurma!F44=\"\"),\"\",fimTurma!F44-fimTurma!E44)","v":""},"",{"$f":"IF(OR(F44=\"\",fimTurma!G44=\"\"),\"\",VLOOKUP(fimTurma!G44,References!A$3:J$78,F44,0))","v":""},{"$f":"IF(OR(F44=\"\",fimTurma!H44=\"\"),\"\",IF(fimTurma!D44=\"Menino\",VLOOKUP(fimTurma!H44,References!A$103:J$208,F44,0),VLOOKUP(fimTurma!H44,References!A$303:J$413,F44,0)))","v":""},{"$f":"IF(OR(F44=\"\",fimTurma!I44=\"\"),\"\",VLOOKUP(fimTurma!I44,References!A$503:J$575,F44,0))","v":""},{"$f":"IF(OR(F44=\"\",fimTurma!J44=\"\"),\"\",IF(fimTurma!D44=\"Menino\",VLOOKUP(fimTurma!J44,References!A$603:J$681,F44,0),VLOOKUP(fimTurma!J44,References!A$803:J$881,F44,0)))","v":""},"",{"$f":"IF(K44=\"\",\"\",VLOOKUP(K44,References!A$903:B$1362,2,))","v":""},"",{"$f":"IF(L44=\"\",\"\",VLOOKUP(L44,References!A$1403:B$1903,2,0))","v":""},"",""]
[{"$f":"IF(fimTurma!B45<>\"\",fimTurma!B45,\"\")","v":""},{"$f":"fimTurma!A45","v":42},{"$f":"IF(fimTurma!C45=0,\"\",fimTurma!C45)","v":""},{"$f":"IF(OR(fimTurma!E45=\"\",fimTurma!F45=\"\"),\"\",(fimTurma!F45-fimTurma!E45)/365.25)","v":""},{"$f":"IF(OR(fimTurma!E45=\"\",fimTurma!F45=\"\"),\"\",fimTurma!F45-fimTurma!E45)","v":""},"",{"$f":"IF(OR(F45=\"\",fimTurma!G45=\"\"),\"\",VLOOKUP(fimTurma!G45,References!A$3:J$78,F45,0))","v":""},{"$f":"IF(OR(F45=\"\",fimTurma!H45=\"\"),\"\",IF(fimTurma!D45=\"Menino\",VLOOKUP(fimTurma!H45,References!A$103:J$208,F45,0),VLOOKUP(fimTurma!H45,References!A$303:J$413,F45,0)))","v":""},{"$f":"IF(OR(F45=\"\",fimTurma!I45=\"\"),\"\",VLOOKUP(fimTurma!I45,References!A$503:J$575,F45,0))","v":""},{"$f":"IF(OR(F45=\"\",fimTurma!J45=\"\"),\"\",IF(fimTurma!D45=\"Menino\",VLOOKUP(fimTurma!J45,References!A$603:J$681,F45,0),VLOOKUP(fimTurma!J45,References!A$803:J$881,F45,0)))","v":""},"",{"$f":"IF(K45=\"\",\"\",VLOOKUP(K45,References!A$903:B$1362,2,))","v":""},"",{"$f":"IF(L45=\"\",\"\",VLOOKUP(L45,References!A$1403:B$1903,2,0))","v":""},"",""]
[{"$f":"IF(fimTurma!B46<>\"\",fimTurma!B46,\"\")","v":""},{"$f":"fimTurma!A46","v":43},{"$f":"IF(fimTurma!C46=0,\"\",fimTurma!C46)","v":""},{"$f":"IF(OR(fimTurma!E46=\"\",fimTurma!F46=\"\"),\"\",(fimTurma!F46-fimTurma!E46)/365.25)","v":""},{"$f":"IF(OR(fimTurma!E46=\"\",fimTurma!F46=\"\"),\"\",fimTurma!F46-fimTurma!E46)","v":""},"",{"$f":"IF(OR(F46=\"\",fimTurma!G46=\"\"),\"\",VLOOKUP(fimTurma!G46,References!A$3:J$78,F46,0))","v":""},{"$f":"IF(OR(F46=\"\",fimTurma!H46=\"\"),\"\",IF(fimTurma!D46=\"Menino\",VLOOKUP(fimTurma!H46,References!A$103:J$208,F46,0),VLOOKUP(fimTurma!H46,References!A$303:J$413,F46,0)))","v":""},{"$f":"IF(OR(F46=\"\",fimTurma!I46=\"\"),\"\",VLOOKUP(fimTurma!I46,References!A$503:J$575,F46,0))","v":""},{"$f":"IF(OR(F46=\"\",fimTurma!J46=\"\"),\"\",IF(fimTurma!D46=\"Menino\",VLOOKUP(fimTurma!J46,References!A$603:J$681,F46,0),VLOOKUP(fimTurma!J46,References!A$803:J$881,F46,0)))","v":""},"",{"$f":"IF(K46=\"\",\"\",VLOOKUP(K46,References!A$903:B$1362,2,))","v":""},"",{"$f":"IF(L46=\"\",\"\",VLOOKUP(L46,References!A$1403:B$1903,2,0))","v":""},"",""]
[{"$f":"IF(fimTurma!B47<>\"\",fimTurma!B47,\"\")","v":""},{"$f":"fimTurma!A47","v":44},{"$f":"IF(fimTurma!C47=0,\"\",fimTurma!C47)","v":""},{"$f":"IF(OR(fimTurma!E47=\"\",fimTurma!F47=\"\"),\"\",(fimTurma!F47-fimTurma!E47)/365.25)","v":""},{"$f":"IF(OR(fimTurma!E47=\"\",fimTurma!F47=\"\"),\"\",fimTurma!F47-fimTurma!E47)","v":""},"",{"$f":"IF(OR(F47=\"\",fimTurma!G47=\"\"),\"\",VLOOKUP(fimTurma!G47,References!A$3:J$78,F47,0))","v":""},{"$f":"IF(OR(F47=\"\",fimTurma!H47=\"\"),\"\",IF(fimTurma!D47=\"Menino\",VLOOKUP(fimTurma!H47,References!A$103:J$208,F47,0),VLOOKUP(fimTurma!H47,References!A$303:J$413,F47,0)))","v":""},{"$f":"IF(OR(F47=\"\",fimTurma!I47=\"\"),\"\",VLOOKUP(fimTurma!I47,References!A$503:J$575,F47,0))","v":""},{"$f":"IF(OR(F47=\"\",fimTurma!J47=\"\"),\"\",IF(fimTurma!D47=\"Menino\",VLOOKUP(fimTurma!J47,References!A$603:J$681,F47,0),VLOOKUP(fimTurma!J47,References!A$803:J$881,F47,0)))","v":""},"",{"$f":"IF(K47=\"\",\"\",VLOOKUP(K47,References!A$903:B$1362,2,))","v":""},"",{"$f":"IF(L47=\"\",\"\",VLOOKUP(L47,References!A$1403:B$1903,2,0))","v":""},"",""]
[{"$f":"IF(fimTurma!B48<>\"\",fimTurma!B48,\"\")","v":""},{"$f":"fimTurma!A48","v":45},{"$f":"IF(fimTurma!C48=0,\"\",fimTurma!C48)","v":""},{"$f":"IF(OR(fimTurma!E48=\"\",fimTurma!F48=\"\"),\"\",(fimTurma!F48-fimTurma!E48)/365.25)","v":""},{"$f":"IF(OR(fimTurma!E48=\"\",fimTurma!F48=\"\"),\"\",fimTurma!F48-fimTurma!E48)","v":""},"",{"$f":"IF(OR(F48=\"\",fimTurma!G48=\"\"),\"\",VLOOKUP(fimTurma!G48,References!A$3:J$78,F48,0))","v":""},{"$f":"IF(OR(F48=\"\",fimTurma!H48=\"\"),\"\",IF(fimTurma!D48=\"Menino\",VLOOKUP(fimTurma!H48,References!A$103:J$208,F48,0),VLOOKUP(fimTurma!H48,References!A$303:J$413,F48,0)))","v":""},{"$f":"IF(OR(F48=\"\",fimTurma!I48=\"\"),\"\",VLOOKUP(fimTurma!I48,References!A$503:J$575,F48,0))","v":""},{"$f":"IF(OR(F48=\"\",fimTurma!J48=\"\"),\"\",IF(fimTurma!D48=\"Menino\",VLOOKUP(fimTurma!J48,References!A$603:J$681,F48,0),VLOOKUP(fimTurma!J48,References!A$803:J$881,F48,0)))","v":""},"",{"$f":"IF(K48=\"\",\"\",VLOOKUP(K48,References!A$903:B$1362,2,))","v":""},"",{"$f":"IF(L48=\"\",\"\",VLOOKUP(L48,References!A$1403:B$1903,2,0))","v":""},"",""]
[{"$f":"IF(fimTurma!B49<>\"\",fimTurma!B49,\"\")","v":""},{"$f":"fimTurma!A49","v":46},{"$f":"IF(fimTurma!C49=0,\"\",fimTurma!C49)","v":""},{"$f":"IF(OR(fimTurma!E49=\"\",fimTurma!F49=\"\"),\"\",(fimTurma!F49-fimTurma!E49)/365.25)","v":""},{"$f":"IF(OR(fimTurma!E49=\"\",fimTurma!F49=\"\"),\"\",fimTurma!F49-fimTurma!E49)","v":""},"",{"$f":"IF(OR(F49=\"\",fimTurma!G49=\"\"),\"\",VLOOKUP(fimTurma!G49,References!A$3:J$78,F49,0))","v":""},{"$f":"IF(OR(F49=\"\",fimTurma!H49=\"\"),\"\",IF(fimTurma!D49=\"Menino\",VLOOKUP(fimTurma!H49,References!A$103:J$208,F49,0),VLOOKUP(fimTurma!H49,References!A$303:J$413,F49,0)))","v":""},{"$f":"IF(OR(F49=\"\",fimTurma!I49=\"\"),\"\",VLOOKUP(fimTurma!I49,References!A$503:J$575,F49,0))","v":""},{"$f":"IF(OR(F49=\"\",fimTurma!J49=\"\"),\"\",IF(fimTurma!D49=\"Menino\",VLOOKUP(fimTurma!J49,References!A$603:J$681,F49,0),VLOOKUP(fimTurma!J49,References!A$803:J$881,F49,0)))","v":""},"",{"$f":"IF(K49=\"\",\"\",VLOOKUP(K49,References!A$903:B$1362,2,))","v":""},"",{"$f":"IF(L49=\"\",\"\",VLOOKUP(L49,References!A$1403:B$1903,2,0))","v":""},"",""]
[{"$f":"IF(fimTurma!B50<>\"\",fimTurma!B50,\"\")","v":""},{"$f":"fimTurma!A50","v":47},{"$f":"IF(fimTurma!C50=0,\"\",fimTurma!C50)","v":""},{"$f":"IF(OR(fimTurma!E50=\"\",fimTurma!F50=\"\"),\"\",(fimTurma!F50-fimTurma!E50)/365.25)","v":""},{"$f":"IF(OR(fimTurma!E50=\"\",fimTurma!F50=\"\"),\"\",fimTurma!F50-fimTurma!E50)","v":""},"",{"$f":"IF(OR(F50=\"\",fimTurma!G50=\"\"),\"\",VLOOKUP(fimTurma!G50,References!A$3:J$78,F50,0))","v":""},{"$f":"IF(OR(F50=\"\",fimTurma!H50=\"\"),\"\",IF(fimTurma!D50=\"Menino\",VLOOKUP(fimTurma!H50,References!A$103:J$208,F50,0),VLOOKUP(fimTurma!H50,References!A$303:J$413,F50,0)))","v":""},{"$f":"IF(OR(F50=\"\",fimTurma!I50=\"\"),\"\",VLOOKUP(fimTurma!I50,References!A$503:J$575,F50,0))","v":""},{"$f":"IF(OR(F50=\"\",fimTurma!J50=\"\"),\"\",IF(fimTurma!D50=\"Menino\",VLOOKUP(fimTurma!J50,References!A$603:J$681,F50,0),VLOOKUP(fimTurma!J50,References!A$803:J$881,F50,0)))","v":""},"",{"$f":"IF(K50=\"\",\"\",VLOOKUP(K50,References!A$903:B$1362,2,))","v":""},"",{"$f":"IF(L50=\"\",\"\",VLOOKUP(L50,References!A$1403:B$1903,2,0))","v":""},"",""]
[{"$f":"IF(fimTurma!B51<>\"\",fimTurma!B51,\"\")","v":""},{"$f":"fimTurma!A51","v":48},{"$f":"IF(fimTurma!C51=0,\"\",fimTurma!C51)","v":""},{"$f":"IF(OR(fimTurma!E51=\"\",fimTurma!F51=\"\"),\"\",(fimTurma!F51-fimTurma!E51)/365.25)","v":""},{"$f":"IF(OR(fimTurma!E51=\"\",fimTurma!F51=\"\"),\"\",fimTurma!F51-fimTurma!E51)","v":""},"",{"$f":"IF(OR(F51=\"\",fimTurma!G51=\"\"),\"\",VLOOKUP(fimTurma!G51,References!A$3:J$78,F51,0))","v":""},{"$f":"IF(OR(F51=\"\",fimTurma!H51=\"\"),\"\",IF(fimTurma!D51=\"Menino\",VLOOKUP(fimTurma!H51,References!A$103:J$208,F51,0),VLOOKUP(fimTurma!H51,References!A$303:J$413,F51,0)))","v":""},{"$f":"IF(OR(F51=\"\",fimTurma!I51=\"\"),\"\",VLOOKUP(fimTurma!I51,References!A$503:J$575,F51,0))","v":""},{"$f":"IF(OR(F51=\"\",fimTurma!J51=\"\"),\"\",IF(fimTurma!D51=\"Menino\",VLOOKUP(fimTurma!J51,References!A$603:J$681,F51,0),VLOOKUP(fimTurma!J51,References!A$803:J$881,F51,0)))","v":""},"",{"$f":"IF(K51=\"\",\"\",VLOOKUP(K51,References!A$903:B$1362,2,))","v":""},"",{"$f":"IF(L51=\"\",\"\",VLOOKUP(L51,References!A$1403:B$1903,2,0))","v":""},"",""]
[{"$f":"IF(fimTurma!B52<>\"\",fimTurma!B52,\"\")","v":""},{"$f":"fimTurma!A52","v":49},{"$f":"IF(fimTurma!C52=0,\"\",fimTurma!C52)","v":""},{"$f":"IF(OR(fimTurma!E52=\"\",fimTurma!F52=\"\"),\"\",(fimTurma!F52-fimTurma!E52)/365.25)","v":""},{"$f":"IF(OR(fimTurma!E52=\"\",fimTurma!F52=\"\"),\"\",fimTurma!F52-fimTurma!E52)","v":""},"",{"$f":"IF(OR(F52=\"\",fimTurma!G52=\"\"),\"\",VLOOKUP(fimTurma!G52,References!A$3:J$78,F52,0))","v":""},{"$f":"IF(OR(F52=\"\",fimTurma!H52=\"\"),\"\",IF(fimTurma!D52=\"Menino\",VLOOKUP(fimTurma!H52,References!A$103:J$208,F52,0),VLOOKUP(fimTurma!H52,References!A$303:J$413,F52,0)))","v":""},{"$f":"IF(OR(F52=\"\",fimTurma!I52=\"\"),\"\",VLOOKUP(fimTurma!I52,References!A$503:J$575,F52,0))","v":""},{"$f":"IF(OR(F52=\"\",fimTurma!J52=\"\"),\"\",IF(fimTurma!D52=\"Menino\",VLOOKUP(fimTurma!J52,References!A$603:J$681,F52,0),VLOOKUP(fimTurma!J52,References!A$803:J$881,F52,0)))","v":""},"",{"$f":"IF(K52=\"\",\"\",VLOOKUP(K52,References!A$903:B$1362,2,))","v":""},"",{"$f":"IF(L52=\"\",\"\",VLOOKUP(L52,References!A$1403:B$1903,2,0))","v":""},"",""]
[{"$f":"IF(fimTurma!B53<>\"\",fimTurma!B53,\"\")","v":""},{"$f":"fimTurma!A53","v":50},{"$f":"IF(fimTurma!C53=0,\"\",fimTurma!C53)","v":""},{"$f":"IF(OR(fimTurma!E53=\"\",fimTurma!F53=\"\"),\"\",(fimTurma!F53-fimTurma!E53)/365.25)","v":""},{"$f":"IF(OR(fimTurma!E53=\"\",fimTurma!F53=\"\"),\"\",fimTurma!F53-fimTurma!E53)","v":""},"",{"$f":"IF(OR(F53=\"\",fimTurma!G53=\"\"),\"\",VLOOKUP(fimTurma!G53,References!A$3:J$78,F53,0))","v":""},{"$f":"IF(OR(F53=\"\",fimTurma!H53=\"\"),\"\",IF(fimTurma!D53=\"Menino\",VLOOKUP(fimTurma!H53,References!A$103:J$208,F53,0),VLOOKUP(fimTurma!H53,References!A$303:J$413,F53,0)))","v":""},{"$f":"IF(OR(F53=\"\",fimTurma!I53=\"\"),\"\",VLOOKUP(fimTurma!I53,References!A$503:J$575,F53,0))","v":""},{"$f":"IF(OR(F53=\"\",fimTurma!J53=\"\"),\"\",IF(fimTurma!D53=\"Menino\",VLOOKUP(fimTurma!J53,References!A$603:J$681,F53,0),VLOOKUP(fimTurma!J53,References!A$803:J$881,F53,0)))","v":""},"",{"$f":"IF(K53=\"\",\"\",VLOOKUP(K53,References!A$903:B$1362,2,))","v":""},"",{"$f":"IF(L53=\"\",\"\",VLOOKUP(L53,References!A$1403:B$1903,2,0))","v":""},"",""]

{"sheet":"fimRelatório","index":7,"n_rows":22,"n_cols":8,"rows_kept":22,"cut":false,"hidden":false,"merged":[[17,0,18,0],[17,1,18,1]]}
["RELATÓRIO INDIVIDUAL DA COORDENAÇÃO MOTORA"]
[{"$f":"IF(fimTurma!A2=1,VLOOKUP(\"x\",fimTurma!B$4:M$53,2,0),\"\")","v":"Teresa Martinho"}]
[{"$f":"IF(fimTurma!A2=1,_xlfn.CONCAT(TEXT(VLOOKUP(\"x\",fimTurma!B$4:M$53,4,0),\"dd-mm-aaaa\"),\" | \",fimTurma!C1,\"º ano\",\" | \",fimTurma!C2),\"\")","v":"10-07-2012 | 3º ano | B"}]
[]
[null,"Pontuação",null,"Média",null,"Mínimo",null,"Máximo"]
[null,"da criança",null,"da turma",null,"da turma",null,"da turma"]
[{"$f":"IF(fimTurma!$A$2=1,Auxiliar!C3,\"\")","v":"Transposição lateral"},{"$f":"IF(fimTurma!$A$2=1,VLOOKUP(\"x\",fimTurma!$B$4:$J$53,6,0),0)","v":50},null,{"$f":"IF(fimTurma!A2=1,fimTurma!G1,0)","v":37.5},null,{"$f":"IF(fimTurma!A2=1,SMALL(fimTurma!G4:G53,1),0)","v":32},null,{"$f":"IF(fimTurma!A2=1,LARGE(fimTurma!G4:G53,1),0)","v":50}]
[]
[{"$f":"IF(fimTurma!$A$2=1,Auxiliar!C4,\"\")","v":"Saltos laterais"},{"$f":"IF(fimTurma!$A$2=1,VLOOKUP(\"x\",fimTurma!$B$4:$J$53,7,0),0)","v":74},null,{"$f":"IF(fimTurma!A2=1,fimTurma!H1,0)","v":39.6},null,{"$f":"IF(fimTurma!A2=1,SMALL(fimTurma!H4:H53,1),0)","v":8},null,{"$f":"IF(fimTurma!A2=1,LARGE(fimTurma!H4:H53,1),0)","v":74}]
[]
[{"$f":"IF(fimTurma!$A$2=1,Auxiliar!C5,\"\")","v":"Equilíbrio à retaguarda"},{"$f":"IF(fimTurma!$A$2=1,VLOOKUP(\"x\",fimTurma!$B$4:$J$53,8,0),0)","v":70},null,{"$f":"IF(fimTurma!A2=1,fimTurma!I1,0)","v":59.8},null,{"$f":"IF(fimTurma!A2=1,SMALL(fimTurma!I4:I53,1),0)","v":50},null,{"$f":"IF(fimTurma!A2=1,LARGE(fimTurma!I4:I53,1),0)","v":70}]
[]
[{"$f":"IF(fimTurma!$A$2=1,Auxiliar!C6,\"\")","v":"Saltos monopedais"},{"$f":"IF(fimTurma!$A$2=1,VLOOKUP(\"x\",fimTurma!$B$4:$J$53,9,0),0)","v":58},null,{"$f":"IF(fimTurma!A2=1,fimTurma!J1,0)","v":56},null,{"$f":"IF(fimTurma!A2=1,SMALL(fimTurma!J4:J53,1),0)","v":50},null,{"$f":"IF(fimTurma!A2=1,LARGE(fimTurma!J4:J53,1),0)","v":60}]
[]
[]
["PONTUAÇÃO TOTAL",{"$f":"IF(fimTurma!$A2=1,B7+B9+B11+B13,0)","v":252},null,{"$f":"IF(fimTurma!$A2=1,D7+D9+D11+D13,0)","v":192.89999999999998},null,{"$f":"IF(fimTurma!$A2=1,F7+F9+F11+F13,0)","v":140},null,{"$f":"IF(fimTurma!$A2=1,H7+H9+H11+H13,0)","v":254}]
[null,null,null,null,null,"Nível coordenativo"]
["QUOCIENTE MOTOR",{"$f":"IF(fimTurma!A2=1,VLOOKUP(\"x\",fimKTK!A4:N53,12,0),0)","v":110},null,null,null,{"$f":"IF(fimTurma!A2=1,VLOOKUP(\"x\",fimKTK!A4:P53,15,0),\"\")","v":"Desempenho"}]
[null,null,null,null,null,{"$f":"IF(fimTurma!A2=1,VLOOKUP(\"x\",fimKTK!A4:P53,16,0),\"\")","v":"típico ou normal"}]
[]
[]
["Perfil"]

{"sheet":"profRelatório","index":8,"n_rows":13,"n_cols":11,"rows_kept":13,"cut":false,"hidden":false,"merged":[[3,2,3,4],[3,6,3,8]]}
["RELATÓRIO RESUMO PARA O PROFESSOR/TREINADOR"]
[{"$f":"_xlfn.CONCAT(fimTurma!C1,\"º ano\",\" | \",fimTurma!C2)","v":"3º ano | B"}]
[]
[null,null,"Início do Ano",null,null,null,"Fim do Ano",null,null,null,"Melhoria"]
[null,null,"Média",null,"Desvio",null,"Média",null,"Desvio",null,"Com"]
[null,null,null,null,"Padrão",null,null,null,"Padrão",null,"Significado?"]
[{"$f":"IF(fimTurma!A2=1,IFERROR(VLOOKUP(1,Auxiliar!B3:M6,2,0),\"\"),\"\")","v":"Saltos monopedais"},null,{"$f":"IF(fimTurma!$A$2=1,IFERROR(VLOOKUP(1,Auxiliar!$B$3:$M$6,4,0),0),0)","v":36},null,{"$f":"IF(fimTurma!$A$2=1,IFERROR(VLOOKUP(1,Auxiliar!$B$3:$P$6,14,0),0),0)","v":22.054478003344354},null,{"$f":"IF(fimTurma!$A$2=1,IFERROR(VLOOKUP(1,Auxiliar!$B$3:$P$6,10,0),0),0)","v":56},null,{"$f":"IF(fimTurma!$A$2=1,IFERROR(VLOOKUP(1,Auxiliar!$B$3:$P$6,15,0),0),0)","v":3.40587727318528},null,{"$f":"IF(fimTurma!$A$2=1,IFERROR(VLOOKUP(1,Auxiliar!$B$3:$S$6,18,0),0),0)","v":"Não"}]
[]
[{"$f":"IF(fimTurma!A2=1,IFERROR(VLOOKUP(2,Auxiliar!B3:M6,2,0),\"\"),\"\")","v":"Equilíbrio à retaguarda"},null,{"$f":"IF(fimTurma!$A$2=1,IFERROR(VLOOKUP(2,Auxiliar!$B$3:$M$6,4,0),0),0)","v":32.799999999999997},null,{"$f":"IF(fimTurma!$A$2=1,IFERROR(VLOOKUP(2,Auxiliar!$B$3:$P$6,14,0),0),0)","v":13.044539087296261},null,{"$f":"IF(fimTurma!$A$2=1,IFERROR(VLOOKUP(2,Auxiliar!$B$3:$P$6,10,0),0),0)","v":59.8},null,{"$f":"IF(fimTurma!$A$2=1,IFERROR(VLOOKUP(2,Auxiliar!$B$3:$P$6,15,0),0),0)","v":7.0823724838503095},null,{"$f":"IF(fimTurma!$A$2=1,IFERROR(VLOOKUP(2,Auxiliar!$B$3:$S$6,18,0),0),0)","v":"Sim"}]
[]
[{"$f":"IF(fimTurma!A2=1,IFERROR(VLOOKUP(3,Auxiliar!B3:M6,2,0),\"\"),\"\")","v":"Saltos laterais"},null,{"$f":"IF(fimTurma!$A$2=1,IFERROR(VLOOKUP(3,Auxiliar!$B$3:$M$6,4,0),0),0)","v":37},null,{"$f":"IF(fimTurma!$A$2=1,IFERROR(VLOOKUP(3,Auxiliar!$B$3:$P$6,14,0),0),0)","v":25.680732076792516},null,{"$f":"IF(fimTurma!$A$2=1,IFERROR(VLOOKUP(3,Auxiliar!$B$3:$P$6,10,0),0),0)","v":39.6},null,{"$f":"IF(fimTurma!$A$2=1,IFERROR(VLOOKUP(3,Auxiliar!$B$3:$P$6,15,0),0),0)","v":22.222511109233356},null,{"$f":"IF(fimTurma!$A$2=1,IFERROR(VLOOKUP(3,Auxiliar!$B$3:$S$6,18,0),0),0)","v":"Não"}]
[]
[{"$f":"IF(fimTurma!A2=1,IFERROR(VLOOKUP(4,Auxiliar!B3:M6,2,0),\"\"),\"\")","v":"Transposição lateral"},null,{"$f":"IF(fimTurma!$A$2=1,IFERROR(VLOOKUP(4,Auxiliar!$B$3:$M$6,4,0),0),0)","v":43.4},null,{"$f":"IF(fimTurma!$A$2=1,IFERROR(VLOOKUP(4,Auxiliar!$B$3:$P$6,14,0),0),0)","v":6.6513156593263565},null,{"$f":"IF(fimTurma!$A$2=1,IFERROR(VLOOKUP(4,Auxiliar!$B$3:$P$6,10,0),0),0)","v":37.5},null,{"$f":"IF(fimTurma!$A$2=1,IFERROR(VLOOKUP(4,Auxiliar!$B$3:$P$6,15,0),0),0)","v":7.2972597596632118},null,{"$f":"IF(fimTurma!$A$2=1,IFERROR(VLOOKUP(4,Auxiliar!$B$3:$S$6,18,0),0),0)","v":"Não"}]

{"sheet":"profPorTeste","index":9,"n_rows":5,"n_cols":1,"rows_kept":5,"cut":false,"hidden":false,"merged":[]}
["RELATÓRIO POR TESTE PARA O PROFESSOR/TREINADOR"]
[{"$f":"_xlfn.CONCAT(fimTurma!C1,\"º ano\",\" | \",fimTurma!C2)","v":"3º ano | B"}]
[]
[]
["Teste: Transposi&#231;&#227;o lateral"]