{"text_format":"1","workbook":"xlsx","n_sheets":10,"sheets":["iniTurma","iniRelatório","iniKTK","References","Auxiliar","fimTurma","fimKTK","fimRelatório","profRelatório","profPorTeste"],"not_rendered":{"charts":0,"images":11,"macros":1,"external_links":0,"defined_names":0,"comments":2,"pivot_tables":0},"unopened":[],"bounds":{"document_bytes":16777216,"sheet_cells":100000,"rows_first":2000,"rows_last":500,"rows_between":2000,"halvings":0,"cell_chars":16384,"cell_head_chars":4096},"cells_cut":0,"cells_raw":0,"read":"whole","date_system":"1900"}

{"sheet":"iniTurma","index":0,"n_rows":53,"n_cols":10,"rows_kept":53,"cut":false,"hidden":false,"merged":[]}
[null,"Ano:",3,null,null,"Média:",{"$f":"IF(COUNTA(G4:G53)>0,AVERAGE(G4:G53),\"\")","v":43.4},{"$f":"IF(COUNTA(H4:H53)>0,AVERAGE(H4:H53),\"\")","v":37},32.799999999999997,36]
[{"$f":"COUNTIF(B4:B53,\"x\")","v":1},"Turma:","B",null,null,"Desvio-padrão:",{"$f":"IF(COUNTA(G4:G53)>0,_xlfn.STDEV.P(G4:G53),\"\")","v":6.6513156593263565},{"$f":"IF(COUNTA(H4:H53)>0,_xlfn.STDEV.P(H4:H53),\"\")","v":25.680732076792516},13.044539087296261,22.054478003344354]
["ID Aluno",{"$f":"_xlfn.CONCAT(\"Ver: \",COUNTIF(B4:B53,\"x\"))","v":"Ver: 1"},"Nome","Género","Data Nascimento","Data Avaliação","TL_Ponto","SL_Ponto","EQ_Ponto","SM_Ponto"]
[1,null,"Maria Adelaide","Menina","2000-01-01","2007-01-01",35,8,25,63]
[{"$f":"A4+1","v":2},null,"Manuel Silva","Menino","2000-01-01","2007-01-01",45,null,54,63]
[{"$f":"A5+1","v":3},"x","Pedro Silva","Menino","2015-03-11","2022-05-30",40,45,22,18]
{"$rows_left_out":48}
{"sheet":"iniRelatório","index":1,"n_rows":22,"n_cols":8,"rows_kept":22,"cut":false,"hidden":false,"merged":[[17,1,18,1],[17,0,18,0]]}
["RELATÓRIO INDIVIDUAL DA COORDENAÇÃO MOTORA"]
[{"$f":"IF(iniTurma!A2=1,VLOOKUP(\"x\",iniTurma!B$4:M$53,2,0),\"\")","v":"Pedro Silva"}]
[{"$f":"IF(iniTurma!A2=1,_xlfn.CONCAT(TEXT(VLOOKUP(\"x\",iniTurma!B$4:M$53,4,0),\"dd-mm-aaaa\"),\" | \",iniTurma!C1,\"º ano\",\" | \",iniTurma!C2),\"\")","v":"11-03-2015 | 3º ano | B"}]
[]
[null,"Pontuação",null,"Média",null,"Mínimo",null,"Máximo"]
[null,"da criança",null,"da turma",null,"da turma",null,"da turma"]
{"$rows_left_out":17}
{"sheet":"iniKTK","index":2,"n_rows":53,"n_cols":16,"rows_kept":53,"cut":false,"hidden":true,"merged":[]}
[null,"Ano:",{"$f":"IF(iniTurma!C1=0,\"\",iniTurma!C1)","v":3}]
[null,"Turma:",{"$f":"IF(iniTurma!C2=0,\"\",iniTurma!C2)","v":"B"}]
[{"$f":"iniTurma!B3","v":"Ver: 1"},"ID Aluno","Nome","Idade decimal","Idade KTK","Coluna Idade","TL_Cof","SL_Cof","EQ_Cof","SM_Cof","Soma_KTK","MQ_KTK","Nível_KTK","Percentil_KTK"]
[{"$f":"IF(iniTurma!B4<>\"\",iniTurma!B4,\"\")","v":""},{"$f":"iniTurma!A4","v":1},{"$f":"IF(iniTurma!C4=0,\"\",iniTurma!C4)","v":"Maria Adelaide"},{"$f":"IF(OR(iniTurma!E4=\"\",iniTurma!F4=\"\"),\"\",(iniTurma!F4-iniTurma!E4)/365.25)","v":7.0006844626967828},{"$f":"IF(OR(iniTurma!E4=\"\",iniTurma!F4=\"\"),\"\",iniTurma!F4-iniTurma!E4)","v":2557},{"$f":"IF(AND(E4>1000,E4<2192),2, IF(AND(E4>= 2192,E4<2557),3, IF(AND(E4>=2557,E4<2922),4, IF(AND(E4>=2922,E4<3287),5, IF(AND(E4>=3287,E4<3653),6, IF(AND(E4>=3653,E4<4018),7, IF(AND(E4>=4018,E4<4383),8, IF(AND(E4>=4383,E4<4748),9, IF(AND(E4>=4748,E4<5478),10,\"\") ) ) ) ) ) ) ) )","v":4},{"$f":"IF(OR(F4=\"\",iniTurma!G4=\"\"),\"\",VLOOKUP(iniTurma!G4,References!A$3:J$78,F4,0))","v":98},{"$f":"IF(OR(F4=\"\",iniTurma!H4=\"\"),\"\",IF(iniTurma!D4=\"Menino\",VLOOKUP(iniTurma!H4,References!A$103:J$208,F4,0),VLOOKUP(iniTurma!H4,References!A$303:J$413,F4,0)))","v":50},{"$f":"IF(OR(F4=\"\",iniTurma!I4=\"\"),\"\",VLOOKUP(iniTurma!I4,References!A$503:J$575,F4,0))","v":82},{"$f":"IF(OR(F4=\"\",iniTurma!J4=\"\"),\"\",IF(iniTurma!D4=\"Menino\",VLOOKUP(iniTurma!J4,References!A$603:J$681,F4,0),VLOOKUP(iniTurma!J4,References!A$803:J$881,F4,0)))","v":132},{"$f":"IF(OR(G4=\"\",OR(H4=\"\",OR(I4=\"\",J4=\"\"))),\"\",G4+H4+I4+J4)","v":362},{"$f":"IF(K4=\"\",\"\",VLOOKUP(K4,References!A$903:B$1362,2,))","v":88},{"$f":"IF(L4=\"\",\"\",IF(AND(40<=L4,L4<=70),\"Perturbação da coordenação\", IF(AND(71<=L4,L4<=85),\"Desempenho coordenativo insuficiente\", IF(AND(86<=L4,L4<=115),\"Desempenho coordenativo típico ou normal\", IF(AND(116<=L4,L4<=130),\"Bom desempenho coordenativo\", IF(AND(131<=L4,L4<=145),\"Elevado desempenho coordenativo\", \"\") ) ) )))","v":"Desempenho coordenativo típico ou normal"},{"$f":"IF(L4=\"\",\"\",VLOOKUP(L4,References!A$1403:B$1903,2,0))","v":21},{"$f":"IF(L4=\"\",\"\",IF(AND(40<=L4,L4<=70),\"Perturbação da\", IF(AND(71<=L4,L4<=85),\"Desempenho\", IF(AND(86<=L4,L4<=115),\"Desempenho\", IF(AND(116<=L4,L4<=130),\"Bom desempenho\", IF(AND(131<=L4,L4<=145),\"Elevado\", \"\") ) ) )))","v":"Desempenho"},{"$f":"IF(L4=\"\",\"\",IF(AND(40<=L4,L4<=70),\"coordenação\", IF(AND(71<=L4,L4<=85),\"insuficiente\", IF(AND(86<=L4,L4<=115),\"típico ou normal\", IF(AND(116<=L4,L4<=130),\"coordenativo\", IF(AND(131<=L4,L4<=145),\"desempenho\", \"\") ) ) )))","v":"típico ou normal"}]
[{"$f":"IF(iniTurma!B5<>\"\",iniTurma!B5,\"\")","v":""},{"$f":"iniTurma!A5","v":2},{"$f":"IF(iniTurma!C5=0,\"\",iniTurma!C5)","v":"Manuel Silva"},{"$f":"IF(OR(iniTurma!E5=\"\",iniTurma!F5=\"\"),\"\",(iniTurma!F5-iniTurma!E5)/365.25)","v":7.0006844626967828},{"$f":"IF(OR(iniTurma!E5=\"\",iniTurma!F5=\"\"),\"\",iniTurma!F5-iniTurma!E5)","v":2557},{"$f":"IF(AND(E5>1000,E5<2192),2, IF(AND(E5>= 2192,E5<2557),3, IF(AND(E5>=2557,E5<2922),4, IF(AND(E5>=2922,E5<3287),5, IF(AND(E5>=3287,E5<3653),6, IF(AND(E5>=3653,E5<4018),7, IF(AND(E5>=4018,E5<4383),8, IF(AND(E5>=4383,E5<4748),9, IF(AND(E5>=4748,E5<5478),10,\"\") ) ) ) ) ) ) ) )","v":4},{"$f":"IF(OR(F5=\"\",iniTurma!G5=\"\"),\"\",VLOOKUP(iniTurma!G5,References!A$3:J$78,F5,0))","v":122},{"$f":"IF(OR(F5=\"\",iniTurma!H5=\"\"),\"\",IF(iniTurma!D5=\"Menino\",VLOOKUP(iniTurma!H5,References!A$103:J$208,F5,0),VLOOKUP(iniTurma!H5,References!A$303:J$413,F5,0)))","v":""},{"$f":"IF(OR(F5=\"\",iniTurma!I5=\"\"),\"\",VLOOKUP(iniTurma!I5,References!A$503:J$575,F5,0))","v":114},{"$f":"IF(OR(F5=\"\",iniTurma!J5=\"\"),\"\",IF(iniTurma!D5=\"Menino\",VLOOKUP(iniTurma!J5,References!A$603:J$681,F5,0),VLOOKUP(iniTurma!J5,References!A$803:J$881,F5,0)))","v":132},{"$f":"IF(OR(G5=\"\",OR(H5=\"\",OR(I5=\"\",J5=\"\"))),\"\",G5+H5+I5+J5)","v":""},{"$f":"IF(K5=\"\",\"\",VLOOKUP(K5,References!A$903:B$1362,2,))","v":""},{"$f":"IF(L5=\"\",\"\",IF(AND(40<=L5,L5<=70),\"Perturbação da coordenação\", IF(AND(71<=L5,L5<=85),\"Desempenho coordenativo insuficiente\", IF(AND(86<=L5,L5<=115),\"Desempenho coordenativo típico ou normal\", IF(AND(116<=L5,L5<=130),\"Bom desempenho coordenativo\", IF(AND(131<=L5,L5<=145),\"Elevado desempenho coordenativo\", \"\") ) ) )))","v":""},{"$f":"IF(L5=\"\",\"\",VLOOKUP(L5,References!A$1403:B$1903,2,0))","v":""},{"$f":"IF(L5=\"\",\"\",IF(AND(40<=L5,L5<=70),\"Perturbação da\", IF(AND(71<=L5,L5<=85),\"Desempenho\", IF(AND(86<=L5,L5<=115),\"Desempenho\", IF(AND(116<=L5,L5<=130),\"Bom desempenho\", IF(AND(131<=L5,L5<=145),\"Elevado\", \"\") ) ) )))","v":""},{"$f":"IF(L5=\"\",\"\",IF(AND(40<=L5,L5<=70),\"coordenação\", IF(AND(71<=L5,L5<=85),\"insuficiente\", IF(AND(86<=L5,L5<=115),\"típico ou normal\", IF(AND(116<=L5,L5<=130),\"coordenativo\", IF(AND(131<=L5,L5<=145),\"desempenho\", \"\") ) ) )))","v":""}]
[{"$f":"IF(iniTurma!B6<>\"\",iniTurma!B6,\"\")","v":"x"},{"$f":"iniTurma!A6","v":3},{"$f":"IF(iniTurma!C6=0,\"\",iniTurma!C6)","v":"Pedro Silva"},{"$f":"IF(OR(iniTurma!E6=\"\",iniTurma!F6=\"\"),\"\",(iniTurma!F6-iniTurma!E6)/365.25)","v":7.2197125256673509},{"$f":"IF(OR(iniTurma!E6=\"\",iniTurma!F6=\"\"),\"\",iniTurma!F6-iniTurma!E6)","v":2637},4,{"$f":"IF(OR(F6=\"\",iniTurma!G6=\"\"),\"\",VLOOKUP(iniTurma!G6,References!A$3:J$78,F6,0))","v":110},{"$f":"IF(OR(F6=\"\",iniTurma!H6=\"\"),\"\",IF(iniTurma!D6=\"Menino\",VLOOKUP(iniTurma!H6,References!A$103:J$208,F6,0),VLOOKUP(iniTurma!H6,References!A$303:J$413,F6,0)))","v":113},{"$f":"IF(OR(F6=\"\",iniTurma!I6=\"\"),\"\",VLOOKUP(iniTurma!I6,References!A$503:J$575,F6,0))","v":79},{"$f":"IF(OR(F6=\"\",iniTurma!J6=\"\"),\"\",IF(iniTurma!D6=\"Menino\",VLOOKUP(iniTurma!J6,References!A$603:J$681,F6,0),VLOOKUP(iniTurma!J6,References!A$803:J$881,F6,0)))","v":82},384,{"$f":"IF(K6=\"\",\"\",VLOOKUP(K6,References!A$903:B$1362,2,))","v":95},"Desempenho coordenativo típico ou normal",{"$f":"IF(L6=\"\",\"\",VLOOKUP(L6,References!A$1403:B$1903,2,0))","v":36},"Desempenho","típico ou normal"]
{"$rows_left_out":48}
{"sheet":"References","index":3,"n_rows":2007,"n_cols":10,"rows_kept":2007,"cut":false,"hidden":true,"merged":[[800,1,800,9],[0,1,0,9],[100,1,100,9],[300,1,300,9],[500,1,500,9],[600,1,600,9]]}
[null,"Meninas ou Meninos"]
["TL_Ponto","< 6 anos","6 anos","7 anos","8 anos","9 anos","10 anos","11 anos","12 anos","> 12 anos"]
[1,50,44,39,35,31,27,23,20,16]
[2,51,45,40,36,32,28,24,21,18]
[3,52,46,41,37,33,29,26,22,19]
[4,53,47,42,38,34,31,27,24,20]
{"$rows_left_out":2002}
{"sheet":"Auxiliar","index":4,"n_rows":6,"n_cols":21,"rows_kept":6,"cut":false,"hidden":true,"merged":[]}
["Número","Ordem","Teste","iniCriança","iniMédia","iniMínimo","iniMáximo",null,"Nome Gráfico","fimCriança","fimMédia","fimMínimo","fimMáximo","Melhor","Desvio","Padrão","DifMédia","Teste T","Conclusão","Num Suj","Num Suj"]
[null,0,null,null,null,null,null,null,null,null,null,null,null,null,"ini","fim",null,null,null,"ini","fim"]
[null,4,"Transposição lateral",{"$f":"IF(iniTurma!$A$2=1,VLOOKUP(\"x\",iniTurma!$B$4:$J$53,6,0),\"\")","v":40},{"$f":"IF(iniTurma!$A$2=1,iniTurma!$G$1,\"\")","v":43.4},{"$f":"IF(iniTurma!$A$2=1,SMALL(iniTurma!$G$4:$G53,1),\"\")","v":35},{"$f":"IF(iniTurma!$A$2=1,LARGE(iniTurma!$G$4:$G53,1),\"\")","v":55},null,"Transposição lateral",{"$f":"IF(fimTurma!$A$2=1,VLOOKUP(\"x\",fimTurma!$B$4:$J$53,6,0),\"\")","v":50},{"$f":"IF(fimTurma!$A$2=1,fimTurma!$G$1,\"\")","v":37.5},{"$f":"IF(fimTurma!$A$2=1,SMALL(fimTurma!$G$4:$G53,1),\"\")","v":32},{"$f":"IF(fimTurma!$A$2=1,LARGE(fimTurma!$G$4:$G53,1),\"\")","v":50},1,{"$f":"IF(iniTurma!$A$2=1,iniTurma!$G$2,\"\")","v":6.6513156593263565},{"$f":"IF(fimTurma!$A$2=1,fimTurma!$G$2,\"\")","v":7.2972597596632118},{"$f":"IF(AND(E3<>\"\",K3<>\"\"),K3-E3,\"\")","v":-5.8999999999999986},{"$f":"IF(AND(K3<>\"\",E3<>\"\"),IFERROR(_xlfn.T.TEST(iniTurma!G$4:G$53,fimTurma!G$4:G$53,1,1),_xlfn.T.TEST(iniTurma!G$4:G$53,fimTurma!G$4:G$53,1,2)),\"\")","v":5.1329175200286077E-2},{"$f":"IF(AND(E3<>\"\",K3<>\"\"),IF(N3*Q3<=0,\"Não\",IF(R3>=0.05,\"Não\",\"Sim\")),\"\")","v":"Não"},{"$f":"IF(iniTurma!$A$2=1,COUNTIF(iniTurma!G4:G53,\">0\"),\"\")","v":5},{"$f":"IF(fimTurma!$A$2=1,COUNTIF(fimTurma!G4:G53,\">0\"),\"\")","v":4}]
[null,3,"Saltos laterais",{"$f":"IF(iniTurma!$A$2=1,VLOOKUP(\"x\",iniTurma!$B$4:$J$53,7,0),\"\")","v":45},{"$f":"IF(iniTurma!$A$2=1,iniTurma!$H$1,\"\")","v":37},{"$f":"IF(iniTurma!$A$2=1,SMALL(iniTurma!$H$4:$H53,1),\"\")","v":8},{"$f":"IF(iniTurma!$A$2=1,LARGE(iniTurma!$H$4:$H53,1),\"\")","v":75},null,"Saltos laterais",{"$f":"IF(fimTurma!$A$2=1,VLOOKUP(\"x\",fimTurma!$B$4:$J$53,7,0),\"\")","v":74},{"$f":"IF(fimTurma!$A$2=1,fimTurma!$H$1,\"\")","v":39.6},{"$f":"IF(fimTurma!$A$2=1,SMALL(fimTurma!$H$4:$H54,1),\"\")","v":8},{"$f":"IF(fimTurma!$A$2=1,LARGE(fimTurma!$H$4:$H54,1),\"\")","v":74},1,{"$f":"IF(iniTurma!$A$2=1,iniTurma!$H$2,\"\")","v":25.680732076792516},{"$f":"IF(fimTurma!$A$2=1,fimTurma!$H$2,\"\")","v":22.222511109233356},{"$f":"IF(AND(E4<>\"\",K4<>\"\"),K4-E4,\"\")","v":2.6000000000000014},{"$f":"IF(AND(K3<>\"\",E3<>\"\"),IFERROR(_xlfn.T.TEST(iniTurma!H$4:H$53,fimTurma!H$4:H$53,1,1),_xlfn.T.TEST(iniTurma!H$4:H$53,fimTurma!H$4:H$53,1,2)),\"\")","v":0.318809045700302},{"$f":"IF(AND(E4<>\"\",K4<>\"\"),IF(N4*Q4<=0,\"Não\",IF(R4>=0.05,\"Não\",\"Sim\")),\"\")","v":"Não"},{"$f":"IF(iniTurma!$A$2=1,COUNTIF(iniTurma!H4:H53,\">0\"),\"\")","v":4},{"$f":"IF(fimTurma!$A$2=1,COUNTIF(fimTurma!H4:H53,\">0\"),\"\")","v":5}]
[null,2,"Equilíbrio à retaguarda",{"$f":"IF(iniTurma!$A$2=1,VLOOKUP(\"x\",iniTurma!$B$4:$J$53,8,0),\"\")","v":22},{"$f":"IF(iniTurma!$A$2=1,iniTurma!$I$1,\"\")","v":32.799999999999997},{"$f":"IF(iniTurma!$A$2=1,SMALL(iniTurma!$I$4:$I53,1),\"\")","v":21},{"$f":"IF(iniTurma!$A$2=1,LARGE(iniTurma!$I$4:$I53,1),\"\")","v":54},null,"Equilíbrio à retaguarda",{"$f":"IF(fimTurma!$A$2=1,VLOOKUP(\"x\",fimTurma!$B$4:$J$53,8,0),\"\")","v":70},{"$f":"IF(fimTurma!$A$2=1,fimTurma!$I$1,\"\")","v":59.8},{"$f":"IF(fimTurma!$A$2=1,SMALL(fimTurma!$I$4:$I55,1),\"\")","v":50},{"$f":"IF(fimTurma!$A$2=1,LARGE(fimTurma!$I$4:$I55,1),\"\")","v":70},1,{"$f":"IF(iniTurma!$A$2=1,iniTurma!$I$2,\"\")","v":13.044539087296261},{"$f":"IF(fimTurma!$A$2=1,fimTurma!$I$2,\"\")","v":7.0823724838503095},27,{"$f":"IF(AND(K3<>\"\",E3<>\"\"),IFERROR(_xlfn.T.TEST(iniTurma!I$4:I$53,fimTurma!I$4:I$53,1,1),_xlfn.T.TEST(iniTurma!I$4:I$53,fimTurma!I$4:I$53,1,2)),\"\")","v":1.4572962461334698E-2},"Sim",{"$f":"IF(iniTurma!$A$2=1,COUNTIF(iniTurma!I4:I53,\">0\"),\"\")","v":5},{"$f":"IF(fimTurma!$A$2=1,COUNTIF(fimTurma!I4:I53,\">0\"),\"\")","v":5}]
[null,1,"Saltos monopedais",{"$f":"IF(iniTurma!$A$2=1,VLOOKUP(\"x\",iniTurma!$B$4:$J$53,9,0),\"\")","v":18},{"$f":"IF(iniTurma!$A$2=1,iniTurma!$J$1,\"\")","v":36},{"$f":"IF(iniTurma!$A$2=1,SMALL(iniTurma!$J$4:$J53,1),\"\")","v":17},{"$f":"IF(iniTurma!$A$2=1,LARGE(iniTurma!$J$4:$J53,1),\"\")","v":63},null,"Saltos monopedais",{"$f":"IF(fimTurma!$A$2=1,VLOOKUP(\"x\",fimTurma!$B$4:$J$53,9,0),\"\")","v":58},{"$f":"IF(fimTurma!$A$2=1,fimTurma!$J$1,\"\")","v":56},{"$f":"IF(fimTurma!$A$2=1,SMALL(fimTurma!$J$4:$J56,1),\"\")","v":50},{"$f":"IF(fimTurma!$A$2=1,LARGE(fimTurma!$J$4:$J56,1),\"\")","v":60},1,{"$f":"IF(iniTurma!$A$2=1,iniTurma!$J$2,\"\")","v":22.054478003344354},{"$f":"IF(fimTurma!$A$2=1,fimTurma!$J$2,\"\")","v":3.40587727318528},20,{"$f":"IF(AND(K3<>\"\",E3<>\"\"),IFERROR(_xlfn.T.TEST(iniTurma!J$4:J$53,fimTurma!J$4:J$53,1,1),_xlfn.T.TEST(iniTurma!J$4:J$53,fimTurma!J$4:J$53,1,2)),\"\")","v":7.9311466325716493E-2},"Não",{"$f":"IF(iniTurma!$A$2=1,COUNTIF(iniTurma!J4:J53,\">0\"),\"\")","v":5},{"$f":"IF(fimTurma!$A$2=1,COUNTIF(fimTurma!I4:I53,\">0\"),\"\")","v":5}]
{"$rows_left_out":1}
{"sheet":"fimTurma","index":5,"n_rows":53,"n_cols":10,"rows_kept":53,"cut":false,"hidden":false,"merged":[]}
[null,"Ano:",{"$f":"IF(iniTurma!C1=\"\",\"\",iniTurma!C1)","v":3},null,null,"Média:",{"$f":"IF(COUNTA(G4:G53)>0,AVERAGE(G4:G53),\"\")","v":37.5},{"$f":"IF(COUNTA(H4:H53)>0,AVERAGE(H4:H53),\"\")","v":39.6},59.8,56]
[{"$f":"COUNTIF(B4:B53,\"x\")","v":1},"Turma:",{"$f":"IF(iniTurma!C2=\"\",\"\",iniTurma!C2)","v":"B"},null,null,"Desvio-padrão:",{"$f":"IF(COUNTA(G4:G53)>0,_xlfn.STDEV.P(G4:G53),\"\")","v":7.2972597596632118},{"$f":"IF(COUNTA(H4:H53)>0,_xlfn.STDEV.P(H4:H53),\"\")","v":22.222511109233356},7.0823724838503095,3.40587727318528]
["ID Aluno",{"$f":"_xlfn.CONCAT(\"Ver: \",COUNTIF(B4:B53,\"x\"))","v":"Ver: 1"},"Nome","Género","Data Nascimento","Data Avaliação","TL_Ponto","SL_Ponto","EQ_Ponto","SM_Ponto"]
[1,null,{"$f":"IF(iniTurma!C4=0,\"\",iniTurma!C4)","v":"Maria Adelaide"},{"$f":"IF(iniTurma!D4=0,\"\",iniTurma!D4)","v":"Menina"},{"$f":"IF(iniTurma!E4=0,\"\",iniTurma!E4)","v":"2000-01-01"},"2007-05-01",35,8,59,50]
[{"$f":"A4+1","v":2},null,{"$f":"IF(iniTurma!C5=0,\"\",iniTurma!C5)","v":"Manuel Silva"},{"$f":"IF(iniTurma!D5=0,\"\",iniTurma!D5)","v":"Menino"},{"$f":"IF(iniTurma!E5=0,\"\",iniTurma!E5)","v":"2000-01-01"},"2007-05-01",32,47,50,60]
[{"$f":"A5+1","v":3},null,{"$f":"IF(iniTurma!C6=0,\"\",iniTurma!C6)","v":"Pedro Silva"},{"$f":"IF(iniTurma!D6=0,\"\",iniTurma!D6)","v":"Menino"},{"$f":"IF(iniTurma!E6=0,\"\",iniTurma!E6)","v":"2015-03-11"},"2022-08-30",33,44,65,55]
{"$rows_left_out":48}
{"sheet":"fimKTK","index":6,"n_rows":53,"n_cols":16,"rows_kept":53,"cut":false,"hidden":true,"merged":[]}
[null,"Ano:",{"$f":"IF(fimTurma!C1=0,\"\",fimTurma!C1)","v":3}]
[null,"Turma:",{"$f":"IF(fimTurma!C2=0,\"\",fimTurma!C2)","v":"B"}]
[{"$f":"fimTurma!B3","v":"Ver: 1"},"ID Aluno","Nome","Idade decimal","Idade KTK","Coluna Idade","TL_Cof","SL_Cof","EQ_Cof","SM_Cof","Soma_KTK","MQ_KTK","Nível_KTK","Percentil_KTK"]
[{"$f":"IF(fimTurma!B4<>\"\",fimTurma!B4,\"\")","v":""},{"$f":"fimTurma!A4","v":1},{"$f":"IF(fimTurma!C4=0,\"\",fimTurma!C4)","v":"Maria Adelaide"},{"$f":"IF(OR(fimTurma!E4=\"\",fimTurma!F4=\"\"),\"\",(fimTurma!F4-fimTurma!E4)/365.25)","v":7.3292265571526354},{"$f":"IF(OR(fimTurma!E4=\"\",fimTurma!F4=\"\"),\"\",fimTurma!F4-fimTurma!E4)","v":2677},{"$f":"IF(AND(E4>1000,E4<2192),2, IF(AND(E4>= 2192,E4<2557),3, IF(AND(E4>=2557,E4<2922),4, IF(AND(E4>=2922,E4<3287),5, IF(AND(E4>=3287,E4<3653),6, IF(AND(E4>=3653,E4<4018),7, IF(AND(E4>=4018,E4<4383),8, IF(AND(E4>=4383,E4<4748),9, IF(AND(E4>=4748,E4<5478),10,\"\") ) ) ) ) ) ) ) )","v":4},{"$f":"IF(OR(F4=\"\",fimTurma!G4=\"\"),\"\",VLOOKUP(fimTurma!G4,References!A$3:J$78,F4,0))","v":98},{"$f":"IF(OR(F4=\"\",fimTurma!H4=\"\"),\"\",IF(fimTurma!D4=\"Menino\",VLOOKUP(fimTurma!H4,References!A$103:J$208,F4,0),VLOOKUP(fimTurma!H4,References!A$303:J$413,F4,0)))","v":50},{"$f":"IF(OR(F4=\"\",fimTurma!I4=\"\"),\"\",VLOOKUP(fimTurma!I4,References!A$503:J$575,F4,0))","v":120},{"$f":"IF(OR(F4=\"\",fimTurma!J4=\"\"),\"\",IF(fimTurma!D4=\"Menino\",VLOOKUP(fimTurma!J4,References!A$603:J$681,F4,0),VLOOKUP(fimTurma!J4,References!A$803:J$881,F4,0)))","v":116},{"$f":"IF(OR(G4=\"\",OR(H4=\"\",OR(I4=\"\",J4=\"\"))),\"\",G4+H4+I4+J4)","v":384},{"$f":"IF(K4=\"\",\"\",VLOOKUP(K4,References!A$903:B$1362,2,))","v":95},{"$f":"IF(L4=\"\",\"\",IF(AND(40<=L4,L4<=70),\"Perturbação da coordenação\", IF(AND(71<=L4,L4<=85),\"Desempenho coordenativo insuficiente\", IF(AND(86<=L4,L4<=115),\"Desempenho coordenativo típico ou normal\", IF(AND(116<=L4,L4<=130),\"Bom desempenho coordenativo\", IF(AND(131<=L4,L4<=145),\"Elevado desempenho coordenativo\", \"\") ) ) )))","v":"Desempenho coordenativo típico ou normal"},{"$f":"IF(L4=\"\",\"\",VLOOKUP(L4,References!A$1403:B$1903,2,0))","v":36},{"$f":"IF(L4=\"\",\"\",IF(AND(40<=L4,L4<=70),\"Perturbação da\", IF(AND(71<=L4,L4<=85),\"Desempenho\", IF(AND(86<=L4,L4<=115),\"Desempenho\", IF(AND(116<=L4,L4<=130),\"Bom desempenho\", IF(AND(131<=L4,L4<=145),\"Elevado\", \"\") ) ) )))","v":"Desempenho"},{"$f":"IF(L4=\"\",\"\",IF(AND(40<=L4,L4<=70),\"coordenação\", IF(AND(71<=L4,L4<=85),\"insuficiente\", IF(AND(86<=L4,L4<=115),\"típico ou normal\", IF(AND(116<=L4,L4<=130),\"coordenativo\", IF(AND(131<=L4,L4<=145),\"desempenho\", \"\") ) ) )))","v":"típico ou normal"}]
[{"$f":"IF(fimTurma!B5<>\"\",fimTurma!B5,\"\")","v":""},{"$f":"fimTurma!A5","v":2},{"$f":"IF(fimTurma!C5=0,\"\",fimTurma!C5)","v":"Manuel Silva"},{"$f":"IF(OR(fimTurma!E5=\"\",fimTurma!F5=\"\"),\"\",(fimTurma!F5-fimTurma!E5)/365.25)","v":7.3292265571526354},{"$f":"IF(OR(fimTurma!E5=\"\",fimTurma!F5=\"\"),\"\",fimTurma!F5-fimTurma!E5)","v":2677},{"$f":"IF(AND(E5>1000,E5<2192),2, IF(AND(E5>= 2192,E5<2557),3, IF(AND(E5>=2557,E5<2922),4, IF(AND(E5>=2922,E5<3287),5, IF(AND(E5>=3287,E5<3653),6, IF(AND(E5>=3653,E5<4018),7, IF(AND(E5>=4018,E5<4383),8, IF(AND(E5>=4383,E5<4748),9, IF(AND(E5>=4748,E5<5478),10,\"\") ) ) ) ) ) ) ) )","v":4},{"$f":"IF(OR(F5=\"\",fimTurma!G5=\"\"),\"\",VLOOKUP(fimTurma!G5,References!A$3:J$78,F5,0))","v":91},{"$f":"IF(OR(F5=\"\",fimTurma!H5=\"\"),\"\",IF(fimTurma!D5=\"Menino\",VLOOKUP(fimTurma!H5,References!A$103:J$208,F5,0),VLOOKUP(fimTurma!H5,References!A$303:J$413,F5,0)))","v":116},{"$f":"IF(OR(F5=\"\",fimTurma!I5=\"\"),\"\",VLOOKUP(fimTurma!I5,References!A$503:J$575,F5,0))","v":110},{"$f":"IF(OR(F5=\"\",fimTurma!J5=\"\"),\"\",IF(fimTurma!D5=\"Menino\",VLOOKUP(fimTurma!J5,References!A$603:J$681,F5,0),VLOOKUP(fimTurma!J5,References!A$803:J$881,F5,0)))","v":128},{"$f":"IF(OR(G5=\"\",OR(H5=\"\",OR(I5=\"\",J5=\"\"))),\"\",G5+H5+I5+J5)","v":445},{"$f":"IF(K5=\"\",\"\",VLOOKUP(K5,References!A$903:B$1362,2,))","v":114},{"$f":"IF(L5=\"\",\"\",IF(AND(40<=L5,L5<=70),\"Perturbação da coordenação\", IF(AND(71<=L5,L5<=85),\"Desempenho coordenativo insuficiente\", IF(AND(86<=L5,L5<=115),\"Desempenho coordenativo típico ou normal\", IF(AND(116<=L5,L5<=130),\"Bom desempenho coordenativo\", IF(AND(131<=L5,L5<=145),\"Elevado desempenho coordenativo\", \"\") ) ) )))","v":"Desempenho coordenativo típico ou normal"},{"$f":"IF(L5=\"\",\"\",VLOOKUP(L5,References!A$1403:B$1903,2,0))","v":82},{"$f":"IF(L5=\"\",\"\",IF(AND(40<=L5,L5<=70),\"Perturbação da\", IF(AND(71<=L5,L5<=85),\"Desempenho\", IF(AND(86<=L5,L5<=115),\"Desempenho\", IF(AND(116<=L5,L5<=130),\"Bom desempenho\", IF(AND(131<=L5,L5<=145),\"Elevado\", \"\") ) ) )))","v":"Desempenho"},{"$f":"IF(L5=\"\",\"\",IF(AND(40<=L5,L5<=70),\"coordenação\", IF(AND(71<=L5,L5<=85),\"insuficiente\", IF(AND(86<=L5,L5<=115),\"típico ou normal\", IF(AND(116<=L5,L5<=130),\"coordenativo\", IF(AND(131<=L5,L5<=145),\"desempenho\", \"\") ) ) )))","v":"típico ou normal"}]
[{"$f":"IF(fimTurma!B6<>\"\",fimTurma!B6,\"\")","v":""},{"$f":"fimTurma!A6","v":3},{"$f":"IF(fimTurma!C6=0,\"\",fimTurma!C6)","v":"Pedro Silva"},{"$f":"IF(OR(fimTurma!E6=\"\",fimTurma!F6=\"\"),\"\",(fimTurma!F6-fimTurma!E6)/365.25)","v":7.4715947980835047},{"$f":"IF(OR(fimTurma!E6=\"\",fimTurma!F6=\"\"),\"\",fimTurma!F6-fimTurma!E6)","v":2729},4,{"$f":"IF(OR(F6=\"\",fimTurma!G6=\"\"),\"\",VLOOKUP(fimTurma!G6,References!A$3:J$78,F6,0))","v":93},{"$f":"IF(OR(F6=\"\",fimTurma!H6=\"\"),\"\",IF(fimTurma!D6=\"Menino\",VLOOKUP(fimTurma!H6,References!A$103:J$208,F6,0),VLOOKUP(fimTurma!H6,References!A$303:J$413,F6,0)))","v":111},{"$f":"IF(OR(F6=\"\",fimTurma!I6=\"\"),\"\",VLOOKUP(fimTurma!I6,References!A$503:J$575,F6,0))","v":126},{"$f":"IF(OR(F6=\"\",fimTurma!J6=\"\"),\"\",IF(fimTurma!D6=\"Menino\",VLOOKUP(fimTurma!J6,References!A$603:J$681,F6,0),VLOOKUP(fimTurma!J6,References!A$803:J$881,F6,0)))","v":123},453,{"$f":"IF(K6=\"\",\"\",VLOOKUP(K6,References!A$903:B$1362,2,))","v":117},"Bom desempenho coordenativo",{"$f":"IF(L6=\"\",\"\",VLOOKUP(L6,References!A$1403:B$1903,2,0))","v":87},"Bom desempenho","coordenativo"]
{"$rows_left_out":48}
{"sheet":"fimRelatório","index":7,"n_rows":22,"n_cols":8,"rows_kept":22,"cut":false,"hidden":false,"merged":[[17,0,18,0],[17,1,18,1]]}
["RELATÓRIO INDIVIDUAL DA COORDENAÇÃO MOTORA"]
[{"$f":"IF(fimTurma!A2=1,VLOOKUP(\"x\",fimTurma!B$4:M$53,2,0),\"\")","v":"Teresa Martinho"}]
[{"$f":"IF(fimTurma!A2=1,_xlfn.CONCAT(TEXT(VLOOKUP(\"x\",fimTurma!B$4:M$53,4,0),\"dd-mm-aaaa\"),\" | \",fimTurma!C1,\"º ano\",\" | \",fimTurma!C2),\"\")","v":"10-07-2012 | 3º ano | B"}]
[]
[null,"Pontuação",null,"Média",null,"Mínimo",null,"Máximo"]
[null,"da criança",null,"da turma",null,"da turma",null,"da turma"]
{"$rows_left_out":17}
{"sheet":"profRelatório","index":8,"n_rows":13,"n_cols":11,"rows_kept":13,"cut":false,"hidden":false,"merged":[[3,2,3,4],[3,6,3,8]]}
["RELATÓRIO RESUMO PARA O PROFESSOR/TREINADOR"]
[{"$f":"_xlfn.CONCAT(fimTurma!C1,\"º ano\",\" | \",fimTurma!C2)","v":"3º ano | B"}]
[]
[null,null,"Início do Ano",null,null,null,"Fim do Ano",null,null,null,"Melhoria"]
[null,null,"Média",null,"Desvio",null,"Média",null,"Desvio",null,"Com"]
[null,null,null,null,"Padrão",null,null,null,"Padrão",null,"Significado?"]
{"$rows_left_out":8}
{"sheet":"profPorTeste","index":9,"n_rows":5,"n_cols":1,"rows_kept":5,"cut":false,"hidden":false,"merged":[]}
["RELATÓRIO POR TESTE PARA O PROFESSOR/TREINADOR"]
[{"$f":"_xlfn.CONCAT(fimTurma!C1,\"º ano\",\" | \",fimTurma!C2)","v":"3º ano | B"}]
[]
[]
["Teste: Transposi&#231;&#227;o lateral"]