{"text_format":"1","workbook":"xlsx","n_sheets":6,"sheets":["Turma","Relatório","dadosPercentis","dadosZScore","mlsPeso","mlsBMI"],"not_rendered":{"charts":0,"images":6,"macros":1,"external_links":0,"defined_names":2,"comments":1,"pivot_tables":0},"unopened":[],"bounds":{"document_bytes":16777216,"sheet_cells":100000,"rows_first":2000,"rows_last":500,"rows_between":2000,"halvings":0,"cell_chars":16384,"cell_head_chars":4096},"cells_cut":0,"cells_raw":0,"read":"whole","date_system":"1900"}

{"sheet":"Turma","index":0,"n_rows":53,"n_cols":10,"rows_kept":53,"cut":false,"hidden":false,"merged":[]}
[null,"Ano:",2,null,null,"Média Global:",{"$f":"IF(COUNTA(G4:G53)>0,AVERAGE(G4:G53),\"\")","v":34.799999999999997},{"$f":"IF(COUNTA(H4:H53)>0,AVERAGE(H4:H53),\"\")","v":134.5},{"$f":"IF(COUNTA(I4:I53)>0,AVERAGE(I4:I53),\"\")","v":78},{"$f":"IF(COUNTA(J4:J53)>0,AVERAGE(J4:J53),\"\")","v":19.301267189568986}]
[{"$f":"COUNTIF(B4:B53,\"x\")","v":1},"Turma:","A",null,null,"Desvio Padrão Global:",{"$f":"IF(COUNTA(G4:G53)>0,_xlfn.STDEV.P(G4:G53),\"\")","v":4.4966654311834517},{"$f":"IF(COUNTA(H4:H53)>0,_xlfn.STDEV.P(H4:H53),\"\")","v":5.2201532544552753},{"$f":"IF(COUNTA(I4:I53)>0,_xlfn.STDEV.P(I4:I53),\"\")","v":6.1237243569579451},{"$f":"IF(COUNTA(J4:J53)>0,_xlfn.STDEV.P(J4:J53),\"\")","v":2.8874326266237369}]
["ID Aluno",{"$f":"_xlfn.CONCAT(\"Ver: \",A2)","v":"Ver: 1"},"Nome","Género","Data de nascimento","Data de avaliação","Peso","Altura","Idade","IMC"]
[1,null,"Manuel Lopes","Menino","2014-05-11","2020-08-07",32,134,{"$f":"IF(AND(E4<>\"\",F4<>\"\"),INT(12*_xlfn.DAYS(F4,E4)/365),\"\")","v":74},{"$f":"IF(H4<>0,G4/(H4/100*H4/100),\"\")","v":17.821341055914456}]
[{"$f":"A4+1","v":2},"x","Amélia Costa","Menina","2013-12-04","2020-08-07",40.200000000000003,129,{"$f":"IF(AND(E5<>\"\",F5<>\"\"),INT(12*_xlfn.DAYS(F5,E5)/365),\"\")","v":80},{"$f":"IF(H5<>0,G5/(H5/100*H5/100),\"\")","v":24.157202091220483}]
[{"$f":"A5+1","v":3},null,"Rui Silva","Menino","2014-08-10","2020-08-07",38,143,71,18.58281578561299]
[4,null,"Maria Santos","Menina","2012-01-01","2019-04-10",29,132,87,16.643709825528006]
[5,null,null,null,null,null,null,null,"",""]
[6,null,null,null,null,null,null,null,"",""]
[7,null,null,null,null,null,null,null,"",""]
{"$rows_left_out":44}
{"sheet":"Relatório","index":1,"n_rows":32,"n_cols":8,"rows_kept":32,"cut":false,"hidden":false,"merged":[[11,0,11,9],[13,0,13,6],[31,0,31,5]]}
["RELATÓRIO INDIVIDUAL - PESO E ÍNDICE DE MASSA CORPORAL"]
[{"$f":"IF(Turma!A2=1,VLOOKUP(\"x\",Turma!B4:G53,2,0),\"\")","v":"Amélia Costa"}]
[{"$f":"IF(Turma!A2=1,_xlfn.CONCAT(TEXT(VLOOKUP(\"x\",Turma!B$4:G$53,4,0),\"dd-mm-aaaa\"),\" | \",Turma!C1,\"º ano\",\" | \",Turma!C2),\"\")","v":"04-12-2013 | 2º ano | A"}]
[]
[null,"Resultado",null,"Média",null,"Mínimo",null,"Máximo"]
[null,"da criança",null,"da turma",null,"da turma",null,"da turma"]
["Peso (kg)",{"$f":"IF(Turma!$A$2=1,VLOOKUP(\"x\",Turma!B4:J53,6,0),0)","v":40.200000000000003},null,{"$f":"IF(Turma!$A$2=1,Turma!$G$1,0)","v":34.799999999999997},null,{"$f":"IF(Turma!$A$2=1,SMALL(Turma!$G$4:$G$53,1),0)","v":29},null,{"$f":"IF(Turma!$A$2=1,LARGE(Turma!$G$4:$G$53,1),0)","v":40.200000000000003}]
[]
["IMC (kg/m2)",{"$f":"IF(Turma!$A$2=1,VLOOKUP(\"x\",Turma!B4:J53,9,0),0)","v":24.157202091220483},null,{"$f":"IF(Turma!$A$2=1,Turma!$J$1,0)","v":19.301267189568986},null,{"$f":"IF(Turma!$A$2=1,SMALL(Turma!$J$4:$J$53,1),0)","v":16.643709825528006},null,{"$f":"IF(Turma!$A$2=1,SMALL(Turma!$J$4:$J$53,1),0)","v":16.643709825528006}]
[]
{"$rows_left_out":23}
{"sheet":"dadosPercentis","index":2,"n_rows":62,"n_cols":10,"rows_kept":62,"cut":false,"hidden":true,"merged":[]}
["meses","anos","P3","P15","P50","P85","P97","Género","Meses","Peso"]
[60,{"$f":"IF(A2/12=INT(A2/12),A2/12,\"\")","v":5},null,null,null,null,null,{"$f":"IF(Turma!A2=1,VLOOKUP(\"x\",Turma!B4:H53,3,0),\"\")","v":"Menina"},{"$f":"IF(Turma!A2=1,VLOOKUP(\"x\",Turma!B4:I53,8,0),\"\")","v":80},{"$f":"IF(Turma!A2=1,VLOOKUP(\"x\",Turma!B4:I53,6,0),\"\")","v":40.200000000000003}]
[61,{"$f":"IF(A3/12=INT(A3/12),A3/12,\"\")","v":""},{"$f":"IF(Turma!A$2=1,IF(VLOOKUP(\"x\",Turma!$B$4:$H$53,3,0)=\"Menina\",mlsPeso!J2,mlsPeso!J62),\"\")","v":14.173},{"$f":"IF(Turma!A$2=1,IF(VLOOKUP(\"x\",Turma!$B$4:$H$53,3,0)=\"Menina\",mlsPeso!M2,mlsPeso!M62),\"\")","v":15.821},{"$f":"IF(Turma!A$2=1,IF(VLOOKUP(\"x\",Turma!$B$4:$H$53,3,0)=\"Menina\",mlsPeso!O2,mlsPeso!O62),\"\")","v":18.257999999999999},{"$f":"IF(Turma!A$2=1,IF(VLOOKUP(\"x\",Turma!$B$4:$H$53,3,0)=\"Menina\",mlsPeso!Q2,mlsPeso!Q62),\"\")","v":21.288},{"$f":"IF(Turma!A$2=1,IF(VLOOKUP(\"x\",Turma!$B$4:$H$53,3,0)=\"Menina\",mlsPeso!T2,mlsPeso!T62),\"\")","v":24.335999999999999}]
[62,"",{"$f":"IF(Turma!A$2=1,IF(VLOOKUP(\"x\",Turma!$B$4:$H$53,3,0)=\"Menina\",mlsPeso!J3,mlsPeso!J63),\"\")","v":14.297000000000001},{"$f":"IF(Turma!A$2=1,IF(VLOOKUP(\"x\",Turma!$B$4:$H$53,3,0)=\"Menina\",mlsPeso!M3,mlsPeso!M63),\"\")","v":15.965},{"$f":"IF(Turma!A$2=1,IF(VLOOKUP(\"x\",Turma!$B$4:$H$53,3,0)=\"Menina\",mlsPeso!O3,mlsPeso!O63),\"\")","v":18.433},{"$f":"IF(Turma!A$2=1,IF(VLOOKUP(\"x\",Turma!$B$4:$H$53,3,0)=\"Menina\",mlsPeso!Q3,mlsPeso!Q63),\"\")","v":21.506},{"$f":"IF(Turma!A$2=1,IF(VLOOKUP(\"x\",Turma!$B$4:$H$53,3,0)=\"Menina\",mlsPeso!T3,mlsPeso!T63),\"\")","v":24.600999999999999}]
[63,"",{"$f":"IF(Turma!A$2=1,IF(VLOOKUP(\"x\",Turma!$B$4:$H$53,3,0)=\"Menina\",mlsPeso!J4,mlsPeso!J64),\"\")","v":14.420999999999999},{"$f":"IF(Turma!A$2=1,IF(VLOOKUP(\"x\",Turma!$B$4:$H$53,3,0)=\"Menina\",mlsPeso!M4,mlsPeso!M64),\"\")","v":16.108000000000001},{"$f":"IF(Turma!A$2=1,IF(VLOOKUP(\"x\",Turma!$B$4:$H$53,3,0)=\"Menina\",mlsPeso!O4,mlsPeso!O64),\"\")","v":18.606999999999999},{"$f":"IF(Turma!A$2=1,IF(VLOOKUP(\"x\",Turma!$B$4:$H$53,3,0)=\"Menina\",mlsPeso!Q4,mlsPeso!Q64),\"\")","v":21.722999999999999},{"$f":"IF(Turma!A$2=1,IF(VLOOKUP(\"x\",Turma!$B$4:$H$53,3,0)=\"Menina\",mlsPeso!T4,mlsPeso!T64),\"\")","v":24.866}]
[64,"",{"$f":"IF(Turma!A$2=1,IF(VLOOKUP(\"x\",Turma!$B$4:$H$53,3,0)=\"Menina\",mlsPeso!J5,mlsPeso!J65),\"\")","v":14.544},{"$f":"IF(Turma!A$2=1,IF(VLOOKUP(\"x\",Turma!$B$4:$H$53,3,0)=\"Menina\",mlsPeso!M5,mlsPeso!M65),\"\")","v":16.25},{"$f":"IF(Turma!A$2=1,IF(VLOOKUP(\"x\",Turma!$B$4:$H$53,3,0)=\"Menina\",mlsPeso!O5,mlsPeso!O65),\"\")","v":18.780999999999999},{"$f":"IF(Turma!A$2=1,IF(VLOOKUP(\"x\",Turma!$B$4:$H$53,3,0)=\"Menina\",mlsPeso!Q5,mlsPeso!Q65),\"\")","v":21.940999999999999},{"$f":"IF(Turma!A$2=1,IF(VLOOKUP(\"x\",Turma!$B$4:$H$53,3,0)=\"Menina\",mlsPeso!T5,mlsPeso!T65),\"\")","v":25.132000000000001}]
[65,"",{"$f":"IF(Turma!A$2=1,IF(VLOOKUP(\"x\",Turma!$B$4:$H$53,3,0)=\"Menina\",mlsPeso!J6,mlsPeso!J66),\"\")","v":14.666},{"$f":"IF(Turma!A$2=1,IF(VLOOKUP(\"x\",Turma!$B$4:$H$53,3,0)=\"Menina\",mlsPeso!M6,mlsPeso!M66),\"\")","v":16.391999999999999},{"$f":"IF(Turma!A$2=1,IF(VLOOKUP(\"x\",Turma!$B$4:$H$53,3,0)=\"Menina\",mlsPeso!O6,mlsPeso!O66),\"\")","v":18.954000000000001},{"$f":"IF(Turma!A$2=1,IF(VLOOKUP(\"x\",Turma!$B$4:$H$53,3,0)=\"Menina\",mlsPeso!Q6,mlsPeso!Q66),\"\")","v":22.158000000000001},{"$f":"IF(Turma!A$2=1,IF(VLOOKUP(\"x\",Turma!$B$4:$H$53,3,0)=\"Menina\",mlsPeso!T6,mlsPeso!T66),\"\")","v":25.398}]
[66,"",{"$f":"IF(Turma!A$2=1,IF(VLOOKUP(\"x\",Turma!$B$4:$H$53,3,0)=\"Menina\",mlsPeso!J7,mlsPeso!J67),\"\")","v":14.788},{"$f":"IF(Turma!A$2=1,IF(VLOOKUP(\"x\",Turma!$B$4:$H$53,3,0)=\"Menina\",mlsPeso!M7,mlsPeso!M67),\"\")","v":16.533999999999999},{"$f":"IF(Turma!A$2=1,IF(VLOOKUP(\"x\",Turma!$B$4:$H$53,3,0)=\"Menina\",mlsPeso!O7,mlsPeso!O67),\"\")","v":19.128},{"$f":"IF(Turma!A$2=1,IF(VLOOKUP(\"x\",Turma!$B$4:$H$53,3,0)=\"Menina\",mlsPeso!Q7,mlsPeso!Q67),\"\")","v":22.375},{"$f":"IF(Turma!A$2=1,IF(VLOOKUP(\"x\",Turma!$B$4:$H$53,3,0)=\"Menina\",mlsPeso!T7,mlsPeso!T67),\"\")","v":25.664000000000001}]
[67,"",{"$f":"IF(Turma!A$2=1,IF(VLOOKUP(\"x\",Turma!$B$4:$H$53,3,0)=\"Menina\",mlsPeso!J8,mlsPeso!J68),\"\")","v":14.909000000000001},{"$f":"IF(Turma!A$2=1,IF(VLOOKUP(\"x\",Turma!$B$4:$H$53,3,0)=\"Menina\",mlsPeso!M8,mlsPeso!M68),\"\")","v":16.675000000000001},{"$f":"IF(Turma!A$2=1,IF(VLOOKUP(\"x\",Turma!$B$4:$H$53,3,0)=\"Menina\",mlsPeso!O8,mlsPeso!O68),\"\")","v":19.3},{"$f":"IF(Turma!A$2=1,IF(VLOOKUP(\"x\",Turma!$B$4:$H$53,3,0)=\"Menina\",mlsPeso!Q8,mlsPeso!Q68),\"\")","v":22.591000000000001},{"$f":"IF(Turma!A$2=1,IF(VLOOKUP(\"x\",Turma!$B$4:$H$53,3,0)=\"Menina\",mlsPeso!T8,mlsPeso!T68),\"\")","v":25.93}]
[68,"",{"$f":"IF(Turma!A$2=1,IF(VLOOKUP(\"x\",Turma!$B$4:$H$53,3,0)=\"Menina\",mlsPeso!J9,mlsPeso!J69),\"\")","v":15.03},{"$f":"IF(Turma!A$2=1,IF(VLOOKUP(\"x\",Turma!$B$4:$H$53,3,0)=\"Menina\",mlsPeso!M9,mlsPeso!M69),\"\")","v":16.815000000000001},{"$f":"IF(Turma!A$2=1,IF(VLOOKUP(\"x\",Turma!$B$4:$H$53,3,0)=\"Menina\",mlsPeso!O9,mlsPeso!O69),\"\")","v":19.472999999999999},{"$f":"IF(Turma!A$2=1,IF(VLOOKUP(\"x\",Turma!$B$4:$H$53,3,0)=\"Menina\",mlsPeso!Q9,mlsPeso!Q69),\"\")","v":22.808},{"$f":"IF(Turma!A$2=1,IF(VLOOKUP(\"x\",Turma!$B$4:$H$53,3,0)=\"Menina\",mlsPeso!T9,mlsPeso!T69),\"\")","v":26.196999999999999}]
{"$rows_left_out":53}
{"sheet":"dadosZScore","index":3,"n_rows":170,"n_cols":12,"rows_kept":170,"cut":false,"hidden":true,"merged":[]}
["meses","anos",-3,-2,-1,0,1,2,3,"Género","Meses","BMI"]
[60,{"$f":"IF(A2/12=INT(A2/12),A2/12,\"\")","v":5},null,null,null,null,null,null,null,{"$f":"IF(Turma!A2=1,VLOOKUP(\"x\",Turma!B4:H53,3,0),\"\")","v":"Menina"},{"$f":"IF(Turma!A2=1,VLOOKUP(\"x\",Turma!B4:I53,8,0),\"\")","v":80},{"$f":"IF(Turma!A2=1,VLOOKUP(\"x\",Turma!B4:K53,9,0),\"\")","v":24.157202091220483}]
[61,{"$f":"IF(A3/12=INT(A3/12),A3/12,\"\")","v":""},{"$f":"IF(Turma!$A$2=1,IF(VLOOKUP(\"x\",Turma!$B$4:$H$53,3,0)=\"Menina\",mlsBMI!I2,mlsBMI!I170),\"\")","v":11.77},{"$f":"IF(Turma!$A$2=1,IF(VLOOKUP(\"x\",Turma!$B$4:$H$53,3,0)=\"Menina\",mlsBMI!J2,mlsBMI!J170),\"\")","v":12.747999999999999},{"$f":"IF(Turma!$A$2=1,IF(VLOOKUP(\"x\",Turma!$B$4:$H$53,3,0)=\"Menina\",mlsBMI!K2,mlsBMI!K170),\"\")","v":13.891},{"$f":"IF(Turma!$A$2=1,IF(VLOOKUP(\"x\",Turma!$B$4:$H$53,3,0)=\"Menina\",mlsBMI!L2,mlsBMI!L170),\"\")","v":15.244},{"$f":"IF(Turma!$A$2=1,IF(VLOOKUP(\"x\",Turma!$B$4:$H$53,3,0)=\"Menina\",mlsBMI!M2,mlsBMI!M170),\"\")","v":16.87},{"$f":"IF(Turma!$A$2=1,IF(VLOOKUP(\"x\",Turma!$B$4:$H$53,3,0)=\"Menina\",mlsBMI!N2,mlsBMI!N170),\"\")","v":18.858000000000001},{"$f":"IF(Turma!$A$2=1,IF(VLOOKUP(\"x\",Turma!$B$4:$H$53,3,0)=\"Menina\",mlsBMI!O2,mlsBMI!O170),\"\")","v":21.34}]
[62,"",{"$f":"IF(Turma!$A$2=1,IF(VLOOKUP(\"x\",Turma!$B$4:$H$53,3,0)=\"Menina\",mlsBMI!I3,mlsBMI!I171),\"\")","v":11.763},{"$f":"IF(Turma!$A$2=1,IF(VLOOKUP(\"x\",Turma!$B$4:$H$53,3,0)=\"Menina\",mlsBMI!J3,mlsBMI!J171),\"\")","v":12.741},{"$f":"IF(Turma!$A$2=1,IF(VLOOKUP(\"x\",Turma!$B$4:$H$53,3,0)=\"Menina\",mlsBMI!K3,mlsBMI!K171),\"\")","v":13.885},{"$f":"IF(Turma!$A$2=1,IF(VLOOKUP(\"x\",Turma!$B$4:$H$53,3,0)=\"Menina\",mlsBMI!L3,mlsBMI!L171),\"\")","v":15.243},{"$f":"IF(Turma!$A$2=1,IF(VLOOKUP(\"x\",Turma!$B$4:$H$53,3,0)=\"Menina\",mlsBMI!M3,mlsBMI!M171),\"\")","v":16.879000000000001},{"$f":"IF(Turma!$A$2=1,IF(VLOOKUP(\"x\",Turma!$B$4:$H$53,3,0)=\"Menina\",mlsBMI!N3,mlsBMI!N171),\"\")","v":18.885999999999999},{"$f":"IF(Turma!$A$2=1,IF(VLOOKUP(\"x\",Turma!$B$4:$H$53,3,0)=\"Menina\",mlsBMI!O3,mlsBMI!O171),\"\")","v":21.402999999999999}]
[63,"",{"$f":"IF(Turma!$A$2=1,IF(VLOOKUP(\"x\",Turma!$B$4:$H$53,3,0)=\"Menina\",mlsBMI!I4,mlsBMI!I172),\"\")","v":11.757},{"$f":"IF(Turma!$A$2=1,IF(VLOOKUP(\"x\",Turma!$B$4:$H$53,3,0)=\"Menina\",mlsBMI!J4,mlsBMI!J172),\"\")","v":12.734},{"$f":"IF(Turma!$A$2=1,IF(VLOOKUP(\"x\",Turma!$B$4:$H$53,3,0)=\"Menina\",mlsBMI!K4,mlsBMI!K172),\"\")","v":13.881},{"$f":"IF(Turma!$A$2=1,IF(VLOOKUP(\"x\",Turma!$B$4:$H$53,3,0)=\"Menina\",mlsBMI!L4,mlsBMI!L172),\"\")","v":15.243},{"$f":"IF(Turma!$A$2=1,IF(VLOOKUP(\"x\",Turma!$B$4:$H$53,3,0)=\"Menina\",mlsBMI!M4,mlsBMI!M172),\"\")","v":16.888999999999999},{"$f":"IF(Turma!$A$2=1,IF(VLOOKUP(\"x\",Turma!$B$4:$H$53,3,0)=\"Menina\",mlsBMI!N4,mlsBMI!N172),\"\")","v":18.914999999999999},{"$f":"IF(Turma!$A$2=1,IF(VLOOKUP(\"x\",Turma!$B$4:$H$53,3,0)=\"Menina\",mlsBMI!O4,mlsBMI!O172),\"\")","v":21.468}]
[64,"",{"$f":"IF(Turma!$A$2=1,IF(VLOOKUP(\"x\",Turma!$B$4:$H$53,3,0)=\"Menina\",mlsBMI!I5,mlsBMI!I173),\"\")","v":11.752000000000001},{"$f":"IF(Turma!$A$2=1,IF(VLOOKUP(\"x\",Turma!$B$4:$H$53,3,0)=\"Menina\",mlsBMI!J5,mlsBMI!J173),\"\")","v":12.728},{"$f":"IF(Turma!$A$2=1,IF(VLOOKUP(\"x\",Turma!$B$4:$H$53,3,0)=\"Menina\",mlsBMI!K5,mlsBMI!K173),\"\")","v":13.875999999999999},{"$f":"IF(Turma!$A$2=1,IF(VLOOKUP(\"x\",Turma!$B$4:$H$53,3,0)=\"Menina\",mlsBMI!L5,mlsBMI!L173),\"\")","v":15.244},{"$f":"IF(Turma!$A$2=1,IF(VLOOKUP(\"x\",Turma!$B$4:$H$53,3,0)=\"Menina\",mlsBMI!M5,mlsBMI!M173),\"\")","v":16.899999999999999},{"$f":"IF(Turma!$A$2=1,IF(VLOOKUP(\"x\",Turma!$B$4:$H$53,3,0)=\"Menina\",mlsBMI!N5,mlsBMI!N173),\"\")","v":18.946000000000002},{"$f":"IF(Turma!$A$2=1,IF(VLOOKUP(\"x\",Turma!$B$4:$H$53,3,0)=\"Menina\",mlsBMI!O5,mlsBMI!O173),\"\")","v":21.535}]
[65,"",{"$f":"IF(Turma!$A$2=1,IF(VLOOKUP(\"x\",Turma!$B$4:$H$53,3,0)=\"Menina\",mlsBMI!I6,mlsBMI!I174),\"\")","v":11.746},{"$f":"IF(Turma!$A$2=1,IF(VLOOKUP(\"x\",Turma!$B$4:$H$53,3,0)=\"Menina\",mlsBMI!J6,mlsBMI!J174),\"\")","v":12.723000000000001},{"$f":"IF(Turma!$A$2=1,IF(VLOOKUP(\"x\",Turma!$B$4:$H$53,3,0)=\"Menina\",mlsBMI!K6,mlsBMI!K174),\"\")","v":13.872},{"$f":"IF(Turma!$A$2=1,IF(VLOOKUP(\"x\",Turma!$B$4:$H$53,3,0)=\"Menina\",mlsBMI!L6,mlsBMI!L174),\"\")","v":15.244999999999999},{"$f":"IF(Turma!$A$2=1,IF(VLOOKUP(\"x\",Turma!$B$4:$H$53,3,0)=\"Menina\",mlsBMI!M6,mlsBMI!M174),\"\")","v":16.911000000000001},{"$f":"IF(Turma!$A$2=1,IF(VLOOKUP(\"x\",Turma!$B$4:$H$53,3,0)=\"Menina\",mlsBMI!N6,mlsBMI!N174),\"\")","v":18.977},{"$f":"IF(Turma!$A$2=1,IF(VLOOKUP(\"x\",Turma!$B$4:$H$53,3,0)=\"Menina\",mlsBMI!O6,mlsBMI!O174),\"\")","v":21.603000000000002}]
[66,"",{"$f":"IF(Turma!$A$2=1,IF(VLOOKUP(\"x\",Turma!$B$4:$H$53,3,0)=\"Menina\",mlsBMI!I7,mlsBMI!I175),\"\")","v":11.742000000000001},{"$f":"IF(Turma!$A$2=1,IF(VLOOKUP(\"x\",Turma!$B$4:$H$53,3,0)=\"Menina\",mlsBMI!J7,mlsBMI!J175),\"\")","v":12.718},{"$f":"IF(Turma!$A$2=1,IF(VLOOKUP(\"x\",Turma!$B$4:$H$53,3,0)=\"Menina\",mlsBMI!K7,mlsBMI!K175),\"\")","v":13.869},{"$f":"IF(Turma!$A$2=1,IF(VLOOKUP(\"x\",Turma!$B$4:$H$53,3,0)=\"Menina\",mlsBMI!L7,mlsBMI!L175),\"\")","v":15.246},{"$f":"IF(Turma!$A$2=1,IF(VLOOKUP(\"x\",Turma!$B$4:$H$53,3,0)=\"Menina\",mlsBMI!M7,mlsBMI!M175),\"\")","v":16.922999999999998},{"$f":"IF(Turma!$A$2=1,IF(VLOOKUP(\"x\",Turma!$B$4:$H$53,3,0)=\"Menina\",mlsBMI!N7,mlsBMI!N175),\"\")","v":19.009},{"$f":"IF(Turma!$A$2=1,IF(VLOOKUP(\"x\",Turma!$B$4:$H$53,3,0)=\"Menina\",mlsBMI!O7,mlsBMI!O175),\"\")","v":21.672999999999998}]
[67,"",{"$f":"IF(Turma!$A$2=1,IF(VLOOKUP(\"x\",Turma!$B$4:$H$53,3,0)=\"Menina\",mlsBMI!I8,mlsBMI!I176),\"\")","v":11.737},{"$f":"IF(Turma!$A$2=1,IF(VLOOKUP(\"x\",Turma!$B$4:$H$53,3,0)=\"Menina\",mlsBMI!J8,mlsBMI!J176),\"\")","v":12.714},{"$f":"IF(Turma!$A$2=1,IF(VLOOKUP(\"x\",Turma!$B$4:$H$53,3,0)=\"Menina\",mlsBMI!K8,mlsBMI!K176),\"\")","v":13.866},{"$f":"IF(Turma!$A$2=1,IF(VLOOKUP(\"x\",Turma!$B$4:$H$53,3,0)=\"Menina\",mlsBMI!L8,mlsBMI!L176),\"\")","v":15.249000000000001},{"$f":"IF(Turma!$A$2=1,IF(VLOOKUP(\"x\",Turma!$B$4:$H$53,3,0)=\"Menina\",mlsBMI!M8,mlsBMI!M176),\"\")","v":16.936},{"$f":"IF(Turma!$A$2=1,IF(VLOOKUP(\"x\",Turma!$B$4:$H$53,3,0)=\"Menina\",mlsBMI!N8,mlsBMI!N176),\"\")","v":19.042000000000002},{"$f":"IF(Turma!$A$2=1,IF(VLOOKUP(\"x\",Turma!$B$4:$H$53,3,0)=\"Menina\",mlsBMI!O8,mlsBMI!O176),\"\")","v":21.745000000000001}]
[68,"",{"$f":"IF(Turma!$A$2=1,IF(VLOOKUP(\"x\",Turma!$B$4:$H$53,3,0)=\"Menina\",mlsBMI!I9,mlsBMI!I177),\"\")","v":11.733000000000001},{"$f":"IF(Turma!$A$2=1,IF(VLOOKUP(\"x\",Turma!$B$4:$H$53,3,0)=\"Menina\",mlsBMI!J9,mlsBMI!J177),\"\")","v":12.71},{"$f":"IF(Turma!$A$2=1,IF(VLOOKUP(\"x\",Turma!$B$4:$H$53,3,0)=\"Menina\",mlsBMI!K9,mlsBMI!K177),\"\")","v":13.864000000000001},{"$f":"IF(Turma!$A$2=1,IF(VLOOKUP(\"x\",Turma!$B$4:$H$53,3,0)=\"Menina\",mlsBMI!L9,mlsBMI!L177),\"\")","v":15.252000000000001},{"$f":"IF(Turma!$A$2=1,IF(VLOOKUP(\"x\",Turma!$B$4:$H$53,3,0)=\"Menina\",mlsBMI!M9,mlsBMI!M177),\"\")","v":16.95},{"$f":"IF(Turma!$A$2=1,IF(VLOOKUP(\"x\",Turma!$B$4:$H$53,3,0)=\"Menina\",mlsBMI!N9,mlsBMI!N177),\"\")","v":19.077000000000002},{"$f":"IF(Turma!$A$2=1,IF(VLOOKUP(\"x\",Turma!$B$4:$H$53,3,0)=\"Menina\",mlsBMI!O9,mlsBMI!O177),\"\")","v":21.818999999999999}]
{"$rows_left_out":161}
{"sheet":"mlsPeso","index":4,"n_rows":121,"n_cols":22,"rows_kept":121,"cut":false,"hidden":true,"merged":[]}
["idLMS","variavel","genero","meses","L","M","S","P01","P1","P3","P5","P10","P15","P25","P50","P75","P85","P90","P95","P97","P99","P999"]
[1,"peso","menina",61,-0.46810000000000002,18.257899999999999,0.14294999999999999,12.22,13.404,14.173,14.606999999999999,15.315,15.821,16.614999999999998,18.257999999999999,20.151,21.288,22.111999999999998,23.422999999999998,24.335999999999999,26.207999999999998,29.949000000000002]
[{"$f":"A2+1","v":2},"peso","menina",62,-0.47110000000000002,18.4329,0.14349999999999999,12.321999999999999,13.519,14.297000000000001,14.736000000000001,15.452,15.965,16.768000000000001,18.433,20.352,21.506,22.343,23.673999999999999,24.600999999999999,26.504999999999999,30.312999999999999]
[{"$f":"A3+1","v":3},"peso","menina",63,-0.47420000000000001,18.607299999999999,0.14404,12.425000000000001,13.634,14.420999999999999,14.865,15.589,16.108000000000001,16.920999999999999,18.606999999999999,20.553000000000001,21.722999999999999,22.573,23.923999999999999,24.866,26.802,30.677]
[{"$f":"A4+1","v":4},"peso","menina",64,-0.4773,18.781099999999999,0.14459,12.526,13.747999999999999,14.544,14.993,15.726000000000001,16.25,17.074000000000002,18.780999999999999,20.754000000000001,21.940999999999999,22.802,24.173999999999999,25.132000000000001,27.099,31.044]
[5,"peso","menina",65,-0.4803,18.954499999999999,0.14513999999999999,12.627000000000001,13.862,14.666,15.12,15.861000000000001,16.391999999999999,17.225000000000001,18.954000000000001,20.954000000000001,22.158000000000001,23.032,24.425000000000001,25.398,27.396999999999998,31.411000000000001]
[6,"peso","menina",66,-0.4834,19.127600000000001,0.14568999999999999,12.728,13.975,14.788,15.247,15.997,16.533999999999999,17.376999999999999,19.128,21.154,22.375,23.262,24.675999999999998,25.664000000000001,27.696000000000002,31.780999999999999]
[7,"peso","menina",67,-0.4864,19.3004,0.14624000000000001,12.827999999999999,14.087999999999999,14.909000000000001,15.372999999999999,16.131,16.675000000000001,17.527999999999999,19.3,21.353000000000002,22.591000000000001,23.492000000000001,24.927,25.93,27.995000000000001,32.151000000000003]
[8,"peso","menina",68,-0.4894,19.472999999999999,0.14679,12.928000000000001,14.2,15.03,15.5,16.265999999999998,16.815000000000001,17.678000000000001,19.472999999999999,21.553000000000001,22.808,23.721,25.178000000000001,26.196999999999999,28.295000000000002,32.523000000000003]
[9,"peso","menina",69,-0.4924,19.645499999999998,0.14735000000000001,13.026999999999999,14.311999999999999,15.151,15.625,16.399999999999999,16.956,17.829000000000001,19.646000000000001,21.753,23.026,23.952000000000002,25.43,26.465,28.597000000000001,32.899000000000001]
{"$rows_left_out":112}
{"sheet":"mlsBMI","index":5,"n_rows":337,"n_cols":16,"rows_kept":337,"cut":false,"hidden":true,"merged":[]}
["idLMS","variavel","genero","meses","L","M","S","SD4neg","SD3neg","SD2neg","SD1neg","SD0","SD1","SD2","SD3","SD4"]
[1,"bmi","menina",61,-0.88859999999999995,15.2441,9.6920000000000006E-2,10.792999999999999,11.77,12.747999999999999,13.891,15.244,16.87,18.858000000000001,21.34,23.821000000000002]
[{"$f":"A2+1","v":2},"bmi","menina",62,-0.90680000000000005,15.243399999999999,9.7379999999999994E-2,10.786,11.763,12.741,13.885,15.243,16.879000000000001,18.885999999999999,21.402999999999999,23.92]
[{"$f":"A3+1","v":3},"bmi","menina",63,-0.92479999999999996,15.2433,9.783E-2,10.78,11.757,12.734,13.881,15.243,16.888999999999999,18.914999999999999,21.468,24.02]
[4,"bmi","menina",64,-0.94269999999999998,15.2438,9.8290000000000002E-2,10.775,11.752000000000001,12.728,13.875999999999999,15.244,16.899999999999999,18.946000000000002,21.535,24.123000000000001]
[5,"bmi","menina",65,-0.96050000000000002,15.2448,9.8750000000000004E-2,10.77,11.746,12.723000000000001,13.872,15.244999999999999,16.911000000000001,18.977,21.603000000000002,24.23]
[6,"bmi","menina",66,-0.97799999999999998,15.2464,9.9199999999999997E-2,10.765000000000001,11.742000000000001,12.718,13.869,15.246,16.922999999999998,19.009,21.672999999999998,24.337]
[7,"bmi","menina",67,-0.99539999999999995,15.248699999999999,9.9659999999999999E-2,10.760999999999999,11.737,12.714,13.866,15.249000000000001,16.936,19.042000000000002,21.745000000000001,24.448]
[8,"bmi","menina",68,-1.0125999999999999,15.2516,0.10012,10.757,11.733000000000001,12.71,13.864000000000001,15.252000000000001,16.95,19.077000000000002,21.818999999999999,24.561]
[9,"bmi","menina",69,-1.0296000000000001,15.255100000000001,0.10058,10.754,11.73,12.706,13.863,15.255000000000001,16.963999999999999,19.111999999999998,21.895,24.678000000000001]
{"$rows_left_out":327}