{"text_format":"1","workbook":"xlsx","n_sheets":5,"sheets":["Turma","Relatório","dadosPercentis","dadosZScore","tblMLS"],"not_rendered":{"charts":0,"images":5,"macros":1,"external_links":0,"defined_names":1,"comments":1,"pivot_tables":0},"unopened":[],"bounds":{"document_bytes":16777216,"sheet_cells":100000,"rows_first":2000,"rows_last":500,"rows_between":2000,"halvings":0,"cell_chars":16384,"cell_head_chars":4096},"cells_cut":0,"cells_raw":0,"read":"whole","date_system":"1900"}

{"sheet":"Turma","index":0,"n_rows":53,"n_cols":8,"rows_kept":53,"cut":false,"hidden":false,"merged":[]}
[null,"Ano:",2,null,null,"Média Global:",{"$f":"IF(COUNTA(G4:G53)>0,AVERAGE(G4:G53),\"\")","v":136.5}]
[{"$f":"COUNTIF(B4:B53,\"x\")","v":1},"Turma:","G",null,null,"Desvio Padrão Global:",{"$f":"IF(COUNTA(G4:G53)>0,_xlfn.STDEV.P(G4:G53),\"\")","v":5.4083269131959844}]
["ID Aluno",{"$f":"_xlfn.CONCAT(\"Ver: \",A2)","v":"Ver: 1"},"Nome","Género","Data de nascimento","Data de avaliação","Altura","Idade"]
[1,null,"Manuel Lopes","Menino","2011-05-11","2020-08-07",134,{"$f":"IF(AND(E4<>\"\",F4<>\"\"),INT(12*_xlfn.DAYS(F4,E4)/365),\"\")","v":110}]
[{"$f":"A4+1","v":2},null,"Amélia Costa","Menina","2010-12-04","2020-08-07",129,{"$f":"IF(AND(E5<>\"\",F5<>\"\"),INT(12*_xlfn.DAYS(F5,E5)/365),\"\")","v":116}]
[{"$f":"A5+1","v":3},null,"Rui Silva","Menino","2011-08-10","2020-08-07",143,108]
[4,"x","Joana Andrade","Menina","2013-03-11","2021-12-12",140,105]
[5,null,null,null,null,null,null,""]
[6,null,null,null,null,null,null,""]
[7,null,null,null,null,null,null,""]
{"$rows_left_out":44}
{"sheet":"Relatório","index":1,"n_rows":32,"n_cols":8,"rows_kept":32,"cut":false,"hidden":false,"merged":[[14,0,14,6],[31,0,31,5],[12,0,12,9]]}
["RELATÓRIO INDIVIDUAL - ALTURA"]
[{"$f":"IF(Turma!A2=1,VLOOKUP(\"x\",Turma!B$4:G$53,2,0),\"\")","v":"Joana Andrade"}]
[{"$f":"IF(Turma!A2=1,_xlfn.CONCAT(TEXT(VLOOKUP(\"x\",Turma!B$4:G$53,4,0),\"dd-mm-aaaa\"),\" | \",Turma!C1,\"º ano\",\" | \",Turma!C2),\"\")","v":"11-03-2013 | 2º ano | G"}]
[]
[null,"Resultado",null,"Média",null,"Mínimo",null,"Máximo"]
[null,"da criança",null,"da turma",null,"da turma",null,"da turma"]
["Altura (cm)",{"$f":"IF(Turma!$A$2=1,VLOOKUP(\"x\",Turma!B4:J53,6,0),0)","v":140},null,{"$f":"IF(Turma!$A$2=1,Turma!G1,0)","v":136.5},null,{"$f":"IF(Turma!$A$2=1,SMALL(Turma!G4:G53,1),0)","v":129},null,{"$f":"IF(Turma!$A$2=1,LARGE(Turma!G4:G53,1),0)","v":143}]
[]
[]
[]
{"$rows_left_out":23}
{"sheet":"dadosPercentis","index":2,"n_rows":170,"n_cols":10,"rows_kept":170,"cut":false,"hidden":true,"merged":[]}
["meses","anos","P3","P15","P50","P85","P97","Género","Meses","Altura"]
[60,{"$f":"IF(A2/12=INT(A2/12),A2/12,\"\")","v":5},null,null,null,null,null,{"$f":"IF(Turma!A2=1,VLOOKUP(\"x\",Turma!B4:G53,3,0),\"\")","v":"Menina"},{"$f":"IF(Turma!A2=1,VLOOKUP(\"x\",Turma!B4:H53,7,0),\"\")","v":105},{"$f":"IF(Turma!A2=1,VLOOKUP(\"x\",Turma!B4:H53,6,0),\"\")","v":140}]
[61,{"$f":"IF(A3/12=INT(A3/12),A3/12,\"\")","v":""},{"$f":"IF(Turma!A$2=1,IF(VLOOKUP(\"x\",Turma!$B$4:$G$53,3,0)=\"Menina\",tblMLS!K2,tblMLS!K170),\"\")","v":100.624},{"$f":"IF(Turma!A$2=1,IF(VLOOKUP(\"x\",Turma!$B$4:$G$53,3,0)=\"Menina\",tblMLS!N2,tblMLS!N170),\"\")","v":104.655},{"$f":"IF(Turma!A$2=1,IF(VLOOKUP(\"x\",Turma!$B$4:$G$53,3,0)=\"Menina\",tblMLS!P2,tblMLS!P170),\"\")","v":109.602},{"$f":"IF(Turma!A$2=1,IF(VLOOKUP(\"x\",Turma!$B$4:$G$53,3,0)=\"Menina\",tblMLS!R2,tblMLS!R170),\"\")","v":114.54900000000001},{"$f":"IF(Turma!A$2=1,IF(VLOOKUP(\"x\",Turma!$B$4:$G$53,3,0)=\"Menina\",tblMLS!U2,tblMLS!U170),\"\")","v":118.57899999999999}]
[62,"",{"$f":"IF(Turma!A$2=1,IF(VLOOKUP(\"x\",Turma!$B$4:$G$53,3,0)=\"Menina\",tblMLS!K3,tblMLS!K171),\"\")","v":101.087},{"$f":"IF(Turma!A$2=1,IF(VLOOKUP(\"x\",Turma!$B$4:$G$53,3,0)=\"Menina\",tblMLS!N3,tblMLS!N171),\"\")","v":105.145},{"$f":"IF(Turma!A$2=1,IF(VLOOKUP(\"x\",Turma!$B$4:$G$53,3,0)=\"Menina\",tblMLS!P3,tblMLS!P171),\"\")","v":110.126},{"$f":"IF(Turma!A$2=1,IF(VLOOKUP(\"x\",Turma!$B$4:$G$53,3,0)=\"Menina\",tblMLS!R3,tblMLS!R171),\"\")","v":115.107},{"$f":"IF(Turma!A$2=1,IF(VLOOKUP(\"x\",Turma!$B$4:$G$53,3,0)=\"Menina\",tblMLS!U3,tblMLS!U171),\"\")","v":119.16500000000001}]
[63,"",{"$f":"IF(Turma!A$2=1,IF(VLOOKUP(\"x\",Turma!$B$4:$G$53,3,0)=\"Menina\",tblMLS!K4,tblMLS!K172),\"\")","v":101.545},{"$f":"IF(Turma!A$2=1,IF(VLOOKUP(\"x\",Turma!$B$4:$G$53,3,0)=\"Menina\",tblMLS!N4,tblMLS!N172),\"\")","v":105.63},{"$f":"IF(Turma!A$2=1,IF(VLOOKUP(\"x\",Turma!$B$4:$G$53,3,0)=\"Menina\",tblMLS!P4,tblMLS!P172),\"\")","v":110.645},{"$f":"IF(Turma!A$2=1,IF(VLOOKUP(\"x\",Turma!$B$4:$G$53,3,0)=\"Menina\",tblMLS!R4,tblMLS!R172),\"\")","v":115.66},{"$f":"IF(Turma!A$2=1,IF(VLOOKUP(\"x\",Turma!$B$4:$G$53,3,0)=\"Menina\",tblMLS!U4,tblMLS!U172),\"\")","v":119.745}]
[64,"",{"$f":"IF(Turma!A$2=1,IF(VLOOKUP(\"x\",Turma!$B$4:$G$53,3,0)=\"Menina\",tblMLS!K5,tblMLS!K173),\"\")","v":101.998},{"$f":"IF(Turma!A$2=1,IF(VLOOKUP(\"x\",Turma!$B$4:$G$53,3,0)=\"Menina\",tblMLS!N5,tblMLS!N173),\"\")","v":106.111},{"$f":"IF(Turma!A$2=1,IF(VLOOKUP(\"x\",Turma!$B$4:$G$53,3,0)=\"Menina\",tblMLS!P5,tblMLS!P173),\"\")","v":111.16},{"$f":"IF(Turma!A$2=1,IF(VLOOKUP(\"x\",Turma!$B$4:$G$53,3,0)=\"Menina\",tblMLS!R5,tblMLS!R173),\"\")","v":116.208},{"$f":"IF(Turma!A$2=1,IF(VLOOKUP(\"x\",Turma!$B$4:$G$53,3,0)=\"Menina\",tblMLS!U5,tblMLS!U173),\"\")","v":120.321}]
[65,"",{"$f":"IF(Turma!A$2=1,IF(VLOOKUP(\"x\",Turma!$B$4:$G$53,3,0)=\"Menina\",tblMLS!K6,tblMLS!K174),\"\")","v":102.449},{"$f":"IF(Turma!A$2=1,IF(VLOOKUP(\"x\",Turma!$B$4:$G$53,3,0)=\"Menina\",tblMLS!N6,tblMLS!N174),\"\")","v":106.589},{"$f":"IF(Turma!A$2=1,IF(VLOOKUP(\"x\",Turma!$B$4:$G$53,3,0)=\"Menina\",tblMLS!P6,tblMLS!P174),\"\")","v":111.67},{"$f":"IF(Turma!A$2=1,IF(VLOOKUP(\"x\",Turma!$B$4:$G$53,3,0)=\"Menina\",tblMLS!R6,tblMLS!R174),\"\")","v":116.751},{"$f":"IF(Turma!A$2=1,IF(VLOOKUP(\"x\",Turma!$B$4:$G$53,3,0)=\"Menina\",tblMLS!U6,tblMLS!U174),\"\")","v":120.89}]
[66,"",{"$f":"IF(Turma!A$2=1,IF(VLOOKUP(\"x\",Turma!$B$4:$G$53,3,0)=\"Menina\",tblMLS!K7,tblMLS!K175),\"\")","v":102.89400000000001},{"$f":"IF(Turma!A$2=1,IF(VLOOKUP(\"x\",Turma!$B$4:$G$53,3,0)=\"Menina\",tblMLS!N7,tblMLS!N175),\"\")","v":107.06100000000001},{"$f":"IF(Turma!A$2=1,IF(VLOOKUP(\"x\",Turma!$B$4:$G$53,3,0)=\"Menina\",tblMLS!P7,tblMLS!P175),\"\")","v":112.175},{"$f":"IF(Turma!A$2=1,IF(VLOOKUP(\"x\",Turma!$B$4:$G$53,3,0)=\"Menina\",tblMLS!R7,tblMLS!R175),\"\")","v":117.29},{"$f":"IF(Turma!A$2=1,IF(VLOOKUP(\"x\",Turma!$B$4:$G$53,3,0)=\"Menina\",tblMLS!U7,tblMLS!U175),\"\")","v":121.456}]
[67,"",{"$f":"IF(Turma!A$2=1,IF(VLOOKUP(\"x\",Turma!$B$4:$G$53,3,0)=\"Menina\",tblMLS!K8,tblMLS!K176),\"\")","v":103.337},{"$f":"IF(Turma!A$2=1,IF(VLOOKUP(\"x\",Turma!$B$4:$G$53,3,0)=\"Menina\",tblMLS!N8,tblMLS!N176),\"\")","v":107.53},{"$f":"IF(Turma!A$2=1,IF(VLOOKUP(\"x\",Turma!$B$4:$G$53,3,0)=\"Menina\",tblMLS!P8,tblMLS!P176),\"\")","v":112.67700000000001},{"$f":"IF(Turma!A$2=1,IF(VLOOKUP(\"x\",Turma!$B$4:$G$53,3,0)=\"Menina\",tblMLS!R8,tblMLS!R176),\"\")","v":117.82299999999999},{"$f":"IF(Turma!A$2=1,IF(VLOOKUP(\"x\",Turma!$B$4:$G$53,3,0)=\"Menina\",tblMLS!U8,tblMLS!U176),\"\")","v":122.01600000000001}]
[68,"",{"$f":"IF(Turma!A$2=1,IF(VLOOKUP(\"x\",Turma!$B$4:$G$53,3,0)=\"Menina\",tblMLS!K9,tblMLS!K177),\"\")","v":103.776},{"$f":"IF(Turma!A$2=1,IF(VLOOKUP(\"x\",Turma!$B$4:$G$53,3,0)=\"Menina\",tblMLS!N9,tblMLS!N177),\"\")","v":107.995},{"$f":"IF(Turma!A$2=1,IF(VLOOKUP(\"x\",Turma!$B$4:$G$53,3,0)=\"Menina\",tblMLS!P9,tblMLS!P177),\"\")","v":113.17400000000001},{"$f":"IF(Turma!A$2=1,IF(VLOOKUP(\"x\",Turma!$B$4:$G$53,3,0)=\"Menina\",tblMLS!R9,tblMLS!R177),\"\")","v":118.35299999999999},{"$f":"IF(Turma!A$2=1,IF(VLOOKUP(\"x\",Turma!$B$4:$G$53,3,0)=\"Menina\",tblMLS!U9,tblMLS!U177),\"\")","v":122.572}]
{"$rows_left_out":161}
{"sheet":"dadosZScore","index":3,"n_rows":170,"n_cols":12,"rows_kept":170,"cut":false,"hidden":true,"merged":[]}
["meses","anos",-3,-2,-1,0,1,2,3,"Género","Meses","Altura"]
[60,{"$f":"IF(A2/12=INT(A2/12),A2/12,\"\")","v":5},null,null,null,null,null,null,null,{"$f":"IF(Turma!A2=1,VLOOKUP(\"x\",Turma!B4:G53,3,0),\"\")","v":"Menina"},{"$f":"IF(Turma!A2=1,VLOOKUP(\"x\",Turma!B4:H53,7,0),\"\")","v":105},{"$f":"IF(Turma!A2=1,VLOOKUP(\"x\",Turma!B4:I53,6,0),\"\")","v":140}]
[61,{"$f":"IF(A3/12=INT(A3/12),A3/12,\"\")","v":""},{"$f":"IF(Turma!$A$2=1,IF(VLOOKUP(\"x\",Turma!$B$4:$G$53,3,0)=\"Menina\",tblMLS!AD2,tblMLS!AD170),\"\")","v":95.281999999999996},{"$f":"IF(Turma!$A$2=1,IF(VLOOKUP(\"x\",Turma!$B$4:$G$53,3,0)=\"Menina\",tblMLS!AE2,tblMLS!AE170),\"\")","v":100.05500000000001},{"$f":"IF(Turma!$A$2=1,IF(VLOOKUP(\"x\",Turma!$B$4:$G$53,3,0)=\"Menina\",tblMLS!AF2,tblMLS!AF170),\"\")","v":104.828},{"$f":"IF(Turma!$A$2=1,IF(VLOOKUP(\"x\",Turma!$B$4:$G$53,3,0)=\"Menina\",tblMLS!AG2,tblMLS!AG170),\"\")","v":109.602},{"$f":"IF(Turma!$A$2=1,IF(VLOOKUP(\"x\",Turma!$B$4:$G$53,3,0)=\"Menina\",tblMLS!AH2,tblMLS!AH170),\"\")","v":114.375},{"$f":"IF(Turma!$A$2=1,IF(VLOOKUP(\"x\",Turma!$B$4:$G$53,3,0)=\"Menina\",tblMLS!AI2,tblMLS!AI170),\"\")","v":119.148},{"$f":"IF(Turma!$A$2=1,IF(VLOOKUP(\"x\",Turma!$B$4:$G$53,3,0)=\"Menina\",tblMLS!AJ2,tblMLS!AJ170),\"\")","v":123.92100000000001}]
[62,"",{"$f":"IF(Turma!$A$2=1,IF(VLOOKUP(\"x\",Turma!$B$4:$G$53,3,0)=\"Menina\",tblMLS!AD3,tblMLS!AD171),\"\")","v":95.707999999999998},{"$f":"IF(Turma!$A$2=1,IF(VLOOKUP(\"x\",Turma!$B$4:$G$53,3,0)=\"Menina\",tblMLS!AE3,tblMLS!AE171),\"\")","v":100.514},{"$f":"IF(Turma!$A$2=1,IF(VLOOKUP(\"x\",Turma!$B$4:$G$53,3,0)=\"Menina\",tblMLS!AF3,tblMLS!AF171),\"\")","v":105.32},{"$f":"IF(Turma!$A$2=1,IF(VLOOKUP(\"x\",Turma!$B$4:$G$53,3,0)=\"Menina\",tblMLS!AG3,tblMLS!AG171),\"\")","v":110.126},{"$f":"IF(Turma!$A$2=1,IF(VLOOKUP(\"x\",Turma!$B$4:$G$53,3,0)=\"Menina\",tblMLS!AH3,tblMLS!AH171),\"\")","v":114.932},{"$f":"IF(Turma!$A$2=1,IF(VLOOKUP(\"x\",Turma!$B$4:$G$53,3,0)=\"Menina\",tblMLS!AI3,tblMLS!AI171),\"\")","v":119.738},{"$f":"IF(Turma!$A$2=1,IF(VLOOKUP(\"x\",Turma!$B$4:$G$53,3,0)=\"Menina\",tblMLS!AJ3,tblMLS!AJ171),\"\")","v":124.54300000000001}]
[63,"",{"$f":"IF(Turma!$A$2=1,IF(VLOOKUP(\"x\",Turma!$B$4:$G$53,3,0)=\"Menina\",tblMLS!AD4,tblMLS!AD172),\"\")","v":96.13},{"$f":"IF(Turma!$A$2=1,IF(VLOOKUP(\"x\",Turma!$B$4:$G$53,3,0)=\"Menina\",tblMLS!AE4,tblMLS!AE172),\"\")","v":100.968},{"$f":"IF(Turma!$A$2=1,IF(VLOOKUP(\"x\",Turma!$B$4:$G$53,3,0)=\"Menina\",tblMLS!AF4,tblMLS!AF172),\"\")","v":105.807},{"$f":"IF(Turma!$A$2=1,IF(VLOOKUP(\"x\",Turma!$B$4:$G$53,3,0)=\"Menina\",tblMLS!AG4,tblMLS!AG172),\"\")","v":110.645},{"$f":"IF(Turma!$A$2=1,IF(VLOOKUP(\"x\",Turma!$B$4:$G$53,3,0)=\"Menina\",tblMLS!AH4,tblMLS!AH172),\"\")","v":115.48399999999999},{"$f":"IF(Turma!$A$2=1,IF(VLOOKUP(\"x\",Turma!$B$4:$G$53,3,0)=\"Menina\",tblMLS!AI4,tblMLS!AI172),\"\")","v":120.322},{"$f":"IF(Turma!$A$2=1,IF(VLOOKUP(\"x\",Turma!$B$4:$G$53,3,0)=\"Menina\",tblMLS!AJ4,tblMLS!AJ172),\"\")","v":125.161}]
[64,"",{"$f":"IF(Turma!$A$2=1,IF(VLOOKUP(\"x\",Turma!$B$4:$G$53,3,0)=\"Menina\",tblMLS!AD5,tblMLS!AD173),\"\")","v":96.546999999999997},{"$f":"IF(Turma!$A$2=1,IF(VLOOKUP(\"x\",Turma!$B$4:$G$53,3,0)=\"Menina\",tblMLS!AE5,tblMLS!AE173),\"\")","v":101.41800000000001},{"$f":"IF(Turma!$A$2=1,IF(VLOOKUP(\"x\",Turma!$B$4:$G$53,3,0)=\"Menina\",tblMLS!AF5,tblMLS!AF173),\"\")","v":106.289},{"$f":"IF(Turma!$A$2=1,IF(VLOOKUP(\"x\",Turma!$B$4:$G$53,3,0)=\"Menina\",tblMLS!AG5,tblMLS!AG173),\"\")","v":111.16},{"$f":"IF(Turma!$A$2=1,IF(VLOOKUP(\"x\",Turma!$B$4:$G$53,3,0)=\"Menina\",tblMLS!AH5,tblMLS!AH173),\"\")","v":116.03100000000001},{"$f":"IF(Turma!$A$2=1,IF(VLOOKUP(\"x\",Turma!$B$4:$G$53,3,0)=\"Menina\",tblMLS!AI5,tblMLS!AI173),\"\")","v":120.902},{"$f":"IF(Turma!$A$2=1,IF(VLOOKUP(\"x\",Turma!$B$4:$G$53,3,0)=\"Menina\",tblMLS!AJ5,tblMLS!AJ173),\"\")","v":125.773}]
[65,"",{"$f":"IF(Turma!$A$2=1,IF(VLOOKUP(\"x\",Turma!$B$4:$G$53,3,0)=\"Menina\",tblMLS!AD6,tblMLS!AD174),\"\")","v":96.962999999999994},{"$f":"IF(Turma!$A$2=1,IF(VLOOKUP(\"x\",Turma!$B$4:$G$53,3,0)=\"Menina\",tblMLS!AE6,tblMLS!AE174),\"\")","v":101.86499999999999},{"$f":"IF(Turma!$A$2=1,IF(VLOOKUP(\"x\",Turma!$B$4:$G$53,3,0)=\"Menina\",tblMLS!AF6,tblMLS!AF174),\"\")","v":106.767},{"$f":"IF(Turma!$A$2=1,IF(VLOOKUP(\"x\",Turma!$B$4:$G$53,3,0)=\"Menina\",tblMLS!AG6,tblMLS!AG174),\"\")","v":111.67},{"$f":"IF(Turma!$A$2=1,IF(VLOOKUP(\"x\",Turma!$B$4:$G$53,3,0)=\"Menina\",tblMLS!AH6,tblMLS!AH174),\"\")","v":116.572},{"$f":"IF(Turma!$A$2=1,IF(VLOOKUP(\"x\",Turma!$B$4:$G$53,3,0)=\"Menina\",tblMLS!AI6,tblMLS!AI174),\"\")","v":121.474},{"$f":"IF(Turma!$A$2=1,IF(VLOOKUP(\"x\",Turma!$B$4:$G$53,3,0)=\"Menina\",tblMLS!AJ6,tblMLS!AJ174),\"\")","v":126.376}]
[66,"",{"$f":"IF(Turma!$A$2=1,IF(VLOOKUP(\"x\",Turma!$B$4:$G$53,3,0)=\"Menina\",tblMLS!AD7,tblMLS!AD175),\"\")","v":97.372},{"$f":"IF(Turma!$A$2=1,IF(VLOOKUP(\"x\",Turma!$B$4:$G$53,3,0)=\"Menina\",tblMLS!AE7,tblMLS!AE175),\"\")","v":102.306},{"$f":"IF(Turma!$A$2=1,IF(VLOOKUP(\"x\",Turma!$B$4:$G$53,3,0)=\"Menina\",tblMLS!AF7,tblMLS!AF175),\"\")","v":107.241},{"$f":"IF(Turma!$A$2=1,IF(VLOOKUP(\"x\",Turma!$B$4:$G$53,3,0)=\"Menina\",tblMLS!AG7,tblMLS!AG175),\"\")","v":112.175},{"$f":"IF(Turma!$A$2=1,IF(VLOOKUP(\"x\",Turma!$B$4:$G$53,3,0)=\"Menina\",tblMLS!AH7,tblMLS!AH175),\"\")","v":117.11},{"$f":"IF(Turma!$A$2=1,IF(VLOOKUP(\"x\",Turma!$B$4:$G$53,3,0)=\"Menina\",tblMLS!AI7,tblMLS!AI175),\"\")","v":122.044},{"$f":"IF(Turma!$A$2=1,IF(VLOOKUP(\"x\",Turma!$B$4:$G$53,3,0)=\"Menina\",tblMLS!AJ7,tblMLS!AJ175),\"\")","v":126.979}]
[67,"",{"$f":"IF(Turma!$A$2=1,IF(VLOOKUP(\"x\",Turma!$B$4:$G$53,3,0)=\"Menina\",tblMLS!AD8,tblMLS!AD176),\"\")","v":97.78},{"$f":"IF(Turma!$A$2=1,IF(VLOOKUP(\"x\",Turma!$B$4:$G$53,3,0)=\"Menina\",tblMLS!AE8,tblMLS!AE176),\"\")","v":102.745},{"$f":"IF(Turma!$A$2=1,IF(VLOOKUP(\"x\",Turma!$B$4:$G$53,3,0)=\"Menina\",tblMLS!AF8,tblMLS!AF176),\"\")","v":107.711},{"$f":"IF(Turma!$A$2=1,IF(VLOOKUP(\"x\",Turma!$B$4:$G$53,3,0)=\"Menina\",tblMLS!AG8,tblMLS!AG176),\"\")","v":112.67700000000001},{"$f":"IF(Turma!$A$2=1,IF(VLOOKUP(\"x\",Turma!$B$4:$G$53,3,0)=\"Menina\",tblMLS!AH8,tblMLS!AH176),\"\")","v":117.642},{"$f":"IF(Turma!$A$2=1,IF(VLOOKUP(\"x\",Turma!$B$4:$G$53,3,0)=\"Menina\",tblMLS!AI8,tblMLS!AI176),\"\")","v":122.608},{"$f":"IF(Turma!$A$2=1,IF(VLOOKUP(\"x\",Turma!$B$4:$G$53,3,0)=\"Menina\",tblMLS!AJ8,tblMLS!AJ176),\"\")","v":127.574}]
[68,"",{"$f":"IF(Turma!$A$2=1,IF(VLOOKUP(\"x\",Turma!$B$4:$G$53,3,0)=\"Menina\",tblMLS!AD9,tblMLS!AD177),\"\")","v":98.183999999999997},{"$f":"IF(Turma!$A$2=1,IF(VLOOKUP(\"x\",Turma!$B$4:$G$53,3,0)=\"Menina\",tblMLS!AE9,tblMLS!AE177),\"\")","v":103.181},{"$f":"IF(Turma!$A$2=1,IF(VLOOKUP(\"x\",Turma!$B$4:$G$53,3,0)=\"Menina\",tblMLS!AF9,tblMLS!AF177),\"\")","v":108.17700000000001},{"$f":"IF(Turma!$A$2=1,IF(VLOOKUP(\"x\",Turma!$B$4:$G$53,3,0)=\"Menina\",tblMLS!AG9,tblMLS!AG177),\"\")","v":113.17400000000001},{"$f":"IF(Turma!$A$2=1,IF(VLOOKUP(\"x\",Turma!$B$4:$G$53,3,0)=\"Menina\",tblMLS!AH9,tblMLS!AH177),\"\")","v":118.17100000000001},{"$f":"IF(Turma!$A$2=1,IF(VLOOKUP(\"x\",Turma!$B$4:$G$53,3,0)=\"Menina\",tblMLS!AI9,tblMLS!AI177),\"\")","v":123.167},{"$f":"IF(Turma!$A$2=1,IF(VLOOKUP(\"x\",Turma!$B$4:$G$53,3,0)=\"Menina\",tblMLS!AJ9,tblMLS!AJ177),\"\")","v":128.16399999999999}]
{"$rows_left_out":161}
{"sheet":"tblMLS","index":4,"n_rows":337,"n_cols":37,"rows_kept":337,"cut":false,"hidden":true,"merged":[]}
["idLMS","variavel","genero","meses","L","M","S","StDev","P01","P1","P3","P5","P10","P15","P25","P50","P75","P85","P90","P95","P97","P99","P999","L","M","S","StDev","SD5neg","SD4neg","SD3neg","SD2neg","SD1neg","SD0","SD1","SD2","SD3","SD4"]
[1,"altura","menina",61,1,109.602,4.3549999999999998E-2,4.7731000000000003,94.850999999999999,98.498000000000005,100.624,101.75,103.485,104.655,106.38200000000001,109.602,112.821,114.54900000000001,115.71899999999999,117.453,118.57899999999999,120.706,124.352,1,109.6016,4.3549999999999998E-2,4.7731000000000003,85.736000000000004,90.509,95.281999999999996,100.05500000000001,104.828,109.602,114.375,119.148,123.92100000000001,128.69399999999999]
[2,"altura","menina",62,1,110.126,4.3639999999999998E-2,4.8059000000000003,95.274000000000001,98.945999999999998,101.087,102.221,103.967,105.145,106.884,110.126,113.367,115.107,116.285,118.03100000000001,119.16500000000001,121.306,124.977,1,110.1258,4.3639999999999998E-2,4.8059000000000003,86.096000000000004,90.902000000000001,95.707999999999998,100.514,105.32,110.126,114.932,119.738,124.54300000000001,129.34899999999999]
[3,"altura","menina",63,1,110.645,4.3729999999999998E-2,4.8384999999999998,95.692999999999998,99.388999999999996,101.545,102.68600000000001,104.444,105.63,107.38200000000001,110.645,113.90900000000001,115.66,116.846,118.604,119.745,121.901,125.59699999999999,1,110.6451,4.3729999999999998E-2,4.8384999999999998,86.453000000000003,91.290999999999997,96.13,100.968,105.807,110.645,115.48399999999999,120.322,125.161,129.999]
[4,"altura","menina",64,1,111.16,4.3819999999999998E-2,4.8710000000000004,96.106999999999999,99.828000000000003,101.998,103.14700000000001,104.917,106.111,107.874,111.16,114.44499999999999,116.208,117.402,119.172,120.321,122.491,126.212,1,111.1596,4.3819999999999998E-2,4.8710000000000004,86.805000000000007,91.676000000000002,96.546999999999997,101.41800000000001,106.289,111.16,116.03100000000001,120.902,125.773,130.64400000000001]
[5,"altura","menina",65,1,111.67,4.3900000000000002E-2,4.9023000000000003,96.52,100.265,102.449,103.60599999999999,105.387,106.589,108.363,111.67,114.976,116.751,117.952,119.733,120.89,123.074,126.819,1,111.6696,4.3900000000000002E-2,4.9023000000000003,87.158000000000001,92.06,96.962999999999994,101.86499999999999,106.767,111.67,116.572,121.474,126.376,131.279]
[6,"altura","menina",66,1,112.175,4.3990000000000001E-2,4.9345999999999997,96.926000000000002,100.696,102.89400000000001,104.059,105.851,107.06100000000001,108.84699999999999,112.175,115.504,117.29,118.499,120.292,121.456,123.655,127.42400000000001,1,112.17529999999999,4.3990000000000001E-2,4.9345999999999997,87.501999999999995,92.436999999999998,97.372,102.306,107.241,112.175,117.11,122.044,126.979,131.91399999999999]
[7,"altura","menina",67,1,112.67700000000001,4.4069999999999998E-2,4.9657,97.331999999999994,101.125,103.337,104.509,106.313,107.53,109.327,112.67700000000001,116.026,117.82299999999999,119.04,120.84399999999999,122.01600000000001,124.229,128.02199999999999,1,112.6767,4.4069999999999998E-2,4.9657,87.847999999999999,92.813999999999993,97.78,102.745,107.711,112.67700000000001,117.642,122.608,127.574,132.53899999999999]
[8,"altura","menina",68,1,113.17400000000001,4.4150000000000002E-2,4.9965999999999999,97.733000000000004,101.55,103.776,104.955,106.771,107.995,109.804,113.17400000000001,116.544,118.35299999999999,119.577,121.393,122.572,124.798,128.61500000000001,1,113.17400000000001,4.4150000000000002E-2,4.9965999999999999,88.191000000000003,93.186999999999998,98.183999999999997,103.181,108.17700000000001,113.17400000000001,118.17100000000001,123.167,128.16399999999999,133.161]
[9,"altura","menina",69,1,113.667,4.4229999999999998E-2,5.0274999999999999,98.131,101.971,104.212,105.398,107.224,108.45699999999999,110.276,113.667,117.05800000000001,118.878,120.11,121.937,123.123,125.363,129.203,1,113.66719999999999,4.4229999999999998E-2,5.0274999999999999,88.53,93.557000000000002,98.584999999999994,103.61199999999999,108.64,113.667,118.69499999999999,123.72199999999999,128.75,133.77699999999999]
{"$rows_left_out":327}